{"text_format":"1","workbook":"xlsx","n_sheets":30,"sheets":["to be hidden","Sommaire","Résultats expliqués","Rappel sur les feuilles de donn","D1 Données générales","D2 Echelle","D3 Données épi. démo","D4 Prix","W6with comments","D5 Salaires","D6 Fournitures fixes","D7 Fréquence des livraisons","D8 Statistiques","D9 Variables temps","Rappel sur les résultats","R1 Main-d'oeuvres","R2 Transport","R3 Fournitures","R4 Espace","R5 Récapitulatif financier","R6 Niveau group-zones et centre","R7 Gestion au siège de la zone","R8 Traitement (main-d'oeuvres)","R9 Traitement (médicaments)","R10 Traitement (fournitures)","R11 Logistique approvisionnemen","R12 Formation","R13 Supervision","R14 Extension communautaire","to be removed "],"not_rendered":{"charts":0,"images":6,"macros":1,"external_links":1,"defined_names":76,"comments":1,"pivot_tables":0},"unopened":[],"bounds":{"document_bytes":16777216,"sheet_cells":100000,"rows_first":2000,"rows_last":500,"rows_between":2000,"halvings":0,"cell_chars":16384,"cell_head_chars":4096},"cells_cut":0,"cells_raw":0,"read":"whole","date_system":"1900"}

{"sheet":"to be hidden","index":0,"n_rows":27,"n_cols":11,"rows_kept":27,"cut":false,"hidden":true,"merged":[]}
[null,"Master message list"]
[]
[null,"message1","fill in"]
[null,"message2","leave empty"]
[null,"message3","Zeros in this column"]
[null,"message4","Complete this column"]
[null,"message5","OUTsites"]
[null,"message6","Insites"]
[null,"message7","Outsites & Insites"]
[null,"message8","Total    participating in CMAM that year"]
[null,"message9","More areas"]
[null,"message10","èè"]
[null,"message11","C O S  T S "]
[null,"message12","Q U A N T I T I E S"]
[null,"message13","Calculations   "]
[null,"message13b","(To see calculations click on [+] in column 1)."]
[null,"message13c","(To hide calculations click on [-] in column 1 at the end of the table)."]
[null,"message14","Annual costs of this activity"]
[null,"message15","Quantities of inputs needed for this activity"]
[null,"message16","Basic drivers, raw data"]
[null,"message17","CALCULATIONS"]
[null,"message18","Prices"]
[null,"message19","zeros only below"]
[null,"mess20","Units"]
[null,"mess21","Comments",null,null,null,null,null,null,null,"check if \"established\" should actually refer to \"all\""]
[null,"mess22","Variable"]
[null,"mess23","Value"]

{"sheet":"Sommaire","index":1,"n_rows":51,"n_cols":8,"rows_kept":51,"cut":false,"hidden":false,"merged":[[1,1,2,10],[6,1,6,2],[7,1,7,2],[8,1,8,2],[7,7,12,10],[10,1,10,2],[11,1,11,2],[9,1,9,2],[12,1,12,2],[16,1,16,3],[22,0,50,0],[22,5,22,10],[34,1,34,3],[35,4,38,4],[41,1,41,3],[35,5,39,11],[42,5,50,11],[19,5,20,8]]}
[]
[null,"Outil de calcul des coûts PCMA pour déterminer les coûts de la prise en charge \nà base communautaire de la malnutrition aiguë (PCMA) \naux niveaux national, sous-national et de district"]
[]
[]
[]
[null,"Clé des codes de couleurs et symboles",null,null,null,null,"  Voir le Guide de l' Utilisateur pour une aide sur l'utilisation de cet Outil. "]
[null,"or",null,"u  Données fournies directement par l'utilisateur",null,null,null,"Version 1.1, février 2012"]
[null,"jaune",null,"Copiées de données fournies par l'utilisateur",null,null,null,"Cet outil a été préparé grâce au soutien généreux du peuple américain par le biais du soutien de l’Office de la santé, des maladies infectieuses et de la nutrition du Bureau de la santé globale et du Bureau pour l’assistance en cas de catastrophes à l’étranger du Bureau pour la démocratie, la gestion des conflits et l’assistance humanitaire (DCHA/OFDA), Agence des Etats-Unis pour le développement international (USAID), aux termes de l’accord coopératif AID-OAA-A-11-00014, par l’intermédiaire du Projet d’assistance technique à l’alimentation et à la nutrition (FANTA), mis en œuvre par FHI 360. \n\nLe contenu incombe à FHI 360 et ne reflète pas forcément les vues de l’USAID ou du Gouvernement des Etats-Unis."]
[null,"vert foncé",null,"n  Données fournies directement par l'Outil (peuvent être ajustées par l'Utilisateur)"]
[null,"vert clair",null,"Copiées des données fournies par l'Outil (ou par l'Utilisateur)"]
[null,"violet",null,"Calculs faits par l'Outil"]
[null,"bleu",null,"Hyperlien pour se connecter ailleurs dans la Fiche de travail"]
[null,"rouge",null,"Problèmes à résoudre"]
[null,null,null,null,null,null,null,"  "]
[null,"TITRES ET DESCRIPTIONS DES FEUILLES DE CALCUL"]
[]
[null,"Numéros et noms des feuilles de calcul",null,null,null,"Description des feuilles de calcul"]
[]
[null,"INTRODUCTION"]
[null,null,null,"Sommaire"]
[null,null,null,"Résultats expliqués"]
[]
[null,"DONNÉES",null,null,null,"Les feuilles de calcul D1 à D9 présentent toutes les hypothèses à la base des calculs indiqués dans les feuilles de calcul (R1 à R14) y compris les données entrées par l'utilisateur sur :"]
[]
[null,null,"D1","Données générales",null,"Termes et portée spécifiques au pays du service/programme de la PCMA"]
[null,null,"D2","Echelle",null,"Taille du service/programme planifié de la PCMA"]
[null,null,"D3","Données épidémiologiques, démographiques et de services",null,"Epidémiologie de la malnutrition, démographie de la population, données sur les services de la PCMA"]
[null,null,"D4","Prix (non compris les salaires et les \"fournitures fixes\")",null,"Prix de tous les intrants clés non compris la main-d'œuvre  (salaires) et certaines fournitures fixes"]
[null,null,"D5","Salaires",null,"Salaires des principales catégories de personnel"]
[null,null,"D6","Fournitures fixes (pour sites PEC MAS amb et hosp)",null,"Prix des fournitures livrées en quantités fixes dans les sites de traitement"]
[null,null,"D7","Fréquence des livraisons de l'aliment thérapeutique",null,"Nombre de livraisons chaque année d'ATPE et autre aliment thérapeutique aux divers niveaux "]
[null,null,"D8","Statistiques au niveau groupe-zones et niveau central",null,"Variables au niveau plus élevé (groupe-zones et central)"]
[null,null,"D9","Variables changeantes dans le temps",null,"Année pour laquelle est faite l'analyse"]
[]
[null,"RÉSULTATS  (intrants et finances nécessaires pour la PCMA)                                                     ",null,null,null,"Ces feuilles de calcul ne demandent pas de données de la part de l'utilisateur"]
[null,null,"R1","Besoins annuels en main-d'œuvre pour la PCMA",null,"Les feuilles de calcul R1 à R4 présentent les résultats indiquant, pour chacun des types clés d'intrant (main-d'œuvre, transport, fournitures et espace), ce que demande le service/programme de la PCMA pour l'année spécifiée dans la feuille de calcul D9. Les résultats sont dérivés des calculs dans les feuilles de calcul R6 à R14. "]
[null,null,"R2","Besoins annuels en transports pour la PCMA"]
[null,null,"R3","Besoins annuels en fournitures pour la PCMA"]
[null,null,"R4","Besoins annuels en espace pour la PCMA"]
[null,null,"R5","Récapitulatif financier"]
[]
[null,"RÉSULTATS (intrants et finances nécessaires pour chaque activité de la PCMA)",null,null,null,"Ces feuilles de calcul ne demandent pas de données de la part de l'utilisateur"]
[null,null,"R6","Activités au niveau central et du groupe-zones",null,"Ces feuilles de calcul R6 à R14  présentent les résultats du point de vue quantités et valeurs des ressources nécessaires (pour l'année spécifiée sur la feuille D9) pour chacune des activités clés - gestion au siège, traitement (prise en charge des cas), logistique de l'approvisionnement (transport et stockage des fournitures), formation, supervision et extension communautaire. Toutes les activités réalisées à un niveau plus élevé (sièges du groupe-zones et du niveau central) - à savoir gestion, formation et logistique de l'approvisionnement - sont regroupées dans une seule feuille de calcul (R6). Les activités se déroulant au siège de la zone ou en dessous sont traitées dans des feuilles de calcul séparées (avec 'Traitement' sous-divisé à toutes fins pratiques en trois feuilles de calcul pour chacun des intrants clés - main-d'œuvre et espace, fournitures médicales et autres fournitures).  "]
[null,null,"R7","Gestion de la PCMA au siège de la zone"]
[null,null,"R8","Traitement (main-d'œuvre et espace)"]
[null,null,"R9","Traitement (fournitures médicales)"]
[null,null,"R10","Traitement (autres fournitures)"]
[null,null,"R11","Logistique de l'approvisionnement"]
[null,null,"R12","Formation"]
[null,null,"R13","Supervision"]
[null,null,"R14","Extension communautaire"]

{"sheet":"Résultats expliqués","index":2,"n_rows":37,"n_cols":15,"rows_kept":37,"cut":false,"hidden":false,"merged":[[13,3,13,15],[5,5,5,6],[23,3,23,15]]}
[]
[null,"RÉSULTATS EXPLIQUÉS"]
[]
[null,null,null,"Quel est le type d'information que l'Outil apportera sur les besoins en ressources pour la PCMA ? En voici des exemples."]
[]
[null,null,null,null,null,"Pour l'année ",null,{"$f":"+'D9 Variables temps'!I6-1+'D9 Variables temps'!I10","v":2011},null,null,null,null,null,"Quantités","Unités"]
[null,null,null,null,"Quelle est la quantité d'ATPE nécessaire ?",null,null,null,null,null,null,null,null,{"$f":"+'R3 Fournitures'!F17","v":1993.5712500000002},"kg"]
[null,null,null,null,"De combien de temps auront besoin les agents de santé dans les sites PEC MAS ambulatoire ?",null,null,null,null,null,null,null,null,{"$f":"+'R1 Main-d''oeuvres'!F23+'R1 Main-d''oeuvres'!F31","v":3.671153846153846},"années équivalents plein temps"]
[null,null,null,null,"Combien d'argent faudra-t-il pour les rafraîchissements ?",null,null,null,null,null,null,null,null,{"$f":"+('R3 Fournitures'!F59+'R3 Fournitures'!F60+'R3 Fournitures'!F61+'R3 Fournitures'!F62+'R3 Fournitures'!F63)*'D4 Prix'!F26","v":2712},{"$f":"+IF('D1 Données générales'!$H$13=\"\",\"\",'D1 Données générales'!$H$13)","v":"Cedi"}]
[null,null,null,null,"Quelle est la distance qui sera couverte pour le transport de l'aliment thérapeutique ?",null,null,null,null,null,null,null,null,{"$f":"+SUM('R2 Transport'!E21+'R2 Transport'!E26+'R2 Transport'!E31)","v":192},"km"]
[null,null,null,null,"Quel est le coût pour fournir des médicaments adéquats aux enfants avec MAS ? ",null,null,null,null,null,null,null,null,{"$f":"+'R5 Récapitulatif financier'!P24","v":1312.35},{"$f":"+IF('D1 Données générales'!$H$13=\"\",\"\",'D1 Données générales'!$H$13)","v":"Cedi"}]
[null,null,null,null,"Quel est l'espace nécessaire au siège de la zone pour stocker l'ATPE ?",null,null,null,null,null,null,null,null,{"$f":"+SUM('R4 Espace'!E17:E21)","v":1.2180470886718748},"m3"]
[]
[null,null,null,"Pour trouver les réponses à ces questions, vous devez fournir des informations sur votre service/programme planifié de PCMA (entrées dans les cellules couleur ou à partir des feuilles de calcul D1 à D9). Des instructions détaillées sont données au haut de chaque feuille et une aide supplémentaire est donnée dans le Guide de l'Utilisateur."]
[]
[null,null,null,"Et vous pouvez en savoir plus sur . . .",null,null,null,null,null,null,null,null,null,"Aller à la feuille de travail .."]
[null,null,null,null,null,"Le type de personnel utilisé pour la PCMA ? Ce qu'ils vont faire ?",null,null,null,null,null,null,null,"R1   Main-d'oeuvres"]
[null,null,null,null,null,"Pourquoi tous ces transports sont-ils nécessaires ?",null,null,null,null,null,null,null,"R2    Transport"]
[null,null,null,null,null,"Pourquoi et à qui offrir des rafraîchissements ? ",null,null,null,null,null,null,null,"R3    Fournitures"]
[null,null,null,null,null,"Quel est l'espace de stockage dans les sites PEC/MAS ambulatoire et hospitalière ?",null,null,null,null,null,null,null,"R4    Espace"]
[null,null,null,null,null,"Quelles sont les zones qui ont besoin de plus d'attention de la part d'un niveau de gestion plus élevé?",null,null,null,null,null,null,null,"R6    Central activités"]
[null,null,null,null,null,"Quelles sont les ressources nécessaires pour apporter une formation adéquate ? ",null,null,null,null,null,null,null,"R12   Formation"]
[]
[null,null,null,"Les coûts de la PCMA sont organisés de deux manières -intrants et activités. Le tableau ci-après montre comment ils sont reliés et et quel est le type d'intrant pour les diverses activités : les commentaires (qui apparaissent quand le curseur se trouve sur la cellule pertinente) apportent des exemples spécifiques. Le tableau identifie également la feuille de travail dans laquelle sont récapitulés les résultats (avec l'hyperlien pour s'y rendre)."]
[]
[null,null,null,null,null,null,"Intrants"]
[null,null,null,null,null,"Main-d'œuvre","Transport","Fournitures","Espace","TOUS",null,"Activités"]
[null,null,null,null,null,"R1","R2","R3","R4","R5","TOUTES"]
[null,null,null,null,null,"*****","*****",null,null,"R6","Gestion PCMA (Groupe-zones et niveau central)"]
[null,null,null,null,null,"*****","*****",null,null,"R7","Gestion PCMA (niveau zone)"]
[null,null,null,null,null,"*****",null,null,"*****","R8","Traitement (main-d'oeuvre)"]
[null,null,null,null,null,null,null,"*****",null,"R9","Traitement (fournitures médicales)"]
[null,null,null,null,null,null,"*****","*****",null,"R10","Traitement (autres fournitures)"]
[null,null,null,null,null,"*****","*****","*****","*****","R11","Logistique de l'approvisionnement"]
[null,null,null,null,null,"*****","******","*****","*****","R12","Formation"]
[null,null,null,null,null,"*****","*****","*****",null,"R13","Supervision"]
[null,null,null,null,null,"*****",null,null,null,"R14","Extension communautaire"]

{"sheet":"Rappel sur les feuilles de donn","index":3,"n_rows":9,"n_cols":2,"rows_kept":9,"cut":false,"hidden":false,"merged":[]}
[]
[null,"Rappel sur les feuilles de calcul avec entrées de données [D1 à D9]"]
[]
[null,"Les sept feuilles de calcul suivantes (D1 à D9) présentent les données de base  dont"]
[null,"sont tirés les calculs subséquents des ressources nécessaires et des coûts."]
[]
[null,"L'utilisateur doit remplir les cellules en or (chercher u dans les lignes qui ont des cellules d'entrée)."]
[]
[null,"L'utilisateur peut changer les hypothèses sur les données de l'Outil (chercher les cellules vert foncé et le symbole n)."]

{"sheet":"D1 Données générales","index":4,"n_rows":53,"n_cols":9,"rows_kept":53,"cut":false,"hidden":false,"merged":[[21,5,21,7],[40,6,40,7],[19,5,19,7],[34,2,34,5],[32,2,32,5],[30,2,30,5],[20,5,20,7],[23,5,23,7],[34,6,34,7],[25,2,25,5],[22,5,22,7],[35,6,35,7],[39,6,39,7],[36,6,36,7],[37,6,37,7],[38,6,38,7],[38,3,40,4],[29,2,29,5],[27,2,27,5],[52,5,52,7],[51,5,51,7],[42,6,42,7],[50,5,50,7],[49,2,49,7],[44,2,44,5],[41,6,41,7],[8,1,8,5],[17,2,17,6],[15,3,15,6],[10,2,10,4],[12,3,12,6],[13,3,13,6],[14,3,14,6]]}
[]
["Retour au sommaire",null," D1:   Données générales"]
[]
[null,"Effacez dans cette Feuille de calcul toute donnée entrée d'une application précédente de cet Outil en pressan ce bouton ……….."]
[]
[null,"REMPLIR cette Feuille de calcul (D1) avant de passer aux feuilles suivantes : les chiffres que vous allez noter ici influenceront la tailler et la forme de certaines autres feuilles de calcul. "]
[]
[]
[null,"NOTEZ dans les cellules couleur or les réponses aux 9 questions suivantes (chercher u):"]
[]
[null,1,"Nom du pays dans lequel le service/programme de la PCMA est mis en œuvre.",null,null,"Pays:",null,"Ghana","u"]
[]
[null,2,"Caractéristiques financières de base.","Monnaie locale (par exemple, dollars, cedi, shillings)",null,null,null,"Cedi","u"]
[null,null,null,"Année de base pour les prix (Utilisez l'année actuelle ou une année récente)",null,null,null,2010,"u"]
[null,null,null,"Taux de change (somme en monnaie locale pour un dollar américain)",null,null,null,1.43,"u"]
[null,null,null,"Type de prix que vous allez utiliser",null,null,null,"prix du marché","u"]
[]
[null,3,"Termes utilisés pour les differants niveaux du système sanitaire."]
[]
[null,null,"Types de niveaux","(Examples de termes possibles)","Le terme utilisé dans cet outil","Termes utilisés dans votre pays pour ces niveaux"]
[null,null,"Unité administrative de santé au niveau district ","(district)","Niveau zone","district",null,null,"u"]
[null,null,"Unité administrative de santé au niveau intermédiaire ","(état, province, région, etc.)","Groupe-zones","région",null,null,"u"]
[null,null,"Third lowest level administrative unit ","(state, province, region etc)","Group-Area-Collections",null,null,null,"u"]
[null,null,"Unité administrative de santé au niveau national ","(pays, nation)","Niveau central","national",null,null,"u"]
[]
[null,4,"Nombres d'années budgétisées (pour un maximum de 5 ans).",null,null,null,1,"u"]
[]
[null,5,"Première année calendaire du plan/budget de la PCMA.  (Point besoin que ce soit la première année de la mise en œuvre de la PCMA dans ce pays).",null,null,null,2011,"u"]
[]
[null,null,null,null,null,null,null,{"$f":"+G26+1","v":2}]
[null,6,"Nombre de zones dans le budget (maximum 10). Comptez toutes les zones pour lesquelles on budgétise, y compris celles où la PCMA est déjà établie ou celles qui commenceront pendant la période budgétisée ",null,null,null,1,"u"]
[]
[null,7,"Nombre de groupes-zones actifs, c'est-à-dire ceux comprenant des zones où les programmes/services de la PCMA sont budgétisés (maximum de 8, et pas plus que le nombre de zones (question 6) ou cela va être mis en évidence en rouge). ",null,null,null,1,"u"]
[]
[null,8,"Noms de ces groupes-zones actifs. (Point besoin de noter les noms des autres groupes-zones dans le pays.)",null,null,null,{"$f":"+IF($F$22=\"\",\"\",$F$22)","v":"région"},{"$f":"+IF($F$22=\"\",\"\",$F$22)","v":"région"}]
[null,null,null,null,null,null,"Greater Accra",null,"u"]
[null,null,null,null,null,null,null,null,"u"]
[null,null,null,null,null,null,null,null,"u"]
[null,null,null,"{Si les noms sont mis en évidence en rouge, vous avez noté les noms d'un plus grand nombre de groupe-zones que ceux que vous avez indiqués qui participeront (voir question 7)}.",null,null,null,null,"u"]
[null,null,null,null,null,null,null,null,"u"]
[null,null,null,null,null,null,null,null,"u"]
[null,null,null,null,null,null,null,null,"u"]
[null,null,null,null,null,null,null,null,"u"]
[]
[null,9,"La PCMA a-t-elle déjà été établie au niveau central (le terrain est déjà préparé pour la PCMA, liaison avec politiques et donateurs, mise en place des systèmes logistiques et d'information, préparation des directives, aides professionnelles, matériel de formation, plans d'étude et listes de vérification pour la supervision)  (oui/non).",null,null,null,"oui","u"]
[]
[]
[]
[]
[null,null,"HEALTH SERVICE PROVISION FACILITIES"]
[null,null,"Community/outreach services ","(village)","Community","community"]
[null,null,"All types of health facilities offering outpatient care for children with SAM. (Include facilities where inpatient care might also be provided).","(health/ primary/ auxiliary/sub/ centre)","Outpatient Care site (OC site)","CHPS, community health centers, community clinics, polyclinics"]
[null,null,"All types of health facilities offering inpatient care for SAM children. (Include facilities where outpatient care might also be provided).","(health centre, district, provincial, regional hospital)","Inpatient Care site (IC site)","hospitals, certain health centers"]

{"sheet":"D2 Echelle","index":5,"n_rows":84,"n_cols":18,"rows_kept":84,"cut":false,"hidden":false,"merged":[[3,19,3,24],[3,25,3,30],[22,23,22,30],[18,2,18,13],[4,2,4,6],[7,2,7,6],[6,18,6,23],[22,2,22,13],[15,22,15,25],[6,24,6,29],[1,2,1,4],[16,2,16,13],[21,2,21,10],[20,2,20,13],[11,2,11,7],[14,1,14,13],[6,2,6,7],[81,6,83,6],[30,26,33,26],[9,23,9,28],[11,23,11,30],[55,6,59,6],[40,6,44,6],[75,6,79,6],[45,6,49,6],[50,6,54,6],[70,6,74,6],[35,6,39,6],[65,6,69,6],[10,2,10,6],[30,6,34,6],[24,2,24,13],[60,6,64,6]]}
[]
["Retour au sommaire",null,"D2:  Échelle"]
[]
[null,"THESE ROWS ARE COPIED FROM PREVIOUS WORKSHEET because you cannot do conditional formatting using cells from other worksheets"]
[null,1,"RECORD here the number of years you wish to budget for (maximum 5).",null,null,null,null,null,{"$f":"+'D1 Données générales'!G26","v":1}]
[]
[null,null,"(This was the original reference - keep for convenience to avoid having to rename reference cells.  Hide this row",null,null,null,null,null,{"$f":"+I5+1","v":2}]
[null,2,"RECORD here the number of Areas to be included in the budgetary analysis (maximum 10).  Include Areas that begin functioning at any time during the period you wish to budget for. ",null,null,null,null,null,{"$f":"+'D1 Données générales'!G31","v":1}]
[]
[]
["Taken from D1 and hidden",3,"RECORD here the first year of the CMAM plan/budget.",null,null,null,null,null,{"$f":"'D1 Données générales'!G28","v":2011}]
[]
[null,"Effacez dans cette feuille de calcul toute donnée entrée d'une application précédente de cet Outil en pressant ce bouton ……….."]
[]
[null,"REMPLIR les cellules en or indiquées par u dans le Tableau suivant, qui est automatiquement structuré par l'Outil pour refléter le nombre de zones et les années budgétisées  (tel que notées dans la Feuille de calcul D1):"]
[]
[null,1,"Le nom de chaque zone budgétisée pour la période entière définie dans la Feuille de calcul (à côté de zone 1, zone 2, etc.). Rangez les zones en termes de leur importance pour le programme, notant en premier les zones où la PCMA est la plus importante. Ainsi, il sera plus facile par la suite d'enlever des zones de la PCMA pour manque de fonds. "]
[]
[null,2,"Le nom du groupe-zones auquel appartient chaque zone (voir Feuille de travail D1)."]
[null," "]
[null,3,"Le nombre de sites PEC MAS ambulatoire, de sites PEC MAS hospitalière et sites d'extension communautaire participant à la PCMA pour chaque zone. Inclure tous les sites actifs et pas simplement ceux nouvellement établis (à savoir ,(a) ceux qui ont déjà été établis lors d'années précédentes et qui continuent pendant cette anneé et (b) ceux qui seront nouvellement établis et ouverts cette année). Faites cela pour chacune des années budgétisées et pour une année avant cela  (notez les sites déjà établis avant la période pour laquelle vous budgétisez).",null,null,null,null,null,null,null,null,null,null,null,null,null,null,"size of row changed"]
[]
[null,4,"Le nombre de cas de MAS prévus dans la PEC MAS de chaque zone active pour les années budgétisées.  Voir la discussion en Annexe 2 du Guide l'Utilisateur pour des conseils sur la manière d'estimer cette variable importante."]
[]
[null,5,"Le nombre de sites PEC MAS ambulatoire actifs dans chaque zone pour chacune des années budgétisées."]
[]
[]
[null,null,{"$f":"+IF('D1 Données générales'!$H$11=\"\",\"\",'D1 Données générales'!$H$11)","v":"Ghana"}]
[null,null,null,null,null,4,null,null,"Année pré-budget","Année 1","Année 2","Année 3","Année 4","Année 5",null,null,null,"changed conditional formatting to reveal \"year 2 3 \" etc"]
[null,"Zones PCMA",{"$f":"+IF('D1 Données générales'!$F$21=\"\",\"\",'D1 Données générales'!$F$21)","v":"district"},{"$f":"+IF('D1 Données générales'!$F$22=\"\",\"\",'D1 Données générales'!$F$22)","v":"région"},{"$f":"+'D1 Données générales'!F23","v":0},"Year CMAM to start in this AREA",null,null,{"$f":"+IF($I$11=0,\"\",$I$11-1)","v":2010},{"$f":"+IF(I11=0,\"\",I11)","v":2011},{"$f":"+IF($I$11=0,\"\",$I$11+1)","v":2012},{"$f":"+IF($I$11=0,\"\",$I$11+2)","v":2013},{"$f":"+IF($I$11=0,\"\",$I$11+3)","v":2014},{"$f":"+IF($I$11=0,\"\",$I$11+4)","v":2015},null,null,null,"changed conditional formatting in coloumn H to reveal appropriately depending on number of Areas"]
[null,"Zone 1","Ashiedu Keteke","Greater Accra","Central ",1,"Total de sites pour cette année"]
[null,null,null,null,null,{"$f":"+IF(F31<F11,\"re-order areas\",\"\")","v":""},null,"Sites PEC MAS ambulatoire",2,2,null,null,null,null,"u"]
[null,null,null,null,null,null,null,"Sites PEC MAS hospitalière",1,1,null,null,null,null,"u"]
[null,null,null,null,null,null,null,"Cas MAS",null,150,null,null,null,null,"u"]
[null,null,null,null,null,null,null,"Sites extension communautaire",null,100,null,null,null,null,"u"]
[null,"Zone 2",null,null,"Central ",1,"Total de sites pour cette année"]
[null,null,null,null,null,{"$f":"+IF(F36<F31,\"re-order areas\",\"\")","v":""},null,"Sites PEC MAS ambulatoire",null,null,null,null,null,null,"u"]
[null,null,null,null,null,null,null,"Sites PEC MAS hospitalière",null,null,null,null,null,null,"u"]
[null,null,null,null,null,null,null,"Cas MAS",null,null,null,null,null,null,"u"]
[null,null,null,null,null,null,null,"Sites extension communautaire",null,null,null,null,null,null,"u"]
[null,"Zone 3",null,null,"Central ",1,"Total de sites pour cette année"]
[null,null,null,null,null,{"$f":"+IF(F41<F36,\"re-order areas\",\"\")","v":""},null,"Sites PEC MAS ambulatoire",null,null,null,null,null,null,"u"]
[null,null,null,null,null,null,null,"Sites PEC MAS hospitalière",null,null,null,null,null,null,"u"]
[null,null,null,null,null,null,null,"Cas MAS",null,null,null,null,null,null,"u"]
[null,null,null,null,null,null,null,"Sites extension communautaire",null,null,null,null,null,null,"u"]
[null,"Zone 4",null,null,"Oz",1,"Total de sites pour cette année"]
[null,null,null,null,null,{"$f":"+IF(F46<F41,\"re-order areas\",\"\")","v":""},null,"Sites PEC MAS ambulatoire",null,null,null,null,null,null,"u"]
[null,null,null,null,null,null,null,"Sites PEC MAS hospitalière",null,null,null,null,null,null,"u"]
[null,null,null,null,null,null,null,"Cas MAS",null,null,null,null,null,null,"u"]
[null,null,null,null,null,null,null,"Sites extension communautaire",null,null,null,null,null,null,"u"]
[null,"Zone 5",null,null,"NZ",1,"Total de sites pour cette année"]
[null,null,null,null,null,{"$f":"+IF(F51<F46,\"re-order areas\",\"\")","v":""},null,"Sites PEC MAS ambulatoire",null,null,null,null,null,null,"u"]
[null,null,null,null,null,null,null,"Sites PEC MAS hospitalière",null,null,null,null,null,null,"u"]
[null,null,null,null,null,null,null,"Cas MAS",null,null,null,null,null,null,"u"]
[null,null,null,null,null,null,null,"Sites extension communautaire",null,null,null,null,null,null,"u"]
[null,"Zone 6",null,null,"NZ",1,"Total de sites pour cette année"]
[null,null,null,null,null,{"$f":"+IF(F56<F51,\"re-order areas\",\"\")","v":""},null,"Sites PEC MAS ambulatoire",null,null,null,null,null,null,"u"]
[null,null,null,null,null,null,null,"Sites PEC MAS hospitalière",null,null,null,null,null,null,"u"]
[null,null,null,null,null,null,null,"Cas MAS",null,null,null,null,null,null,"u"]
[null,null,null,null,null,null,null,"Sites extension communautaire",null,null,null,null,null,null,"u"]
[null,"Zone 7",null,null,"NZ",1,"Total de sites pour cette année"]
[null,null,null,null,null,{"$f":"+IF(F61<F56,\"re-order areas\",\"\")","v":""},null,"Sites PEC MAS ambulatoire",null,null,null,null,null,null,"u"]
[null,null,null,null,null,null,null,"Sites PEC MAS hospitalière",null,null,null,null,null,null,"u"]
[null,null,null,null,null,null,null,"Cas MAS",null,null,null,null,null,null,"u"]
[null,null,null,null,null,null,null,"Sites extension communautaire",null,null,null,null,null,null,"u"]
[null,"Zone 8",null,null,"NZ",1,"Total de sites pour cette année"]
[null,null,null,null,null,{"$f":"+IF(F66<F61,\"re-order areas\",\"\")","v":""},null,"Sites PEC MAS ambulatoire",null,null,null,null,null,null,"u"]
[null,null,null,null,null,null,null,"Sites PEC MAS hospitalière",null,null,null,null,null,null,"u"]
[null,null,null,null,null,null,null,"Cas MAS",null,null,null,null,null,null,"u"]
[null,null,null,null,null,null,null,"Sites extension communautaire",null,null,null,null,null,null,"u"]
[null,"Zone 9",null,null,"Ind",1,"Total de sites pour cette année"]
[null,null,null,null,null,{"$f":"+IF(F71<F66,\"re-order areas\",\"\")","v":""},null,"Sites PEC MAS ambulatoire",null,null,null,null,null,null,"u"]
[null,null,null,null,null,null,null,"Sites PEC MAS hospitalière",null,null,null,null,null,null,"u"]
[null,null,null,null,null,null,null,"Cas MAS",null,null,null,null,null,null,"u"]
[null,null,null,null,null,null,null,"Sites extension communautaire",null,null,null,null,null,null,"u"]
[null,"Zone 10",null,null,"Ind",1,"Total de sites pour cette année"]
[null,null,null,null,null,{"$f":"+IF(F76<F71,\"re-order areas\",\"\")","v":""},null,"Sites PEC MAS ambulatoire",null,null,null,null,null,null,"u"]
[null,null,null,null,null,null,null,"Sites PEC MAS hospitalière",null,null,null,null,null,null,"u"]
[null,null,null,null,null,null,null,"Cas MAS",null,null,null,null,null,null,"u"]
[null,null,null,null,null,null,null,"Sites extension communautaire",null,null,null,null,null,null,"u"]
[]
["perhaps delete these?",null,null,null,null,null,"Total    participating that year","OCsites"]
[null,null,null,null,null,null,null,"ICsites"]
[null,null,null,null,null,{"$f":"+IF(I46=\"yes\",#REF!,\"\")","v":""},null,"SAM cases"]

{"sheet":"D3 Données épi. démo","index":6,"n_rows":218,"n_cols":19,"rows_kept":218,"cut":false,"hidden":false,"merged":[[1,2,1,4],[162,2,162,4],[8,2,8,4],[10,2,10,5],[12,2,12,5],[134,4,137,4],[132,2,132,4],[19,9,19,17],[21,4,24,4],[122,4,131,4],[104,2,104,4],[96,3,97,3],[93,3,94,3]]}
[]
["Retour au sommaire",null,"D3:  Données épidémiologiques, démographiques et de services/programmes "]
[]
[]
[null,null,"Effacez dans cette Feuille toute donnée entrée d'une application précédente de cet Outil en pressant sur le bouton ……….."]
[]
[null,"Number of Areas included in study",null,{"$f":"+'D2 Echelle'!I8","v":1},"  (taken from Worksheet 2)",null,null,null,null,"2.      Review the default assumptions in the dark green cells and change if necessary. But read Part Four of this Guide first.  Change the light green cells if the User is aware of differences among the Areas in specific variables."]
[]
[null,1,"REMPLIR les données demandées dans le tableau ci-après. Remplir les cellules en or uniquement indiquées par  u. Si ce sont des articles dont vous savez qu'ils n'apparaîtront pas dans votre programme/service de PCMA, mettez  \"0\" dans la cellule pertinente. (Ne PAS mettre \"0\" pour indiquer que vous ne payez pas cet l'article, qu'il est gratuit. Pour ces articles, vous pouvez choisir de noter leur PRIX comme \"0\"; voir Feuille de calcul D4.). "]
[]
[null,2,"(Facultatif). REVOIR les valeurs fixées par l'Outil (cellules en vert foncé indiquées par n). Lire la Section 4 du Guide de l'Utilisateur pour une explication de la manière dont sont dérivées ces valeurs. Si elles ne sont pas pertinentes dans votre situation, ôtez la protection de la Feuille de calcul, faites les changements et remettez la protection de la feuille de calcul."]
[]
[null,3,"(Facultatif). Si vous avez plusieurs zones, REVOIR l'hypothèse (pour la plupart des variables) selon laquelle les valeurs pertinentes pour la zone 1 s'appliquent également à d'autre zones. Si l'hypothèse n'est pas valide, ôtez la protection de la feuille de calcul, faites les changements nécessaires aux cellules vert clair ou vert foncé et remettez la protection de la feuille de calcul. "]
[]
[]
[null,null,null,null,null,"Zone 1",null,null,null,"Zone 2","Zone 3","Zone 4","Zone 5","Zone 6","Zone 7","Zone 8","Zone 9","Zone 10"]
[null,null,{"$f":"+IF('D1 Données générales'!$H$11=\"\",\"\",'D1 Données générales'!$H$11)","v":"Ghana"},null,{"$f":"'D2 Echelle'!C30","v":"district"},{"$f":"+IF('D2 Echelle'!$C$31=\"\",\"\",'D2 Echelle'!$C$31)","v":"Ashiedu Keteke"},null,null,null,{"$f":"+IF('D2 Echelle'!$C$36=\"\",\"\",'D2 Echelle'!$C$36)","v":""},{"$f":"+IF('D2 Echelle'!$C$41=\"\",\"\",'D2 Echelle'!$C$41)","v":""},{"$f":"+IF('D2 Echelle'!$C$46=\"\",\"\",'D2 Echelle'!$C$46)","v":""},{"$f":"+IF('D2 Echelle'!$C$51=\"\",\"\",'D2 Echelle'!$C$51)","v":""},{"$f":"+IF('D2 Echelle'!$C$56=\"\",\"\",'D2 Echelle'!$C$56)","v":""},{"$f":"+IF('D2 Echelle'!$C$61=\"\",\"\",'D2 Echelle'!$C$61)","v":""},{"$f":"+IF('D2 Echelle'!$C$66=\"\",\"\",'D2 Echelle'!$C$66)","v":""},{"$f":"+IF('D2 Echelle'!$C$71=\"\",\"\",'D2 Echelle'!$C$71)","v":""},{"$f":"+IF('D2 Echelle'!$C$76=\"\",\"\",'D2 Echelle'!$C$76)","v":""}]
[null,null,null,null,{"$f":"+'D2 Echelle'!D30","v":"région"},{"$f":"+IF('D2 Echelle'!$D$31=\"\",\"\",'D2 Echelle'!$D$31)","v":"Greater Accra"},null,null,null,{"$f":"+IF('D2 Echelle'!$D$36=\"\",\"\",'D2 Echelle'!$D$36)","v":""},{"$f":"+IF('D2 Echelle'!$D$41=\"\",\"\",'D2 Echelle'!$D$41)","v":""},{"$f":"+IF('D2 Echelle'!$D$46=\"\",\"\",'D2 Echelle'!$D$46)","v":""},{"$f":"+IF('D2 Echelle'!$D$51=\"\",\"\",'D2 Echelle'!$D$51)","v":""},{"$f":"+IF('D2 Echelle'!$D$56=\"\",\"\",'D2 Echelle'!$D$56)","v":""},{"$f":"+IF('D2 Echelle'!$D$61=\"\",\"\",'D2 Echelle'!$D$61)","v":""},{"$f":"+IF('D2 Echelle'!$D$66=\"\",\"\",'D2 Echelle'!$D$66)","v":""},{"$f":"+IF('D2 Echelle'!$D$71=\"\",\"\",'D2 Echelle'!$D$71)","v":""},{"$f":"+IF('D2 Echelle'!$D$76=\"\",\"\",'D2 Echelle'!$D$76)","v":""}]
[]
[null,null,"Variables","Unité","Commentaires"]
[null,null,"Epidémiologie de la MAS"]
[null,null," % de tous les cas de MAS  0-59 mois âgés < 6 mois","%","Sources possible de données sur la répartition par âge des enfants avec MAS sont l'EDS (enquêtes démographiques et de santé) et MICS (enquête en grappes à indicateurs multiples).  La plupart des pays auront des données de l'une de ces sources. ",10,"u"]
[null,null," % de tous les cas de MAS  0-59 mois âgés 6-11 mois","%",null,13,"u"]
[null,null,"% de tous les cas de MAS 0-59 mois âgés de 12-23 mois","%",null,25,"u"]
[null,null,"% de tous les cas de MAS 0-59 mois âgés de 24-59 mois","%",null,52,"u"]
[null,null,"Total",null,"Pourcentage total (devrait être 100)",{"$f":"+SUM(F22:F25)","v":100},null,null,null,{"$f":"+SUM(J22:J25)","v":0},{"$f":"+SUM(K22:K25)","v":0},0,0,0,0,0,0,0]
[null,null,"Proportion des cas de MAS âgés de 6-59 mois qui ont des complications médicales et doivent être hospitalisés","proportion","Cela va varier par pays : 0, 20 maximum, 0,10 dans un contexte avec une bonne extension communautaire.",0.15,"n",null,null,{"$f":"+$F$27","v":0.15},{"$f":"+$F$27","v":0.15},0.15,0.15,0.15,0.15,0.15,0.15,0.15]
[null,null,"Proportion de tous les cas de MAS nécessisant PEC MAS hospitalière",null,"(à savoir, moins de 6 mois ou avec complications médicales)",{"$f":"+F22/100+F27*(1-F22/100)","v":0.23500000000000001},null,null,null,{"$f":"+J22/100+J27*(1-J22/100)","v":0.15},0.15,0.15,0.15,0.15,0.15,0.15,0.15,0.15]
[null,null,"Nombre moyen de jours d'hospitalisation des cas de MAS 6-59 mois avec complications ","jours","Les enfants de plus de 6 mois rentrent généralement en soins ambulatoires après 4-10 jours. ",10,"u",null,null,{"$f":"+$F$29","v":10},{"$f":"+$F$29","v":10},10,10,10,10,10,10,10]
[null,null,"Nombre moyen de jours d'hospitalisation pour les cas de MAS < 6 mois","jours","Les enfants de moins de 6 mois restent jusqu'à ce qu'ils aient entièrement récupérés, c'est-à-dire environ entre 1 et 3 mois (plus ou moins 30-100 jours).",30,"u",null,null,{"$f":"+$F$30","v":30},{"$f":"+$F$30","v":30},30,30,30,30,30,30,30]
[null,null,"Nombre moyen de jours d'hospitalisation pour tous les cas de MAS","jours",null,{"$f":"+(F22/100*F30+F27*(1-F22/100)*F29)/(F22/100+F27*(1-F22/100))","v":18.510638297872337},null,null,null,{"$f":"+(J22/100*J30+J27*(1-J22/100)*J29)/(J22/100+J27*(1-J22/100))","v":10},10,10,10,10,10,10,10,10]
[null,null,"Nombre moyen de semaines de cas MAS en soins ambulatoires","semaines","Cela inclut les enfants avec MAS 6-59 mois avec complications médicales. La PEC MAS hospitalière (stabilisation et transition uniquement) est suivie par la PEC MAS ambulatoire pour continuer le traitement. Dont nous assumons, aux fins de simplicité, qu'elle est de la même durée que pour les autres cas, bien qu'elle soit généralement de deux semaines en moins.",8,"n",null,null,{"$f":"+$F$32","v":8},{"$f":"+$F$32","v":8},8,8,8,8,8,8,8]
[null,null,"Nombre moyen de visites au site PEC MAS ambulatoire par cas de MAS","visites ",null,8,"n",null,null,{"$f":"+$F$33","v":8},{"$f":"+$F$33","v":8},8,8,8,8,8,8,8]
[null,null,"Nombre maximum de cas de MAS pris en charge par site","cas",null,15,"n",null,null,{"$f":"+$F$34","v":15},{"$f":"+$F$34","v":15},15,15,15,15,15,15,15]
[null,null,"Heures d'une journée de travail","heures",null,8,"n",null,null,{"$f":"+$F$35","v":8},8,8,8,8,8,8,8,8]
[null,null,"Journées d'une année de travail","jours",null,260,"n",null,null,{"$f":"+$F$36","v":260},{"$f":"+$F$36","v":260},260,260,260,260,260,260,260]
[null,null,"Traitement -temps du personnel "]
[null,null,"PEC MAS ambulatoire"]
[null,null,"Heures personnel senior par séance PEC MAS ambulatoire par enfant avec MAS","heures","Bilan anthropométrique, bilan médical, diagnostic, plan de traitement ",0.25,"n",null,null,{"$f":"+$F$39","v":0.25},{"$f":"+$F$39","v":0.25},0.25,0.25,0.25,0.25,0.25,0.25,0.25]
[null,null,"Heures personnel senior par séance PEC MAS ambulatoire ","heures","Fiche de traitement, registre, fiche de pointage",2,"n",null,null,{"$f":"+$F$40","v":2},{"$f":"+$F$40","v":2},2,2,2,2,2,2,2]
[null,null,"Heures personnel senior par mois par site PEC MAS ambulatoire ","heures","Rapports mensuel",4,"n",null,null,{"$f":"+$F$41","v":4},{"$f":"+$F$41","v":4},4,4,4,4,4,4,4]
[null,null,"H eures personnel junior par séance PEC MAS ambulatoire par enfant avec MAS ","heures","Bilan anthropométrique, bilan médical, diagnostic, plan de traitement ",0.25,"n",null,null,{"$f":"+$F$42","v":0.25},{"$f":"+$F$42","v":0.25},0.25,0.25,0.25,0.25,0.25,0.25,0.25]
[null,null,"Heures personnel junior par séance PEC MAS ambulatoire","heures","Test d'appétit, distribution de l'aliment thérapeutique",2,"n",null,null,{"$f":"+F43","v":2},{"$f":"+$F$43","v":2},2,2,2,2,2,2,2]
[null,null,"Heures personnel junior par mois par site PEC MAS ambulatoire","heures","Rapports mensuel",4,"n",null,null,{"$f":"+$F$44","v":4},{"$f":"+$F$44","v":4},4,4,4,4,4,4,4]
[null,null,"PEC MAS hospitalière"]
[null,null,"Bilan clinique (heures par enfant)"]
[null,null,"Personnel senior (infirmier, médecin, diététicien)","heures","Une heure le premier jour et encore une fois une heure le jour de la sortie",2,"n",null,null,{"$f":"+$F$47","v":2},{"$f":"+$F$47","v":2},2,2,2,2,2,2,2]
[null,null,"Personnel junior (infirmier)","heures","Une heure le premier jour et encore une fois une heure le jour de la sortie",2,"n",null,null,{"$f":"+$F$48","v":2},{"$f":"+$F$48","v":2},2,2,2,2,2,2,2]
[null,null,"Bilan clinique (par journée d'hospitalisation par enfant)"]
[null,null,"Personnel senior (infirmier, médecin, diététicien)","heures","Une demi-heure chaque jour (sauf le premier et le dernier jour)",0.5,"n",null,null,{"$f":"+$F$50","v":0.5},{"$f":"+$F$50","v":0.5},0.5,0.5,0.5,0.5,0.5,0.5,0.5]
[null,null,"Personnel junior  (infirmier)","heures","Une demi-heure chaque jour (sauf le premier et le dernier jours)",0.5,"n",null,null,{"$f":"+$F$51","v":0.5},{"$f":"+$F$51","v":0.5},0.5,0.5,0.5,0.5,0.5,0.5,0.5]
[null,null,"Préparation de la nourriture  - personnel junior (heures/jour/site PEC MAS hosp.)","heures","8 prises d'aliments par jour prenant 20 minutes chacune pour la préparation",3,"n",null,null,{"$f":"+$F$52","v":3},{"$f":"+$F$52","v":3},3,3,3,3,3,3,3]
[null,null,"Supervision de l'alimentation les 3 premiers jours- personnel junior (heures/enfant/jour)","heures","15 minutes pour chacune des 8 prises d'aliments par jour ",2,"n",null,null,{"$f":"+$F$53","v":2},{"$f":"+$F$53","v":2},2,2,2,2,2,2,2]
[null,null,"Supervision de l'alimentation après les 3 premiers jours- personnel junior (heures/enfant/jour)","heures","10 minutes pour chacune des 6 prises d'aliments par jour",1,"n",null,null,{"$f":"+$F$54","v":1},{"$f":"+$F$54","v":1},1,1,1,1,1,1,1]
[null,null,"Tenue de dossiers  - personnel senior (heures/semaine/site PEC MAS hospitalière)","heures"," ",5,"n",null,null,{"$f":"+$F$55","v":5},{"$f":"+$F$55","v":5},5,5,5,5,5,5,5]
[null,null,"Traitement - espace nécessaire"]
[null,null,"  PEC MAS ambulatoire"]
[null,null,"Espace occupé par accompagnant et enfant à la séance PEC MAS ambulatoire (par enfant MAS)","m2","Indication approximative de l'espace pour que l'accompagnante et l'enfant puisent s'asseoir à l'aise. ",1,"n",null,null,{"$f":"+$F$58","v":1},{"$f":"+$F$58","v":1},1,1,1,1,1,1,1]
[null,null,"Durée de la séance (durée accompagnant et enfant passent à la séance PEC MAS ambulatoire)","heures","Comprend le temps d'attente, le bilan, l'alimentation et la remise de l'ATPE.  ",4,"n",null,null,{"$f":"+$F$59","v":4},{"$f":"+$F$59","v":4},4,4,4,4,4,4,4]
[null,null,"Espace occupé par le personnel soignant les enfants MAS lors de la séance PEC MAS ambulatoire (par membre de personnel actif dans les soins ambulatoires).","m2","En supposant que chaque membre du personnel a besoin de 2m sur 2 pendant la période pendant laquelle il s'occupe activement d'un enfant avec MAS (peser, évaluer, alimenter).",4,"n",null,null,{"$f":"+$F$60","v":4},{"$f":"+$F$60","v":4},4,4,4,4,4,4,4]
[null,null,"PEC MAS hospitalière",null,"En supposant que chaque membre du personnel a besoin de 2 m x 2 m pendant la période où il est actif à s'occuper d'un enfant avec MAS (peser, évaluer, nourrir)."]
[null,null,"Espace occupé par les patients hospitalisés (lit adulte avec suffisamment d'espace pour que l'accompagnant et le personnel puissent se déplacer) par patient.","m2","En supposant que les lits pour adultes sont 1 sur 2 m et qu'il y a 1 m entre les lits adjacents et 2 m entre les lits opposés.",7,"n",null,null,{"$f":"+$F$62","v":7},{"$f":"+$F$62","v":7},7,7,7,7,7,7,7]
[null,null,"Espace occupé par le personnel soignant les patients hospitalisés avec MAS","m2","En supposant que chaque salle compte suffisamment de place pour un grand bureau et des chaises pour les infirmiers et les médecins.",5,"n",null,null,{"$f":"+$F$63","v":5},{"$f":"+$F$63","v":5},5,5,5,5,5,5,5]
[null,null,"Extension communautaire"]
[null,null,"Gestionnaire de zone niveau intermédiaire "]
[null,null,"Temps pour aider le personnel dans un nouveau site PEC MAS ambulatoire, pour concevoir matériel d'extension communautaire, préparer directives sur stratégies, cartographie communautaire et choisir les communautés (par nouveau site PEC MAS ambulatoire)","jours",null,1,"n",null,null,{"$f":"+$F$66","v":1},{"$f":"+$F$66","v":1},1,1,1,1,1,1,1]
[null,null,"Nombre de voyage retour de la zone au site PEC MAS ambulatoire (par nouveau site PEC MAS ambulatoire)","voyages",null,1,"n",null,null,{"$f":"+$F$67","v":1},{"$f":"+$F$67","v":1},1,1,1,1,1,1,1]
[null,null,"Agent de santé senior de la PEC MAS ambulatoire"]
[null,null,"Temps dans un nouveau site PEC MAS ambulatoire, pour concevoir matériel d'extension communautaire, préparer directives sur les stratégies, cartographie communautaire et choisir les communautés  (par nouveau site PEC MAS ambulatoire).","jours",null,5,"n",null,null,{"$f":"+$F$69","v":5},{"$f":"+$F$69","v":5},5,5,{"$f":"+$F$69","v":5},5,5,5,5]
[null,null,"Temps dans un site d'extension communautaire, pour les réunions de sensibilisation communautaire (et sélection des volontaires le cas échéant)","jours"," ",2,"n",null,null,{"$f":"+$F$70","v":2},{"$f":"+$F$70","v":2},2,2,2,2,2,2,2]
[null,null,"Nombre de voyage retour aux sites d'extension communautaire (par nouveau site d'extension communautaire)","voyages",null,2,"n",null,null,{"$f":"+$F$71","v":2},{"$f":"+$F$71","v":2},2,2,2,2,2,2,2]
[null,null,"Agent de santé junior PEC MAS ambulatoire"]
[null,null,"Temps dans un nouveau site PEC MAS ambulatoire, pour concevoir matériel d'extension communautaire, préparer directives sur stratégies, cartographie communautaire et choisir les communautés (par nouveau site PEC MAS ambulatoire)","jours",null,5,"n",null,null,{"$f":"+$F$73","v":5},{"$f":"+$F$73","v":5},5,5,5,5,5,5,5]
[null,null,"Temps dans un site d'extension communautaire, pour les réunions de sensibilisation communautaire (et sélection des volontaires le cas échéant)","jours"," ",2,"n",null,null,{"$f":"+$F$74","v":2},{"$f":"+$F$74","v":2},2,2,2,2,2,2,2]
[null,null,"Nombre de voyage retour aux sites d'extension communautaire (par nouveau site d'extension communautaire)","voyages",null,2,"n",null,null,{"$f":"+$F$75","v":2},{"$f":"+$F$75","v":2},2,2,2,2,2,2,2]
[null,null,"Agent d'extension communautaire"]
[null,null,"Est-ce que ceux qui font l'extension communautaire (agent d'extension communautaire [AEC]) font partie du personnel rémunéré (agent de santé communautaire [ASC])ou sont-ils des volontaires ?",null,null,"Volontaire","u"]
[null,null,"Temps dans la communauté : (1)Visites à domicile pour les cas problématiques, (2) identification de nouveaux cas et référence vers la PCMA, (3) mobilisation communautaire, (4) liaison avec les dirigeants communautaires, et évaluation communautaire (par an et par site d'extension communautaire)","jours","Un jour par mois pour chacune des activités 1, 2 et 3; et  2 jours par an pour l'activité 4.",38,"n",null,null,{"$f":"+$F$78","v":38},{"$f":"+$F$78","v":38},38,38,38,38,38,38,38]
[null,null,"Temps dans les PEC MAS ambulatoire pour collecte de données et notification (par an et par site d'extension communautaire)","jours","Un jour par mois. ",12,"n",null,null,{"$f":"+$F$79","v":12},{"$f":"+$F$79","v":12},12,12,12,12,12,12,12]
[null,null,"Nombre minimum de personnel par AEC nécessaire par site d'extension communautaire","personnel","Si volontaires, un par site; si ASC alors le nombre d'heures nécessaires par activité d'extension communautaire divisé par le nombre d'heures d'une année de travail.",{"$f":"+IF(F77=\"volontaire\",1,(F78+F79)/F36)","v":1},null,null,null,{"$f":"+IF(J77=\"volontaire\",1,(J78+J79)/J36)","v":0.19230769230769232},0.19230769230769232,0.19230769230769232,0.19230769230769232,0.19230769230769232,0.19230769230769232,0.19230769230769232,0.19230769230769232,0.19230769230769232]
[null,null,"Nombre de voyages retour entre le site PEC MAS ambulatoire et le site d'extension communautaire (par site d'extension communautaire)","voyages","Pour ASC : 1 pour chaque jour de travail dans la communauté.\nPour les volontaires: 1 pour chaque jour dans le site PEC MAS hospitalière.",{"$f":"+IF(F77=\"ASC (personnel)\",F78,IF(F77=\"volontaire\",F79,0))","v":12},"n",null,null,{"$f":"+IF(J77=\"ASC (personnel)\",J78,IF(J77=\"volontaire\",J79,0))","v":0},0,0,0,0,0,0,0,0]
[null,null,"Traitement  - médicaments pour problèmes de santé connexes"]
[null,null,"Comment le paludisme est-il diagnostiqué ?",null,null,"traitement présomptif","u",null,null,"il n'y a pas de paludisme","symptômes","paracheck","test diagnostic autre","traitement présomptif","il n'y a pas de paludisme","test diagnostic autre",null,"test diagnostic autre"]
[null,null,"(S'il y a des cas de paludisme), quel est le pourcentage d'enfants avec MAS avec des symptômes de paludisme? (moyenne annuelle)","%","Si ces données ne sont pas disponibles, utilisez les chiffres sur la prévalence de tous les enfants de moins de cinq ans qui ont le paludisme.  (Le rouge indique une incompatibilité avec la réponse à la question précédente).",null,"u"]
[null,null,"(Si des test de diagnostic sont utilisés), quel est le pourcentage d'enfants avec MAS qui présentent des symptômes de paludisme et dont le diagnostic est confirmé par le test ?","%",null,null,"u"]
[null,null,"Nombre de tests à administrer à chaque cas de MAS pour déterminer s'il souffre de paludisme.","tests","Le test n'est pas sensible chez les enfants avec MAS (à cause de leur faible charge parasitaire). Probablement indiqué de répéter le test après 1-2 semaines de traitement.",1,"n",null,null,{"$f":"+$F86","v":1},1,1,1,1,1,1,1,1]
[null,null,"Proportion de cas de MAS hospitalisés qui sont déshydratés","proportion","Ce chiffre est généralement entre 0,2 et 0,5 (à savoir 20% à 50% des patients hospitalisés avec MAS).",35,"u",null,null,{"$f":"+$F$87","v":35},{"$f":"+$F$87","v":35},35,35,35,35,35,35,35]
[null,null,"ReSoMal  pour la réhydratation par enfant déshydraté avec MAS ","sachets de 84 g",null,2,"n",null,null,{"$f":"+$F88","v":2},2,2,2,2,2,2,2,2]
[null,null,"Est-ce que d'autres tests (sauf pour le paludisme) sont faits régulièrement des cas hospitalisés de MAS ?","oui/non",null,"oui","u",null,null,{"$f":"+$F$89","v":"oui"},{"$f":"+$F$89","v":"oui"},"oui","oui","oui","oui","oui","oui","oui"]
[null,null,"Indiquer les autres tests faits régulièrement (VIH, TB, glucose sanguin, HB)",null,"VIH, Hémoglobine, Glycémie, TB occasionnellement",null,"u"]
[null,null,"Pourcentage de cas de MAS hospitalisés exigeant kits IV","%",null,10,"n",null,null,{"$f":"+$F$91","v":10},{"$f":"+$F$91","v":10},10,10,10,10,10,10,10]
[null,null,"Pourcentage de cas de MAS hospitalisés exigeant sondes naso-gastriques","%",null,25,"n",null,null,{"$f":"+$F$92","v":25},{"$f":"+$F$92","v":25},25,25,25,25,25,25,25]
[null,null,"Eau sucrée pour les PEC MAS ambulatoire pour prévenir la déshydratation (par enfant venant à la séance PEC MAS ambulatoire)","litre",null,0.1,"n",null,null,{"$f":"+$F93","v":0.1},0.1,0.1,0.1,0.1,0.1,0.1,0.1,0.1]
[null,null,"Gélules vitamine A par cas de MAS de 6-11 mois","gélules 100 000 UI",null,1,"n",null,null,{"$f":"+$F94","v":1},1,1,1,1,1,1,1,1]
[null,null,"Gélules de vitamine A par cas de MAS 12-59 mois",null,null,2,"n",null,null,2,2,2,2,2,2,2,2,2]
[null,null,"Amoxicilline par cas de MAS","g",null,3,"n",null,null,3,3,3,3,3,3,3,3,3]
[null,null,"Albendazole par cas de MAS 12-23 mois","comprimés (100 mg)",null,2,"n",null,null,2,2,2,2,2,2,2,2,2]
[null,null,"Albendazole par cas de MAS 24-59 mois",null,null,4,"n",null,null,4,4,4,4,4,4,4,4,4]
[null,null,"Vaccin contre la rougeole par cas de MAS de plus de 6 mois sans complications","dose",null,1,"n",null,null,{"$f":"+$F$99","v":1},{"$f":"+$F$99","v":1},1,1,1,1,1,1,1]
[null,null,"Vaccin contre la rougeole par cas de MAS de plus de 6 mois avec complications","dose",null,2,"n",null,null,{"$f":"+$F$100","v":2},{"$f":"+$F$100","v":2},2,2,2,2,2,2,2]
[null,null,"Seringue AD pour vaccin contre la rougeole par cas de MAS de plus de 6 mois sans complications","seringue",null,1,"n",null,null,{"$f":"+$F$101","v":1},{"$f":"+$F$101","v":1},1,1,1,1,1,1,1]
[null,null,"Seringue AD pour vaccin contre la rougeole par cas de MAS de plus de 6 mois avec complications","seringue",null,2,"n",null,null,{"$f":"+$F$102","v":2},{"$f":"+$F$102","v":2},2,2,2,2,2,2,2]
[null,null,"Seringue mélange rougeole par cas de MAS de plus de 6 mois sans complications","seringue",null,0.1,"n",null,null,{"$f":"+$F$103","v":0.1},{"$f":"+$F$103","v":0.1},0.1,0.1,0.1,0.1,0.1,0.1,0.1]
[null,null,"Seringue mélange rougeole par cas MAS de plus de 6 mois avec complications","seringue",null,0.2,"n",null,null,{"$f":"+$F$104","v":0.2},{"$f":"+$F$104","v":0.2},0.2,0.2,0.2,0.2,0.2,0.2,0.2]
[null,null,"Traitement - aliment thérapeutique et autre matériel"]
[null,null,"Quantité ATPE nécessaire par cas de MAS sans complications médicales","kg"," ",12,"n",null,null,{"$f":"+$F$106","v":12},12,12,12,12,12,12,12,12]
[null,null,"Quantité ATPE nécessaire par cas de MAS avec complications médicales","kg","En supposant  95% des cas avec complications reçoivent 12kg.",11.4,"n",null,null,{"$f":"+$F$107","v":11.4},{"$f":"+$F$107","v":11.4},11.4,11.4,11.4,11.4,11.4,11.4,11.4]
[null,null,"Quantité ATPE fournie en PEC MAS hospitalière par enfant MAS avec complications médicales","kg","En supposant que 95% des cas avec complications qui reçoivent l'ATPE reçoivent 1 kg de leur 12 kg en PEC MAS hospitalière (et les 11 kg restants en PEC MAS ambulatoire).",0.95,"n",null,null,{"$f":"+$F$108","v":0.95},{"$f":"+$F$108","v":0.95},0.95,0.95,0.95,0.95,0.95,0.95,0.95]
[null,null,"Pertes estimées de l'ATPE et F-100 et F-75 (entre l'achat et la distribution à l'enfant)","%"," ",10,"n",null,null,{"$f":"+$F$109","v":10},10,10,10,10,10,10,10,10]
[null,null,"Quantité de F-75 par cas de MAS avec complications médicales","kg"," ",2,"n",null,null,{"$f":"+$F$110","v":2},2,2,2,2,2,2,2,2]
[null,null,"Quantité de F-100 par cas de MAS avec complications médicales","kg","En supposant que 5% des cas de MAS avec complications reçoivent 12 kgs.",0.6,"n",null,null,{"$f":"+$F$111","v":0.6},0.6,0.6,0.6,0.6,0.6,0.6,0.6,0.6]
[null,null,"Paquet de fiches de traitement PEC MAS ambulatoire","fiche",null,1,"n",null,null,{"$f":"+$F112","v":1},1,1,1,1,1,1,1,1]
[null,null,"Paquet de fiches de traiement PEC MAS hospitalière","fiche",null,1,"n",null,null,1,1,1,1,1,1,1,1,1,{"$f":"+$F113","v":1}]
[null,null,"Fiche de ration ATPE pour nouvelles admissions par cas de MAS","fiche",null,1,"n",null,null,1,1,1,1,1,1,1,1,1]
[null,null,"Bracelets par cas de MAS","bracelet","Pas toujours utilisé",1,"n",null,null,{"$f":"+$F$115","v":1},{"$f":"+$F$115","v":1},1,1,1,1,1,1,1]
[null,null,"Serviettes pour les mains par séance de PEC MAS ambulatoire","rouleaux","Pas toujours utilisé",2,"n",null,null,{"$f":"+$F$116","v":2},{"$f":"+$F$116","v":2},2,2,2,2,2,2,2]
[null,null,"Savon par séance de PEC MAS ambulatoire","barre",null,1,"n",null,null,{"$f":"+$F$117","v":1},{"$f":"+$F$117","v":1},1,1,1,1,1,1,1]
[null,null,"Nourriture pour l'accompagnant (par jour et par enfant à l'hôpital)","repas",null,1,"n",null,null,{"$f":"+$F$118","v":1},{"$f":"+$F$118","v":1},1,1,1,1,1,1,1]
[null,null,"Nombre de lits d'hôpital taille adulte par enfant avec MAS hospitalisé ",null," (Accompagnante partage le lit de l'enfant)",1,"n",null,null,{"$f":"+$F$119","v":1},{"$f":"+$F$119","v":1},1,1,1,1,1,1,1]
[null,null,"Eau de boisson par séance PEC MAS ambulatoire","litre",null,1,"n",null,null,{"$f":"+$F$120","v":1},{"$f":"+$F$120","v":1},1,1,1,1,1,1,1]
[null,null,"Lié aux transports"]
[null,null,"Quantité de temps mort (à attendre, etc.) par voyage de livraison (aller) de l'aliment thérapeutique pour les chauffeurs des véhicules ","heures",null,1,"n",null,null,{"$f":"+$F$122","v":1},{"$f":"+$F$122","v":1},1,1,1,1,1,1,1]
[null,null,"Distance moyenne entre le site PEC MAS ambulatoire et le siège de la zone","km","Le journal de bord des chauffeurs est une bonne source d'information des diverses distances demandées ici. Les chauffeurs eux-mêmes pourront donner le temps qu'il faut pour les voyages indiqués ici, pour la zone aux sites PEC MAS ambulatoire/hospitalière et sites PEC MAS ambulatoire aux sites extension communautaire. Faites la moyenne des données pour tous les sites possibles. Remaruez que la distance et le temps à noter ici se rapportent à un aller simple et pas au voyage retour.",5,"u"]
[null,null,"Temps moyen pour atteindre le site PEC MAS ambulatoire du siège de la zone","heures",null,0.25,"u"]
[null,null,"Distance moyenne entre le site PEC MAS hospitalière et le siège de la zone","km",null,5,"u"]
[null,null,"Temps moyen pour atteinde le site PEC MAS hospitalière du siège de la zone","heures",null,0.25,"u"]
[null,null,"Distance entre le siège de la zone et le siège du groupe-zones","km",null,1,"u"]
[null,null,"Temps pour atteindre le siège de la zone à partir du siège du groupe-zones","heures",null,0.1,"u"]
[null,null,"Distance moyenne entre le site PEC MAS hospitalière et le site PEC MAS ambulatoire","km",null,1.5,"u"]
[null,null,"Temps moyen  pour arriver au site PEC MAS hospitalière du site PEC MAS ambulatoire","heures",null,0.1,"u"]
[null,null,"Distance moyenne entre le site PEC MAS ambulatoire et le site d'extension communautaire","km",null,3,"u"]
[null,null,"Temps moyen pour atteindre le site d'extension communautaire du site PEC MAS ambulatoire","heures",null,0.25,"u"]
[null,null,"Stockage  (NOTE: si F-75  & F-100 sont fabriqués sur place, mesurer l'espace occupé par les ingrédients nécessaires pour préparer 1 kg du produit)."]
[null,null,"Est-ce que vous utilisez l'ATPE commercial ?",null,"Boîte standard : 13,8 kg ATPE dimensions 38,5cm X 29cm X 20,8 cm.","oui","u"]
[null,null,"Le poids de l'ATPE dans une boîte de stockage standard d'unités d'ATPE","kg","Doit seulement être indiqué si l'ATPE est Nutriset's Plumpy'Nut  (13,8 kg dans une boîte de 38,5 cm X 29 cm X 20,8 cm). \nLe poids à marquer est le poids de l'ATPE lui-même (et pas le poids de l'emballage).",null,"u"]
[null,null,"La largeur d'une boîte de stockage standard de l'ATPE","cm",null,null,"u"]
[null,null,"La longueur d'une boîte de stockage standard de l'ATPE","cm",null,null,"u"]
[null,null,"La hauteur d'une boîte de stockage standard de l'ATPE","cm",null,null,"u"]
[null,null,"Le volume occupé par une boîte de stockage standard de l'ATPE","m3","Largeur (cm) * ampleur (cm) * taille (cm) / 1,000,000",{"$f":"+IF(F134=\"oui\",0.0232,(F136*F137*F138)/1000000)","v":2.3199999999999998E-2}]
[null,null,"Espace occupé par 1 kg de l'ATPE","m3",null,{"$f":"+IF(F134=\"oui\",0.0017,IF(F139=0,0,F139/F135))","v":1.6999999999999999E-3},null,null,null,{"$f":"+F140","v":1.6999999999999999E-3},{"$f":"+F140","v":1.6999999999999999E-3},{"$f":"+F140","v":1.6999999999999999E-3},{"$f":"+F140","v":1.6999999999999999E-3},{"$f":"+F140","v":1.6999999999999999E-3},{"$f":"+F140","v":1.6999999999999999E-3},{"$f":"+F140","v":1.6999999999999999E-3},{"$f":"+F140","v":1.6999999999999999E-3},{"$f":"+F140","v":1.6999999999999999E-3}]
[null,null,"Est-ce que vous utilisez F-75 commercial ?",null,"Si \"Oui\" le volume est calculé automatiquement et pas besoin de fournir des données sur le poids ou les dimensions.","oui","u"]
[null,null,"Poids de F-75  dans une boîte de stockage standard ","kg","Seul le poids de F-75 (pas de l'emballage).",null,"u"]
[null,null,"La largeur d'une boîte de stockage standard de F-75","cm",null,null,"u"]
[null,null,"La longueur d'une boîte de stockage standard de F-75 ","cm",null,null,"u"]
[null,null,"La hauteur d'une boîte de stockage standard de F-75","cm",null,null,"u"]
[null,null,"Volume occupé par une boîte de stockage standard de F-75","m3","Largeur (cm) * ampleur (cm) * hauteur (cm)/1,000,000",{"$f":"+IF(F141=\"oui\",0.0265,F143*F144*F145/1000000)","v":2.6499999999999999E-2}]
[null,null,"Espace occupé par 1 kg F75 ","m3",null,{"$f":"+IF(F141=\"oui\",0.0032,IF(F146=0,0,F146/F142))","v":3.2000000000000002E-3},null,null,null,{"$f":"+$F$147","v":3.2000000000000002E-3},{"$f":"+$F$147","v":3.2000000000000002E-3},3.2000000000000002E-3,3.2000000000000002E-3,3.2000000000000002E-3,3.2000000000000002E-3,3.2000000000000002E-3,3.2000000000000002E-3,3.2000000000000002E-3]
[null,null,"Est-ce que vous utilisez F100 commercial?",null,null,"non","u"]
[null,null,"Poids de F100 dans une boîte de stockage standard ","kg","Seulement le poids de F-100 (pas de l'emballage)",4.8,"u"]
[null,null,"La largeur d'une boîte de stockage standard de  F-100 ","cm",null,23.5,"u"]
[null,null,"La  longueur d'une boîte de stockage standard de F-100","cm",null,24.5,"u"]
[null,null,"La  hauteur d'une boîte de stockage standard de  F-100","cm",null,28.5,"u"]
[null,null,"Volume occupé par une boîte de stockage standard de F-100","m3","Largeur (cm) * ampleur (cm) * hauteur (cm) / 1,000,000",{"$f":"+IF(F148=\"oui\",0.038,F150*F151*F152/1000000)","v":1.6408875E-2}]
[null,null,"Espace occupé par 1 kg F-100","m3",null,{"$f":"+IF(F148=\"oui\",0.0028,IF(F149=0,0,F153/F149))","v":3.4185156250000001E-3},null,null,null,{"$f":"+$F$154","v":3.4185156250000001E-3},{"$f":"+$F$154","v":3.4185156250000001E-3},3.4185156250000001E-3,3.4185156250000001E-3,3.4185156250000001E-3,3.4185156250000001E-3,3.4185156250000001E-3,3.4185156250000001E-3,3.4185156250000001E-3]
[null,null,"Espace disponible dans les véhicules transportant l'aliment thérapeutique vers le siège de la zone","m3","Mesure le volume - largeur x longueur x hauteur (toutes en mètres)  - qui peut être occupé en toute sécurité par l'aliment thérapeutique.",3,"u"]
[null,null,"Espace disponible dans le siège de la zone pour l'aliment thérapeutique","m3","idem",5,"u"]
[null,null,"Espace disponible dans les véhicules transportant l'aliment thérapeutique vers les sites PEC MAS ambulatoire","m3","idem",3,"u"]
[null,null,"Espace disponible dans le site PEC MAS ambulaoire pour l'aliment thérapeutique","m3","idem",5,"u"]
[null,null,"Espace disponible dans les véhicules transportant l'aliment thérapeutique vers les sites PEC MAS hospitalière","m3","idem",3,"u"]
[null,null,"Espace disponible dans le site moyen PEC MAS hospitalière pour l'aliment thérapeutique","m3","idem",5,"u"]
[null,null,"Nombre de gardiens du magasin par site de stockage PCMA","gardiens",null,1,null,null,null,{"$f":"+$F$161","v":1},{"$f":"+$F$161","v":1},1,1,1,1,1,1,1]
[null,null,"Nombre de fiches de contrôle de stock par magasin et par an","fiches",null,12,"n",null,null,{"$f":"+$F$162","v":12},{"$f":"+$F$162","v":12},12,12,12,12,12,12,12]
[null,null,"Formation des gestionnaires de santé, des agents de santé et des ASC"]
[null,null,"Nombre des membres du personnel par nouveau siège de zone à former par an","personnel",null,4,"n",null,null,{"$f":"+$F$164","v":4},{"$f":"+$F$164","v":4},4,4,4,4,4,4,4]
[null,null,"Nombre des membres du personnel par siège établi de zone à former par an","personnel",null,2,"n",null,null,{"$f":"+$F$165","v":2},{"$f":"+$F$165","v":2},2,2,2,2,2,2,2]
[null,null,"Journées de formation pour le personnel du nouveau siège de la zone, par an","jours",null,5,"n",null,null,{"$f":"+$F$166","v":5},{"$f":"+$F$166","v":5},5,5,5,5,5,5,5]
[null,null,"Journées de formation pour le personnel du siège de la zone établie, par an","jours",null,1,"n",null,null,{"$f":"+$F$167","v":1},{"$f":"+$F$167","v":1},1,1,1,1,1,1,1]
[null,null,"Taille maximale de la classe de formation pour le personnel du siège de la zone","participants","15 - 25 est une taille de classe raisonnable",20,"n",null,null,{"$f":"+$F$168","v":20},{"$f":"+$F$168","v":20},20,20,20,20,20,20,20]
[null,null,"Pour une formation qui dure plus d'une journée, est-ce que les participants de la zone restent pendant la nuit au siège du groupe-zones ou font-ils le voyage tous les jours ?",null,null,"restent la nuit","u"]
[null,null,"Nombre d'agents de santé par nouveau site PEC MAS ambulatoire, qui seront formés par an ","personnel",null,3,"n",null,null,{"$f":"+$F$170","v":3},{"$f":"+$F$170","v":3},{"$f":"+$F$170","v":3},3,3,3,3,3,3]
[null,null,"Nombre d'agents de santé par site PEC MAS ambulatoire établi, qui seront formés par an","personnel",null,3,null,null,null,{"$f":"+$F$171","v":3},{"$f":"+$F$171","v":3},3,3,3,3,3,3,3]
[null,null,"Nombre d'agents de santé par nouveau site PEC MAS hospitalière, qui seront formés par an ","personnel",null,4,"n",null,null,{"$f":"+$F$172","v":4},{"$f":"+$F$172","v":4},4,4,4,4,4,4,4]
[null,null,"Nombre d'agents de santé par site PEC MAS hospitalière, qui seront formés par an","personnel",null,2,"n",null,null,{"$f":"+$F$173","v":2},{"$f":"+$F$173","v":2},2,2,2,2,2,2,2]
[null,null,"Journées de formation, par participant et par an, dans un nouveau site PEC MAS ambulatoire","jours","Entre 4 et 6 jours",5,"n",null,null,{"$f":"+$F$174","v":5},{"$f":"+$F$174","v":5},5,5,5,5,5,5,5]
[null,null,"Journées de formation, par participant et par an, dans un site PEC MAS ambulatoire établi","jours","Entre 1 et 3 jours ",2,"n",null,null,{"$f":"+$F$175","v":2},{"$f":"+$F$175","v":2},2,2,2,2,2,2,2]
[null,null,"Journées de formation, par participant et par an, dans un nouveau site PEC MAS hospitalière","jours","Entre 5 et 10 jours",7,null,null,null,{"$f":"+$F$176","v":7},{"$f":"+$F$176","v":7},7,7,7,7,7,7,7]
[null,null,"Journées de formation, par participant et par an, dans un site PEC MAS hospitalière établi","jours","Entre 5 et 10 jours ",6,"n",null,null,{"$f":"+$F$177","v":6},{"$f":"+$F$177","v":6},6,6,6,6,6,6,6]
[null,null,"Taille maximale de la classe de formation pour les participants des sites PEC MAS ambulatoire et hospitalière","participants","15 - 25 est une taille de classe raisonnable",20,"n",null,null,{"$f":"+$F$178","v":20},{"$f":"+$F$178","v":20},20,20,20,20,20,20,20]
[null,null,"Pour une formation qui dure plus d'une journée, est-ce que les participants des sites PEC MAS ambulatoire et hospitalière restent pendant la nuit au siège de la zone ou font-ils le voyage tous les jours?",null,"Cela peut varier au sein d'une zone selon la distance des établissements au siège de la zone mais choisir le plus courant.","restent la nuit","u"]
[null,null,"Journées de formation pour les nouveaux AEC recrutés par an ","jours",null,2,"n",null,null,{"$f":"+$F$180","v":2},{"$f":"+$F$180","v":2},2,2,2,2,2,2,2]
[null,null,"Journées de formation pour les AEC établis, par an ","jours",null,1,"n",null,null,{"$f":"+$F$181","v":1},{"$f":"+$F$181","v":1},1,1,1,1,1,1,1]
[null,null,"Taux d'abandon (% d'AEC qui arrêtent de travailer pour la PCMA chaque année)","%",null,25,"n",null,null,{"$f":"+$F$182","v":25},{"$f":"+$F$182","v":25},25,25,25,25,25,25,25]
[null,null,"Taille maximale de la classe de formation pour les AEC","AEC","15 - 25 est une taille de classe raisonnable.",20,"n",null,null,{"$f":"+$F$183","v":20},{"$f":"+$F$183","v":20},20,20,20,20,20,20,20]
[null,null,"Pour une formation qui dure plus d'une journée, est-ce que les participants AEC restent pendant la nuit au site PEC MAS ambulatoire ou font-ils le voyage tous les jours?",null,null,"voyagent chaque jour","u"]
[null,null,"Supervision du siège de la zone, des sites PEC MAS ambulatoire et hospitalière, et des AEC",null,null,null,null,null,null," "," "," "," "," "," "," "," "," "]
[null,null,"Nombre de visites de supervision du siège de la zone par an pour chaque nouveau site PEC MAS ambulatoire et hospitalière","visites ","Basé sur une supervision hebdomadaire pendant les deux premiers mois (plus ou moins la période qui permet à un enfant avec MAS de se remettre) suivie d'une supervision tous les 15 jours pendant les 2 mois suivants et une supervision mensuelle par la suite. ",20,"n",null,null,{"$f":"+$F$186","v":20},{"$f":"+$F$186","v":20},20,20,20,20,20,20,20]
[null,null,"Nombre de visites de supervision du siège de la zone par an pour les sites PEC MAS ambulatoire et hospitalière déjà établis","visites ","Basé sur 1 par mois.",12,"n",null,null,{"$f":"+$F$187","v":12},{"$f":"+$F$187","v":12},12,12,12,12,12,12,12]
[null,null,"Temps passé par le superviseur lors de chaque visite de supervision à chaque nouveau site PEC MAS ambulatoire ou hospitalière","heures",null,2,"n",null,null,{"$f":"+$F$188","v":2},{"$f":"+$F$188","v":2},2,2,2,2,2,2,2]
[null,null,"Temps passé par le superviseur lors de chaque visite de supervision à chaque site PEC MAS ambulatoire ou hospitalière, déjà établi","heures",null,2,"n",null,null,{"$f":"+$F$189","v":2},{"$f":"+$F$189","v":2},2,2,2,2,2,2,2]
[null,null,"Temps passé par l'agent de santé senior pour la supervision interne à chaque nouveau site PEC MAS ambulatoire ou hospitalière, par semaine","heures",null,1,"n",null,null,{"$f":"+$F$190","v":1},{"$f":"+$F$190","v":1},1,1,1,1,1,1,1]
[null,null,"Nombre de visites de supervision par an, à chaque nouveau AEC ","visites ","Basé sur 1 par mois.",12,"n",null,null,{"$f":"+$F$191","v":12},{"$f":"+$F$191","v":12},12,12,12,12,12,12,12]
[null,null,"Nombre de visites de supervision par an, à chaque AEC établi","visites ","Basé sur 1 tous les 3 mois.",4,"n",null,null,{"$f":"+$F$192","v":4},{"$f":"+$F$192","v":4},4,4,4,4,4,4,4]
[null,null,"Temps passé par le superviseur à chaque visite de supervision pour un nouveau AEC","heures",null,2,"n",null,null,{"$f":"+$F$193","v":2},{"$f":"+$F$193","v":2},2,2,2,2,2,2,2]
[null,null,"Temps passé par le superviseur à chaque visite de supervision pour un AEC établi","heures",null,2,"n",null,null,{"$f":"+$F$194","v":2},{"$f":"+$F$194","v":2},2,2,2,2,2,2,2]
[null,null,"Nombre de visites de supervision du siège du groupe-zones à chaque nouveau siège de zone par an ","visites ",null,12,"n",null,null,{"$f":"+$F$195","v":12},{"$f":"+$F$195","v":12},12,12,12,12,12,12,12]
[null,null,"Nombre de visites de supervision du siège du groupe-zones à chaque siège de zone établi, par an","visites ",null,4,"n",null,null,{"$f":"+$F$196","v":4},{"$f":"+$F$196","v":4},4,4,4,4,4,4,4]
[null,null,"Temps passé par le superviseur du groupe-zones lors de chaque visite de supervision à un nouveau siège de zone","heures",null,4,"n",null,null,{"$f":"+$F$197","v":4},{"$f":"+$F$197","v":4},4,4,4,4,4,4,4]
[null,null,"Temps passé par le superviseur du groupe-zones lors de chaque visite de supervision pour un siège de zone établi","heures",null,2,"n",null,null,{"$f":"+$F$198","v":2},{"$f":"+$F$198","v":2},2,2,2,2,2,2,2]
[null,null,"Gestion du programme/service de la PCMA au niveau siège de la zone "]
[null,null,"Temps nécessaire pour mettre en place la PCMA dans une nouvelle zone (analyse situationnelle et des capacités; formulation d'un cadre logique et d'un plan d'action; système logisticque, systeme de suivi et de rapport). "]
[null,null,"Journées du personnel senior du siège de la zone par nouvelle zone","jours","4 semaines",20,"n",null,null,{"$f":"+$F$201","v":20},{"$f":"+$F$201","v":20},20,20,20,20,20,20,20]
[null,null,"Journées du personnel intermédiaire du siège de la zone par nouvelle zone","jours","4 semaines",20,"n",null,null,{"$f":"+$F$202","v":20},{"$f":"+$F$202","v":20},20,20,20,20,20,20,20]
[null,null,"Temps nécessaire pour mettre en place et faire fonctionner un nouveau site PEC MAS ambulatoire ou hospitalière (non compris la formation)"]
[null,null,"Journées du personnel senior du siège de la zone par nouveau site PEC MAS ambulatoire ou hospitalière","jours","1 semaine",5,"n",null,null,{"$f":"+$F$204","v":5},{"$f":"+$F$204","v":5},5,5,5,5,5,5,5]
[null,null,"Journées du personnel intermédiaire du siège de la zone par nouveau site PEC MAS ambulatoire ou hospitalière","jours","1 semaine",5,"n",null,null,{"$f":"+$F$205","v":5},{"$f":"+$F$205","v":5},5,5,5,5,5,5,5]
[null,null,"Voyages de personnes au nouveau PEC MAS hospitalière","voyages",null,5,"n",null,null,{"$f":"+$F$206","v":5},{"$f":"+$F$206","v":5},5,5,5,5,5,5,5]
[null,null,"Durée nécessaire pour la gestion continue de la PCMA (système de suivi et de rapport, supervision, contrôle de qualité, gestion financière et du personnel)"]
[null,null,"Journées du personnel senior du siège de la zone par zone et par an","jours","1 jour par mois",12,"n",null,null,{"$f":"+$F$208","v":12},{"$f":"+$F$208","v":12},12,12,12,12,12,12,12]
[null,null,"Journées du personnel intermédiaire du siège de la zone par zone et par an","jours","2 jours par mois",24,"n",null,null,{"$f":"+$F$209","v":24},{"$f":"+$F$209","v":24},24,24,24,24,24,24,24]
[null,null,"Journées du personnel junior du siège de la zone par zone et par an","jours","5 jours par mois",60,"n",null,null,{"$f":"+$F$210","v":60},{"$f":"+$F$210","v":60},60,60,60,60,60,60,60]
[null,null,"Journées du personnel intermédiaire du siège de la zone par site PEC MAS ambulatoire ou hospitalière, par an","jours","1/2 jour par mois",6,"n",null,null,{"$f":"+$F$211","v":6},{"$f":"+$F$211","v":6},6,6,6,6,6,6,6]
[null,null,"Journées du personnel junior du siège de la zone par site PEC MAS ambulatoire ou hospitalière, par an ","jours","1/2 jour par mois",6,"n",null,null,{"$f":"+$F$212","v":6},{"$f":"+$F$212","v":6},6,6,6,6,6,6,6]
[]
[]
[]
[]
[]
["This Row to be hidden",null,"Number of SAM enrolled in Area on average at any time (prevalence)","cases","Number of incidence cases * duration (weeks)(Worksheet 3)/52",{"$f":"+'D9 Variables temps'!F41","v":20.76923076923077},null,null,null,{"$f":"+'D9 Variables temps'!J41","v":0},{"$f":"+'D9 Variables temps'!K41","v":0},{"$f":"+'D9 Variables temps'!L41","v":0},{"$f":"+'D9 Variables temps'!M41","v":0},{"$f":"+'D9 Variables temps'!N41","v":0},{"$f":"+'D9 Variables temps'!O41","v":0},{"$f":"+'D9 Variables temps'!P41","v":0},{"$f":"+'D9 Variables temps'!Q41","v":0},{"$f":"+'D9 Variables temps'!R41","v":0}]

{"sheet":"D4 Prix","index":7,"n_rows":81,"n_cols":18,"rows_kept":81,"cut":false,"hidden":false,"merged":[[1,2,1,6],[70,2,70,4],[61,4,63,4],[48,4,50,4],[8,1,8,8],[20,9,20,17],[21,13,21,17],[21,9,21,12],[10,2,10,8],[12,2,12,8],[14,2,14,8]]}
[]
["Retour au sommaire",null,"D4: Prix (non compris les salaires et les \"fournitures fixes\")"]
[]
[null,"Number of Areas included in study",null,{"$f":"+'D1 Données générales'!G31","v":1}," (taken from Worksheet 2)"]
[]
[null,"Effacez dans cette Feuille toute donnée entrée d'une application précédente de cet Outil en pressant sur ce bouton….."]
[]
[]
[null,"Remplir cette Feuille après avoir rempli les Feuilles de calcul D3 et D8. Soyez complet et donnez des estimations pour tous les intrants à moins que vous ne soyez certain qu'ils ne seront pas inclus dans votre programme, auquel cas vous pouvez mettre  \"0\" dans la cellule concernée.  "]
[]
[null,1,"NOTER dans les cellules couleur or indiquées par u le prix (pour l'année de base et la monnaie choisie dans la Feuille D1) de l'article spécifiée. Utilisez les prix qui se rapportent à la Zone 1. (Le tableau automatiquement transfère ces prix à toutes les autres zones.)"]
[]
[null,2,"VOIR  si les prix dans la Zone 1 sont les mêmes que ceux dans d'autres Zones. S'ils ne le sont, ôtez la protection de la feuille, METTEZ les chiffres corrects dans les colonnes indiquées et  remettez la protection de la Feuille."]
[]
[null,3,"La dernière ligne, 81, (\"Différences salariales\") ne note pas les données sur des prix spécifiques. Elle vous permet d'indiquer les grandes différences salariales entre la Zone 1 (dont la structure salariale détaillée est notée sur la feuille de calcul suivante (D5). Par exemple, si les salaires sont 20% plus élevés dans la Zone 2 comparé à la Zone 1, notez '1,2' dans la dernière ligne sous Zone 2; s'ils sont 20% plus faibles que dans la Zone 1 notez 0,80."]
[]
[]
[null,null,{"$f":"+IF('D1 Données générales'!$H$11=\"\",\"\",'D1 Données générales'!$H$11)","v":"Ghana"},null,null,"Zone 1",null,null,null,"Zone 2","Zone 3","Zone 4","Zone 5","Zone 6","Zone 7","Zone 8","Zone 9","Zone 10"]
[null,null,null,null,{"$f":"'D2 Echelle'!$C$30","v":"district"},{"$f":"+IF('D2 Echelle'!$C$31=\"\",\"\",'D2 Echelle'!$C$31)","v":"Ashiedu Keteke"},null,null,null,{"$f":"+IF('D2 Echelle'!$C$36=\"\",\"\",'D2 Echelle'!$C$36)","v":""},{"$f":"+IF('D2 Echelle'!$C$41=\"\",\"\",'D2 Echelle'!$C$41)","v":""},{"$f":"+IF('D2 Echelle'!$C$46=\"\",\"\",'D2 Echelle'!$C$46)","v":""},{"$f":"+IF('D2 Echelle'!$C$51=\"\",\"\",'D2 Echelle'!$C$51)","v":""},{"$f":"+IF('D2 Echelle'!$C$56=\"\",\"\",'D2 Echelle'!$C$56)","v":""},{"$f":"+IF('D2 Echelle'!$C$61=\"\",\"\",'D2 Echelle'!$C$61)","v":""},{"$f":"+IF('D2 Echelle'!$C$66=\"\",\"\",'D2 Echelle'!$C$66)","v":""},{"$f":"+IF('D2 Echelle'!$C$71=\"\",\"\",'D2 Echelle'!$C$71)","v":""},{"$f":"+IF('D2 Echelle'!$C$76=\"\",\"\",'D2 Echelle'!$C$76)","v":""}]
[null,null,null,null,{"$f":"+'D2 Echelle'!$D$30","v":"région"},{"$f":"+IF('D2 Echelle'!$D$31=\"\",\"\",'D2 Echelle'!$D$31)","v":"Greater Accra"},null,null,null,{"$f":"+IF('D2 Echelle'!$D$36=\"\",\"\",'D2 Echelle'!$D$36)","v":""},{"$f":"+IF('D2 Echelle'!$D$41=\"\",\"\",'D2 Echelle'!$D$41)","v":""},{"$f":"+IF('D2 Echelle'!$D$46=\"\",\"\",'D2 Echelle'!$D$46)","v":""},{"$f":"+IF('D2 Echelle'!$D$51=\"\",\"\",'D2 Echelle'!$D$51)","v":""},{"$f":"+IF('D2 Echelle'!$D$56=\"\",\"\",'D2 Echelle'!$D$56)","v":""},{"$f":"+IF('D2 Echelle'!$D$61=\"\",\"\",'D2 Echelle'!$D$61)","v":""},{"$f":"+IF('D2 Echelle'!$D$66=\"\",\"\",'D2 Echelle'!$D$66)","v":""},{"$f":"+IF('D2 Echelle'!$D$71=\"\",\"\",'D2 Echelle'!$D$71)","v":""},{"$f":"+IF('D2 Echelle'!$D$76=\"\",\"\",'D2 Echelle'!$D$76)","v":""}]
[null,null,"Variables","Unités","Commentaires","Valeurs"]
[]
[null,null,"Location salle (par jour) pour la formation, pour contenir jusqu'à 25 participants",{"$f":"+IF('D1 Données générales'!$H$13=\"\",\"\",'D1 Données générales'!$H$13)","v":"Cedi"},null,120,"u",null,null,{"$f":"+$F$23","v":120},120,120,120,120,120,120,120,120]
[null,null,"Espace pour PEC MAS ambulatoire (par m2 par an)",{"$f":"+IF('D1 Données générales'!$H$13=\"\",\"\",'D1 Données générales'!$H$13)","v":"Cedi"},null,null,"u",null,null,{"$f":"+$F$24","v":0},{"$f":"+$F$24","v":0},0,0,0,0,0,0,0]
[null,null,"Espace pour PEC MAS hospitalière (par m2 par an)",{"$f":"+IF('D1 Données générales'!$H$13=\"\",\"\",'D1 Données générales'!$H$13)","v":"Cedi"},null,null,"u",null,null,{"$f":"+$F$25","v":0},{"$f":"+$F$25","v":0},0,0,0,0,0,0,0]
[null,null,"Rafraîchissements (par personne par jour) ",{"$f":"+IF('D1 Données générales'!$H$13=\"\",\"\",'D1 Données générales'!$H$13)","v":"Cedi"}," ",12,"u",null,null,{"$f":"+$F$26","v":12},12,12,12,12,12,12,12,12]
[null,null,"Espace de stockage (par m2 par an)",{"$f":"+IF('D1 Données générales'!$H$13=\"\",\"\",'D1 Données générales'!$H$13)","v":"Cedi"}," ",null,"u",null,null,{"$f":"+$F27","v":0},0,0,0,0,0,0,0,0]
[null,null,"Indemnités journalières (y compris repas et hébergement mais non pas les transports) par personne et par jour",null,"N'entre en compte que si les participants restent pendant la nuit tel que noté dans les Feuilles de calcul D3 et D8."]
[null,null,"Pour le personnel du  groupe-zones assistant à la formation au siège central",{"$f":"+IF('D1 Données générales'!$H$13=\"\",\"\",'D1 Données générales'!$H$13)","v":"Cedi"},{"$f":"+IF('D8 Statistiques'!$F$29=\"voyagent chaque jour\",\"pas pertinent, laisser en blanc\",\"\")","v":""},null,null,null,null,{"$f":"+IF($E$29=\"pas pertinent, laisser en blanc\",0,$F29)","v":0},{"$f":"+IF($E$29=\"pas pertinent, laisser en blanc\",0,$F29)","v":0},0,0,0,0,0,0,0]
[null,null,"Pour le personnel de la zone assistant à la formation au siège du groupe-zones",{"$f":"+IF('D1 Données générales'!$H$13=\"\",\"\",'D1 Données générales'!$H$13)","v":"Cedi"},{"$f":"+IF('D3 Données épi. démo'!F169=\"voyagent chaque jour\",\"pas pertinent, laisser en blanc\",\"\")","v":""},80,null,null,null,{"$f":"+IF($E$30=\"pas pertinent, laisser en blanc\",0,$F30)","v":80},{"$f":"+IF($E$30=\"pas pertinent, laisser en blanc\",0,$F30)","v":80},80,80,80,80,80,80,80]
[null,null,"Pour les agents de santé de la PEC MAS ambulatoire ou hospitalière assistant à la formation au siège de la zone",{"$f":"+IF('D1 Données générales'!$H$13=\"\",\"\",'D1 Données générales'!$H$13)","v":"Cedi"},{"$f":"+IF('D3 Données épi. démo'!F179=\"voyagent chaque jour\",\"pas pertinent, laisser en blanc\",\"\")","v":""},80,null,null,null,{"$f":"+IF($E$31=\"pas pertinent, laisser en blanc\",0,$F31)","v":80},{"$f":"+IF($E$31=\"pas pertinent, laisser en blanc\",0,$F31)","v":80},80,80,80,80,80,80,80]
[null,null,"Po ur les AEC assistant à la formation au site PEC MAS ambulatoire",{"$f":"+IF('D1 Données générales'!$H$13=\"\",\"\",'D1 Données générales'!$H$13)","v":"Cedi"},{"$f":"+IF('D3 Données épi. démo'!F184=\"voyagent chaque jour\",\"pas pertinent, laisser en blanc\",\"\")","v":"pas pertinent, laisser en blanc"},null,null,null,null,{"$f":"+IF($E$32=\"pas pertinent, laisser en blanc\",0,$F32)","v":0},{"$f":"+IF($E$32=\"pas pertinent, laisser en blanc\",0,$F32)","v":0},0,0,0,0,0,0,0]
[null,null,"Fiches du rapport mensuel",{"$f":"+IF('D1 Données générales'!$H$13=\"\",\"\",'D1 Données générales'!$H$13)","v":"Cedi"},null,0.3,"u",null,null,{"$f":"+$F33","v":0.3},{"$f":"+$F33","v":0.3},0.3,0.3,0.3,0.3,0.3,0.3,0.3]
[null,null,"Médicaments"]
[null,null,"Vitamine A (pour 100 000 gélules UI)",{"$f":"+IF('D1 Données générales'!$H$13=\"\",\"\",'D1 Données générales'!$H$13)","v":"Cedi"},null,0.02,"u",null,null,{"$f":"+$F35","v":0.02},0.02,0.02,0.02,0.02,0.02,0.02,0.02,0.02]
[null,null,"Eau sucrée (par litre)",{"$f":"+IF('D1 Données générales'!$H$13=\"\",\"\",'D1 Données générales'!$H$13)","v":"Cedi"},null,0.05,"u",null,null,0.05,0.05,0.05,0.05,0.05,0.05,0.05,0.05,0.05]
[null,null,"Amoxicilline  (par gramme [g])",{"$f":"+IF('D1 Données générales'!$H$13=\"\",\"\",'D1 Données générales'!$H$13)","v":"Cedi"},null,1,"u",null,null,1,1,1,1,1,1,1,1,1]
[null,null,"Traitement antipaludique (par durée de traitement)",{"$f":"+IF('D1 Données générales'!$H$13=\"\",\"\",'D1 Données générales'!$H$13)","v":"Cedi"},null,3,"u",null,null,{"$f":"+$F38","v":3},3,3,3,3,3,3,3,3]
[null,null,"Test diagnostique du paludisme (par test)",{"$f":"+IF('D1 Données générales'!$H$13=\"\",\"\",'D1 Données générales'!$H$13)","v":"Cedi"},"Pour le prix des tests qui sont faits en laboratoire, vérifiez si les hôpitaux ont fait leurs propres calculs ou utilisent les données sur les prix demandés par des services privés de test.",1,"u",null,null,1,1,1,1,1,1,1,1,1]
[null,null,"Albendazole (par comprimé de 100 mg)",{"$f":"+IF('D1 Données générales'!$H$13=\"\",\"\",'D1 Données générales'!$H$13)","v":"Cedi"},null,0.03,"u",null,null,0.03,0.03,0.03,0.03,0.03,0.03,0.03,0.03,0.03]
[null,null,"ReSoMal (par sachet de 84 g)",{"$f":"+IF('D1 Données générales'!$H$13=\"\",\"\",'D1 Données générales'!$H$13)","v":"Cedi"},null,0.5,"u",null,null,0.5,0.5,0.5,0.5,0.5,0.5,0.5,0.5,0.5]
[null,null,"Ensemble de tests effectués régulièrement chez les enfants hospitalisés avec MAS (autres que pour le paludisme).",{"$f":"+IF('D1 Données générales'!$H$13=\"\",\"\",'D1 Données générales'!$H$13)","v":"Cedi"},{"$f":"+IF('D3 Données épi. démo'!E90=\"\",\"\",'D3 Données épi. démo'!E90)","v":"VIH, Hémoglobine, Glycémie, TB occasionnellement"},5,"u",null,null,{"$f":"+$F$42","v":5},{"$f":"+$F$42","v":5},5,5,5,5,5,5,5]
[null,null,"Kits IV ",{"$f":"+IF('D1 Données générales'!$H$13=\"\",\"\",'D1 Données générales'!$H$13)","v":"Cedi"},null,1,"u",null,null,{"$f":"+$F$43","v":1},{"$f":"+$F$43","v":1},1,1,1,1,1,1,1]
[null,null,"Sondes nasogastriques",{"$f":"+IF('D1 Données générales'!$H$13=\"\",\"\",'D1 Données générales'!$H$13)","v":"Cedi"},null,1,"u",null,null,{"$f":"+$F$44","v":1},{"$f":"+$F$44","v":1},1,1,1,1,1,1,1]
[null,null,"Vaccin contre la rougeole (par dose)",{"$f":"+IF('D1 Données générales'!$H$13=\"\",\"\",'D1 Données générales'!$H$13)","v":"Cedi"},null,1,"u",null,null,1,1,1,1,1,1,1,1,1]
[null,null,"Seringues autodestructibles pour rougeole (par seringue)",{"$f":"+IF('D1 Données générales'!$H$13=\"\",\"\",'D1 Données générales'!$H$13)","v":"Cedi"},null,0.2,"u",null,null,0.2,0.2,0.2,0.2,0.2,0.2,0.2,0.2,0.2]
[null,null,"Seringues pour mélange (par seringue)",{"$f":"+IF('D1 Données générales'!$H$13=\"\",\"\",'D1 Données générales'!$H$13)","v":"Cedi"},null,0.2,"u",null,null,0.2,0.2,0.2,0.2,0.2,0.2,0.2,0.2,0.2]
[null,null,"Prise en charge du patient"]
[null,null,"ATPE (par kg)",{"$f":"+IF('D1 Données générales'!$H$13=\"\",\"\",'D1 Données générales'!$H$13)","v":"Cedi"},"S'ils sont préparés localement ou produits à partir d'ingrédients plutôt que d'être achetés comme produit final, faites simplement la somme des prix des ingrédients nécessaires pour préparer un kilogramme du produit.",6,"u",null,null,{"$f":"+$F49","v":6},6,6,6,6,6,6,6,6]
[null,null,"F-75 (par kg)",{"$f":"+IF('D1 Données générales'!$H$13=\"\",\"\",'D1 Données générales'!$H$13)","v":"Cedi"},null,4.5,"u",null,null,4.5,4.5,4.5,4.5,4.5,4.5,4.5,4.5,4.5]
[null,null,"F-100 (par kg)",{"$f":"+IF('D1 Données générales'!$H$13=\"\",\"\",'D1 Données générales'!$H$13)","v":"Cedi"},null,5,"u",null,null,5,5,5,5,5,5,5,5,5]
[null,null,"Fiche de suivi de la PEC MAS ambulatoire",{"$f":"+IF('D1 Données générales'!$H$13=\"\",\"\",'D1 Données générales'!$H$13)","v":"Cedi"},".",0.6,"u",null,null,0.6,0.6,0.6,0.6,0.6,0.6,0.6,0.6,0.6]
[null,null,"Fiche individuelle de suivi de la PEC MAS hospitalière",{"$f":"+IF('D1 Données générales'!$H$13=\"\",\"\",'D1 Données générales'!$H$13)","v":"Cedi"},null,1,"u"]
[null,null,"Fiche des rations de l'ATPE (par fiche)",{"$f":"+IF('D1 Données générales'!$H$13=\"\",\"\",'D1 Données générales'!$H$13)","v":"Cedi"},null,0.5,"u",null,null,0.5,0.5,0.5,0.5,0.5,0.5,0.5,0.5,0.5]
[null,null,"Bracelets  PB (par bracelet)",{"$f":"+IF('D1 Données générales'!$H$13=\"\",\"\",'D1 Données générales'!$H$13)","v":"Cedi"},null,null,"u",null,null,0,0,0,0,0,0,0,0,0]
[null,null,"Essuie-mains (par rouleaux)",{"$f":"+IF('D1 Données générales'!$H$13=\"\",\"\",'D1 Données générales'!$H$13)","v":"Cedi"},null,1,"u",null,null,1,1,1,1,1,1,1,1,1]
[null,null,"Savon (pièce)",{"$f":"+IF('D1 Données générales'!$H$13=\"\",\"\",'D1 Données générales'!$H$13)","v":"Cedi"},null,0.8,"u",null,null,0.8,0.8,0.8,0.8,0.8,0.8,0.8,0.8,0.8]
[null,null,"Eau de boisson (par litre)",{"$f":"+IF('D1 Données générales'!$H$13=\"\",\"\",'D1 Données générales'!$H$13)","v":"Cedi"},null,0.5,"u",null,null,0.5,0.5,0.5,0.5,0.5,0.5,0.5,0.5,0.5]
[null,null,"Nourriture pour accompagnant dans la PEC MAS hospitalière (par jour)",{"$f":"+IF('D1 Données générales'!$H$13=\"\",\"\",'D1 Données générales'!$H$13)","v":"Cedi"},null,null,"u",null,null,0,0,0,0,0,0,0,0,0]
[null,null,"Fiches de contrôle de stock (par jeu)",{"$f":"+IF('D1 Données générales'!$H$13=\"\",\"\",'D1 Données générales'!$H$13)","v":"Cedi"},"  ",0.1,"u",null,null,0.1,0.1,0.1,0.1,0.1,0.1,0.1,0.1,0.1]
[null,null,"Formation et supervision"]
[null,null,"Matériel pour la supervision du siège de la zone (par visite de supervision)",{"$f":"+IF('D1 Données générales'!$H$13=\"\",\"\",'D1 Données générales'!$H$13)","v":"Cedi"},"Le matériel de supervision peut comprendre des listes de pointage ou d'autres guides. ",0.5,"u",null,null,{"$f":"+$F$62","v":0.5},{"$f":"+$F$62","v":0.5},0.5,0.5,0.5,0.5,0.5,0.5,0.5]
[null,null,"Matériel pour la supervision de la PEC ambulatoire ou hospitalière (par visite de supervision)",{"$f":"+IF('D1 Données générales'!$H$13=\"\",\"\",'D1 Données générales'!$H$13)","v":"Cedi"},null,0.5,"u",null,null,{"$f":"+$F63","v":0.5},0.5,0.5,0.5,0.5,0.5,0.5,0.5,0.5]
[null,null,"Matériel pour la supervision des AEC (par visite de supervision)",{"$f":"+IF('D1 Données générales'!$H$13=\"\",\"\",'D1 Données générales'!$H$13)","v":"Cedi"},null,0.2,"u",null,null,0.2,0.2,0.2,0.2,0.2,0.2,0.2,0.2,0.2]
[null,null,"Matériel de formation par AEC",{"$f":"+IF('D1 Données générales'!$H$13=\"\",\"\",'D1 Données générales'!$H$13)","v":"Cedi"},null,1,"u",null,null,{"$f":"+$F65","v":1},1,1,1,1,1,1,1,1]
[null,null,"Matériel de formation par participant PEC MAS ambulatoire",{"$f":"+IF('D1 Données générales'!$H$13=\"\",\"\",'D1 Données générales'!$H$13)","v":"Cedi"},null,20,"u",null,null,20,20,20,20,20,20,20,20,20]
[null,null,"Matériel de formation par participant PEC MAS hospitalière",{"$f":"+IF('D1 Données générales'!$H$13=\"\",\"\",'D1 Données générales'!$H$13)","v":"Cedi"},null,20,"u",null,null,20,20,20,20,20,20,20,20,20]
[null,null,"Matériel de formation par participant siège de la zone",{"$f":"+IF('D1 Données générales'!$H$13=\"\",\"\",'D1 Données générales'!$H$13)","v":"Cedi"},null,40,"u",null,null,40,40,40,40,40,40,40,40,40]
[null,null,"Matériel de formation par participant groupe-zones (formation complète)",{"$f":"+IF('D1 Données générales'!$H$13=\"\",\"\",'D1 Données générales'!$H$13)","v":"Cedi"},null,25,"u",null,null,{"$f":"+$F$69","v":25},{"$f":"+$F$69","v":25},25,25,25,25,25,25,25]
[null,null,"Matériel de formation par participant zone (recyclage)",{"$f":"+IF('D1 Données générales'!$H$13=\"\",\"\",'D1 Données générales'!$H$13)","v":"Cedi"},null,5,"u",null,null,{"$f":"+$F$70","v":5},{"$f":"+$F$70","v":5},5,5,5,5,5,5,5]
[null,null,"Transport   (NOTE: Le prix par km-personne devrait tenir compte du partage du véhicule (voir Guide de l'utilisateur)"]
[null,null,"Transport du personnel entre le niveau central et le groupe-zones",{"$f":"+IF('D1 Données générales'!$H$13=\"\",\"\",'D1 Données générales'!$H$13)","v":"Cedi"},"Par  km-pers.",2,"u",null,null,{"$f":"+$F$72","v":2},{"$f":"+$F$72","v":2},2,2,2,2,2,2,2]
[null,null,"Transport du personnel entre le siège de la zone et le siège du groupe-zones ",{"$f":"+IF('D1 Données générales'!$H$13=\"\",\"\",'D1 Données générales'!$H$13)","v":"Cedi"},"Par km-pers.",2,"u",null,null,{"$f":"+$F$73","v":2},2,2,2,2,2,2,2,2]
[null,null,"Transport du personnel entre les sites PEC MAS ambulatoire ou hospitalière et le siège de la zone",{"$f":"+IF('D1 Données générales'!$H$13=\"\",\"\",'D1 Données générales'!$H$13)","v":"Cedi"},"Par km-pers.",2,"u",null,null,{"$f":"+$F$74","v":2},2,2,2,2,2,2,2,2]
[null,null,"Transport du personnel entre le village et le site PEC MAS ambulatoire",{"$f":"+IF('D1 Données générales'!$H$13=\"\",\"\",'D1 Données générales'!$H$13)","v":"Cedi"},"Par km-pers.",2,"u",null," ",{"$f":"+$F$75","v":2},2,2,2,2,2,2,2,2]
[null,null,"Transport pour patients référés du site PEC MAS ambulatoire au site PEC MAS hospitalière ",{"$f":"+IF('D1 Données générales'!$H$13=\"\",\"\",'D1 Données générales'!$H$13)","v":"Cedi"},"Par km-pers.",2,"u",null,null,{"$f":"+$F76","v":2},2,2,2,2,2,2,2,2]
[null,null,"Transport des fournitures du niveau central au groupe-zones",{"$f":"+IF('D1 Données générales'!$H$13=\"\",\"\",'D1 Données générales'!$H$13)","v":"Cedi"},"Par km",2,"u",null,null,{"$f":"+$F$77","v":2},2,2,2,2,2,2,2,2]
[null,null,"Transport des fournitures du groupe-zones à la zone ",{"$f":"+IF('D1 Données générales'!$H$13=\"\",\"\",'D1 Données générales'!$H$13)","v":"Cedi"},"Par km",2,"u",null,null,{"$f":"+$F$78","v":2},{"$f":"+$F$78","v":2},2,2,2,2,2,2,2]
[null,null,"Transport des fournitures de la zone aux sites PEC MAS ambulatoire ou hospitalière ",{"$f":"+IF('D1 Données générales'!$H$13=\"\",\"\",'D1 Données générales'!$H$13)","v":"Cedi"},"Par km",2,"u",null,null,{"$f":"+$F$79","v":2},{"$f":"+$F$79","v":2},2,2,2,2,2,2,2]
[null,null,"Transport des fournitures du site PEC ambulatoire aux sites d'extension communautaire ",{"$f":"+IF('D1 Données générales'!$H$13=\"\",\"\",'D1 Données générales'!$H$13)","v":"Cedi"},"Par km",2,"u",null,null,{"$f":"+$F$80","v":2},{"$f":"+$F$80","v":2},2,2,2,2,2,2,2]
[null,null,"Différences salariales",null,"Niveaux salariaux comme proportion de ceux dans la Zone 1 (voir Feuille de calcul D5).",1]

{"sheet":"W6with comments","index":8,"n_rows":94,"n_cols":18,"rows_kept":94,"cut":false,"hidden":true,"merged":[[54,7,55,7],[54,8,55,8],[54,9,54,14],[18,7,18,10],[18,11,18,14],[19,7,20,7],[19,8,20,8],[19,9,19,14],[53,7,53,10],[53,11,53,14]]}
[]
["worksheet 3"]
[null,null,"nighttime supervision"]
[null,null,"minimum staffing on a ward?"]
[null,null,"Maximum number of patients per junior staff member",null,"?",4]
[null,null,"Maximum number of patients per senior staff  member",null,"?",10]
[]
[null,null,"Shelf life of RUTF","months",null,24,null,null,null,{"$f":"+$F$8","v":24},24,24,24,24,24,24,24,24]
[null,null,"Shelf life of F100 and F75","months",null,18]
[]
[]
[]
[]
[]
[]
[]
[]
[]
[null,null,"TABLE 1.  Outpatient Care Site",null,null,null,null,{"$f":"+'D1 Données générales'!$H$14","v":2010},null,null,null,{"$f":"+'D1 Données générales'!$H$13","v":"Cedi"}]
[null,null,null,null,null,null,null,"Price per unit","Average cost per year","Costs for each year in the life of the Outpatient Care site"]
["ghana comments",null,"Supplies ","No. required (at any point in time)","Unit","No. years before need replacing","Average amount per year",null,null,"Year 1","Year 2","Year 3","Year 4","Year 5","Year 6"]
[null,null,"Strong file to store admission /treatment cards",4,"file",1,{"$f":"+D22/F22","v":4},1,{"$f":"+D22/F22*H22","v":4},{"$f":"+D22*H22","v":4},{"$f":"+IF(F22=1,J22,0)","v":4},{"$f":"+IF(OR(F22=1,F22=2),J22,0)","v":4},{"$f":"+IF(OR(F22=1,F22=3),J22,0)","v":4},{"$f":"+IF(OR(F22=1,F22=2,F22=4),J22,0)","v":4},{"$f":"+IF(OR(F22=1,F22=5),J22,0)","v":4}]
[null,null,"Small clock or watch with second hand",2,"clock",3,0.66666666666666663,1,0.66666666666666663,2,0,0,2,0,0]
[null,null,"Bucket – plastic, graduated, lid, 8.5 litres",2,"bucket",5,0.4,1,0.4,2,0,0,0,0,2]
["not needed",null,"Jug – transparent plastic, graduated, 1litre",2,"jug",5,0.4,1,0.4,2,0,0,0,0,2]
["?",null,"Marker pens (permanent ink)",12,"pen",1,12,1,12,12,12,12,12,12,12]
["?",null,"Notebook",4,"notebook",1,4,1,4,4,4,4,4,4,4]
["?",null,"Metal spoons",4,"spoons",5,0.8,1,0.8,4,0,0,0,0,4]
[null,null,"Teaspoons",12,"spoons",5,2.4,1,2.4,12,0,0,0,0,12]
["?",null,"Nail clippers",4,"clippers",5,0.8,1,0.8,4,0,0,0,0,4]
[null,null,"Water carrier -plastic, collapsable, tap, 20 litres",4,"carrier",3,1.3333333333333333,1,1.3333333333333333,4,0,0,4,0,0]
["for sugar water?",null,"Water jug (with lid)",4,"jug",3,1.3333333333333333,1,1.3333333333333333,4,0,0,4,0,0]
["for swabs?",null,"Small metal bowl",4,"bowl",5,0.8,1,0.8,4,0,0,0,0,4]
["2 enough",null,"Thermometer - electronic",4,"thermometer",5,0.8,1,0.8,4,0,0,0,0,4]
["at least one (plus rope and pants)",null,"Additional scales",1,"scales",2,0.5,1,0.5,1,0,1,0,1,0]
["what for",null,"Additional height boards",null,"boards",5,0,1,0,0,0,0,0,0,0]
["ghana data",null,"Additional MUAC bands",20,"bands",0.5,40,0.2,8,4,0,0,0,0,0]
[null,null,"additional calculators",2,"calculator",5,0.4,1,0.4,2,0,0,0,0,2]
["out",null,"weight for height chart",1,"height table",5,0.2,1,0.2,1,0,0,0,0,1]
["out",null,"height board",1,"boards",5,0.2,1,0.2,1,0,0,0,0,1]
[null,null,"scissors",1,"scissors",5,0.2,1,0.2,1,0,0,0,0,1]
[null,null,"stapler and staples",1,"stapler ",1,1,1,1,1,1,1,1,1,1]
["out",null,"beaker – orange plastic( 500 ml)",2,"beaker ",3,0.66666666666666663,1,0.66666666666666663,2,0,0,2,0,0]
[null,null,"Set of communication materials for counselling on health and nutrition",2,"set ",1,2,11,22,22,22,22,22,22,22]
[null,null,"copy of CMAM guidelines",1,"guidelines",3,0.33333333333333331,1,0.33333333333333331,1,0,0,1,0,0]
[null,null,"registration book",1,"book",1,1,1,1,1,1,1,1,1,1]
[null,null,"monthly reporting forms",12,"forms",1,12,1,12,12,12,12,12,12,12]
[null,null,"tally sheets (weekly)",52," sheets",1,52,1,52,52,52,52,52,52,52]
[6,null,"set of cups and spoons",6]
[null,null,"Annual cost for fixed supplies per OCsite",null,null,null,null,null,{"$f":"+SUM(I22:I48)","v":128.23333333333335},{"$f":"SUM(J22:J48)","v":163},108,109,121,109,145]
[]
[]
[]
[null,null,"TABLE 2.  Inpatient Care site",null,null,null,null,{"$f":"+'D1 Données générales'!$H$14","v":2010},null,null,null,{"$f":"+'D1 Données générales'!$H$13","v":"Cedi"}]
[null,null,null,null,null,null,null,"Price per unit","Average cost per year","Costs for each year in the life of the Intpatient Care site"]
[null,null,"Supplies ","Number required (at any point in time)","Unit","No. years before need replacing","Average amount per year",null,null,"Year 1","Year 2","Year 3","Year 4","Year 5","Year 6"]
[null,null,"Strong OCsite file for admission/treatment cards",4,"file",1,{"$f":"+D57/F57","v":4},{"$f":"+H22","v":1},{"$f":"+D57/F57*H57","v":4},{"$f":"+D57*H57","v":4},{"$f":"+IF(F57=1,J57,0)","v":4},{"$f":"+IF(OR(F57=1,F57=2),J57,0)","v":4},{"$f":"+IF(OR(F57=1,F57=3),J57,0)","v":4},{"$f":"+IF(OR(F57=1,F57=2,F57=4),J57,0)","v":4},{"$f":"+IF(OR(F57=1,F57=5),J57,0)","v":4}]
[null,null,"Small clock or watch with second hand",2,"clock",3,0.66666666666666663,{"$f":"+H23","v":1},0.66666666666666663,2,0,0,2,0,0]
[null,null,"Bucket – plastic, graduated, lid, 8.5 litres",2,"bucket",5,0.4,1,0.4,2,0,0,0,0,2]
["for mixing milk",null,"Jug – transparent plastic, graduated, 1litre",2,"jug",5,0.4,1,0.4,2,0,0,0,0,2]
[null,null,"Marker pens (permanent ink)",12,"pen",1,12,1,12,12,12,12,12,12,12]
[null,null,"Notebook",4,"notebook",1,4,1,4,4,4,4,4,4,4]
["for measuring",null,"Metal spoons",4,"spoons",5,0.8,1,0.8,4,0,0,0,0,4]
["no",null,"Teaspoons",12,"spoons",5,2.4,1,2.4,12,0,0,0,0,12]
[null,null,"Nail clippers",4,"clippers",5,0.8,1,0.8,4,0,0,0,0,4]
[null,null,"Water carrier -plastic, collapsible, tap, 20 litres",4,"carrier",3,1.3333333333333333,1,1.3333333333333333,4,0,0,4,0,0]
[null,null,"Water jug (with lid)",4,"jug",3,1.3333333333333333,1,1.3333333333333333,4,0,0,4,0,0]
[null,null,"Small metal bowl",4,"bowl",5,0.8,1,0.8,4,0,0,0,0,4]
[null,null,"Thermometer - electronic",4,"thermometer",5,0.8,1,0.8,4,0,0,0,0,4]
[null,null,"Additional scales",1,"scales",2,0.5,1,0.5,1,0,1,0,1,0]
["???",null,"Additional height boards",null,"boards",5,0,1,0,0,0,0,0,0,0]
[null,null,"Additional MUAC bands",500,"bands",1,500,0.2,100,100,100,100,100,100,100]
[null,null,"Additional calculators",null,"calculator",5,0,1,0,0,0,0,0,0,0]
[null,null,"weight for height chart",1,"height table",5,0.2,1,0.2,1,0,0,0,0,1]
[null,null,"height board",1,"boards",5,0.2,1,0.2,1,0,0,0,0,1]
[null,null,"scissors",1,"scissors",5,0.2,1,0.2,1,0,0,0,0,1]
[null,null,"stapler and staples",1,"stapler ",1,1,1,1,1,1,1,1,1,1]
[null,null,"Beaker – orange plastic (500 ml)",2,"beaker ",3,0.66666666666666663,1,0.66666666666666663,2,0,0,2,0,0]
[null,null,"Set of communication materials for counselling on health and nutrition",2,"set ",1,2,11,22,22,22,22,22,22,22]
[null,null,"copy of CMAM guidelines",1,"guidelines",3,0.33333333333333331,1,0.33333333333333331,1,0,0,1,0,0]
[null,null,"registration book",1,"book",1,1,1,1,1,1,1,1,1,1]
[null,null,"monthly reporting forms",12,"forms",1,12,1,12,12,12,12,12,12,12]
[null,null,"tally sheets",12," sheets",1,12,1,12,12,12,12,12,12,12]
["beakers and spoons for formula milk"]
["food scale (up to 10 kg) for weighing milks?"]
[null,null,"Specifically for ICsite",null,null,null,null,null,null,{"$f":"SUM(J57:J83)","v":217},168,169,181,169,203]
[null,null,"equipment",null,null," ",null,null,200]
[null,null,"space",null,null,"m2"]
[null,null,"Cots for children",{"$f":"+'D9 Variables temps'!$F$42*'D3 Données épi. démo'!$F$29/365","v":0.96575342465753422},"(no SAM cases with complications * days inIC /365"]
[null,null,"Beds for carer"]
[null,null," "]
[]
[]
[null,null,"Annual cost for fixed supplies per ICsite",null,null,null,null,null,{"$f":"+SUM(I57:I93)","v":379.83333333333331}]

{"sheet":"D5 Salaires","index":9,"n_rows":41,"n_cols":12,"rows_kept":41,"cut":false,"hidden":false,"merged":[[7,2,7,9],[30,2,30,3],[17,5,17,7],[9,2,9,9],[13,2,13,9],[11,2,11,9],[17,9,17,10]]}
[]
["Retour au sommaire",null,"D5: Salaires                     "]
[]
[]
[null,"Effacez dans cette Feuille toute donnée entrée d'une application précédente de cet Outil en pressant sur ce bouton ……….."]
[]
[]
[null,1,"Identifiez les types de personnel responsable pour les activités décrites dans la seconde colonne de ce Tableau et NOTEZ leurs titres dans la troisième colonne du Tableau."]
[]
[null,2,"Consultez les ressources humaines et NOTEZ les salaires et avantages annuels (pour l'année de base définie dans la Feuille de calcul D1) pour chaque catégorie de personnel identifié ci-dessous. S'il existe une gamme de valeurs (le salaire peut dépendre de la durée du service ou de l'emplacement), choisissez la valeur typique de cette catégorie d'agent dans la Zone 1 et le siège de son groupe-zones. "]
[]
[null,3,"Si les formateurs touchent des honoraires, NOTEZ la valeur de ces honoraires (exprimés comme taux quotidiens) dans la dernière colonne. Sinon, laissez en blanc cette colonne ou notez \"0\". "]
[]
[null,4,"VERIFIEZ que les valeurs que vous avez notées dans la dernière ligne de la Feuille de calcul précédente (D4) reflètent comment les différents salaires dans d'autre zones se comparent aux salaires de la Zone 1 que vous avez notés ici.   "]
[]
[]
[null,null,{"$f":"+IF('D1 Données générales'!$H$11=\"\",\"\",'D1 Données générales'!$H$11)","v":"Ghana"}]
[null,null,null,null,null,{"$f":"+J18","v":"Cedi"},null,null,null,{"$f":"+IF('D1 Données générales'!$H$13=\"\",\"\",'D1 Données générales'!$H$13)","v":"Cedi"}]
[null,null,"Agents de santé et autre personnel","Fonctions qu'ils exécutent","Spécifiez type (médecin, infirmier, sage-femme, etc.)","Salaire annuel moyen","Avantages ou indemnités annuels (par exemple, uniforme)","Total revenus annuels","Jours ouvrables dans l'année","Total revenus quotidiens","Taux quotidien des honoraires donnés aux formateurs ou aux volontaires"]
[null,null,"Au siège national",null,null,null,null,null,{"$f":"+'D3 Données épi. démo'!F36","v":260}]
[null,null,"Personnel senior siège national","Gestion de la PCMA, système de suivi et de rapport inclu.","Nutritionniste chef de service",18000,null,{"$f":"+SUM(F21:G21)","v":18000},{"$f":"+'D3 Données épi. démo'!$F$36","v":260},{"$f":"+H21/I21","v":69.230769230769226},null,"u"]
[null,null,"Personnel intermédiaire siège national","Assistance pour mettre en place la PCMA et la gestion régulière, formation des gestionnaires du groupe-zones, système de suivi et de rapport inclu.","Nutritionniste",14400,null,{"$f":"+SUM(F22:G22)","v":14400},{"$f":"+'D3 Données épi. démo'!$F$36","v":260},{"$f":"+H22/I22","v":55.384615384615387},50,"u"]
[null,null,"Au siège du groupe-zones"]
[null,null,"Personnel senior du siège groupe-zones","Gestion de la PCMA.","Nutritionniste coordinateur régional",12000,null,{"$f":"+SUM(F24:G24)","v":12000},{"$f":"+'D3 Données épi. démo'!$F$36","v":260},{"$f":"+H24/I24","v":46.153846153846153},null,"u"]
[null,null,"Personnel intermédiaire du siège du groupe-zones","Supervision et formation du personnel du siège de la zone.","Nutritionniste de la zone",9600,null,{"$f":"+SUM(F25:G25)","v":9600},{"$f":"+'D3 Données épi. démo'!$F$36","v":260},{"$f":"+H25/I25","v":36.92307692307692},50,"u"]
[null,null,"Personnel junior du siège du groupe-zones","Système de suivi et de rapport: collecte et analyse de données et assistance à d'autres tâches de gestion.","Nutritionniste assistante",4800,null,{"$f":"+SUM(F26:G26)","v":4800},{"$f":"+'D3 Données épi. démo'!$F$36","v":260},{"$f":"+H26/I26","v":18.46153846153846},null,"u"]
[null,null,"Au siège de la zone"]
[null,null,"Personnel senior du siège de la zone ","Gestion de la PCMA.","Nutritionniste coordinateur du district",9600,null,{"$f":"+SUM(F28:G28)","v":9600},{"$f":"+'D3 Données épi. démo'!$F$36","v":260},{"$f":"+H28/I28","v":36.92307692307692},null,"u"]
[null,null,"Personnel intermédiaire du siège de la zone","Supervision et formation des sites PEC MAS ambulatoire/hospitalière.","Nutritionniste du district",4800,null,{"$f":"+SUM(F29:G29)","v":4800},{"$f":"+'D3 Données épi. démo'!$F$36","v":260},{"$f":"+H29/I29","v":18.46153846153846},50,"u"]
[null,null,"Personnel junior du siège de la zone","Système de suivi et de rapport: collecte et analyse de données et soutien pour le personnel intermédiaire et senior.","Nutritionniste assistante",4800,null,{"$f":"+SUM(F30:G30)","v":4800},{"$f":"+'D3 Données épi. démo'!$F$36","v":260},{"$f":"+H30/I30","v":18.46153846153846},null,"u"]
[null,null,"Au site ambulatoire- agents de santé"]
[null,null,"Personnel senior  ","Prise en charge des cas de MAS, mise en place de l'extension communautaire, formation des agents d'extension communautaire, suivi et rapport.","Assistant médical, infirmier, sage-femme",10200,null,{"$f":"+SUM(F32:G32)","v":10200},{"$f":"+'D3 Données épi. démo'!$F$36","v":260},{"$f":"+H32/I32","v":39.230769230769234},50,"u"]
[null,null,"Personnel junior ","Assistance pour la prise en charge des cas de MAS, supervision des agents d'extension communautaire, assistance pour mettre en place l'extension communautaire, suivi et rapport.","Nutritionniste assistante",4800,null,{"$f":"+SUM(F33:G33)","v":4800},{"$f":"+'D3 Données épi. démo'!$F$36","v":260},{"$f":"+H33/I33","v":18.46153846153846},null,"u"]
[null,null,{"$f":"+IF('D3 Données épi. démo'!F77=\"\",\"\",'D3 Données épi. démo'!F77)","v":"Volontaire"},"Extension communautaire de la PCMA dans la communauté.  ",null,null,null,{"$f":"+SUM(F34:G34)","v":0},{"$f":"+'D3 Données épi. démo'!$F$36","v":260},{"$f":"+H34/I34","v":0},0,"u"]
[null,null,"Au site hospitalier- agents de santé"]
[null,null,"Personnel senior  ","Supervision interne des agents de santé, prise en charge des enfants avec MAS avec complications,  suivi et rapport.","Médecin/Pédiatre",21600,null,{"$f":"+SUM(F36:G36)","v":21600},{"$f":"+'D3 Données épi. démo'!$F$36","v":260},{"$f":"+H36/I36","v":83.07692307692308},50,"u"]
[null,null,"Personnel intermédiaire",null,"Infirmier/Diététicien",9600,null,{"$f":"+SUM(F37:G37)","v":9600},{"$f":"+'D3 Données épi. démo'!$F$36","v":260},null,null,"u"]
[null,null,"Personnel junior","Assistance pour prendre en charge les cas de MAS avec complications, la préparation des aliments thérapeutiques, suivi et rapport.","ASC/Infirmier assistant",3000,null,{"$f":"+SUM(F38:G38)","v":3000},{"$f":"+'D3 Données épi. démo'!$F$36","v":260},{"$f":"+H38/I38","v":11.538461538461538},null,"u"]
[null,null,"Autres agents (tous les niveaux)"]
[null,null,"Chauffeur ","Conduite des voitures pour le transports des fournitures ou des gens.","Chauffeur",1800,null,{"$f":"+SUM(F40:G40)","v":1800},{"$f":"+'D3 Données épi. démo'!$F$36","v":260},{"$f":"+H40/I40","v":6.9230769230769234},null,"u"]
[null,null,"Gardien","Garde des stocks d'aliment thérapeutique.","Gardien",1200,null,{"$f":"+SUM(F41:G41)","v":1200},{"$f":"+'D3 Données épi. démo'!$F$36","v":260},{"$f":"+H41/I41","v":4.615384615384615},null,"u"]

{"sheet":"D6 Fournitures fixes","index":10,"n_rows":121,"n_cols":17,"rows_kept":121,"cut":false,"hidden":false,"merged":[[73,2,74,4],[1,2,1,11],[9,2,9,15],[11,2,11,15],[19,2,19,15],[15,2,15,15],[75,8,76,8],[75,9,76,9],[75,10,75,15],[29,8,29,11],[29,12,29,15],[30,10,30,15],[74,8,74,11],[74,12,74,15],[30,9,31,9],[30,8,31,8]]}
[]
["Retour au sommaire",null,"D6:  Fournitures fixes (pour les sites PEC MAS ambulatoire et \nles sites PEC MAS hospitalière)"]
[]
[]
[null,null,"Effacez dans cette Feuille toute donnée entrée d'une application précédente de cet Outil en pressant sur ce bouton ……….."]
[]
[]
[null,"TABLEAU 1   (Sites PEC MAS ambulatoire)"]
[]
[null,1,"NOTER dans les cellules en or (indiquées par u) de la colonne intitulée \"Nombre effectif utilisé\" le nombre des articles spécifiés que vous avez l'intention de mettre dans chaque site PEC MAS ambulatoire. La colonne précédente des cellules vert foncé (indiquées par n) donne les valeurs recommandées, que vous devriez utiliser à moins que vous n'ayez des raisons de penser que les quantités devraient être différentes. "]
[]
[null,2,"NOTER  dans les cellules en or de la colonne intitulée \"Prix par unité\" les prix (pour l'année de base définie dans la Feuille de calcul D1) de l'article spécifié. Vérifiez que les unités appropriées sont attachées au prix et vérifiez que le prix comprend tous les éléments pertinents (empaquetage et transport au site)."]
[]
[null,3,"AJOUTER, dans les lignes vides à la fin du Tableau 1,toute fourniture supplémentaire que vous jugez nécessaire ainsi que leurs quantités, durée d'utilisation prévue et prix par unité. "]
[]
[null,4,"(Facultatif). REVOIR les hypothèses implicites fixées par l'Outil pour la durée d'utilisation (\"Nombre d'années avant d'être remplacées\"). Si les hypothèses ne conviennent pas, ôtez la protection de la feuille et ensuite procédez aux changements nécessaires et remettez la protection de la Feuille. "]
[]
[null,"TABLEAU 2   (Sites PEC MAS hospitalière)"]
[]
[null,5,"REMPLIR le Tableau 2 (pour les sites PEC MAS hospitalière) comme pour le Tableau 1.  "]
[]
[]
[]
[]
[null,null,{"$f":"+IF('D1 Données générales'!$H$11=\"\",\"\",'D1 Données générales'!$H$11)","v":"Ghana"}]
[]
[]
[null,null,"Nombre d'ensembles de fournitures pour chaque site PEC MAS ambulatoire",null,null,1,"n"]
[]
[null,null,null,null,null,null,null,null,{"$f":"+IF('D1 Données générales'!$H$14=\"\",\"\",'D1 Données générales'!$H$14)","v":2010},null,{"$f":"+IF('D1 Données générales'!$H$14=\"\",\"\",'D1 Données générales'!$H$14)","v":2010},null,{"$f":"+IF('D1 Données générales'!$H$13=\"\",\"\",'D1 Données générales'!$H$13)","v":"Cedi"},{"$f":"+IF('D1 Données générales'!$H$13=\"\",\"\",'D1 Données générales'!$H$13)","v":"Cedi"},{"$f":"+IF('D1 Données générales'!$H$13=\"\",\"\",'D1 Données générales'!$H$13)","v":"Cedi"},{"$f":"+IF('D1 Données générales'!$H$13=\"\",\"\",'D1 Données générales'!$H$13)","v":"Cedi"}]
[null,null,"TABLEAU 1. Site PEC MAS ambulatoire",null,null,null,null,null,"Prix par unité","Coût moyen par an","Coûts pour chaque année de la durée du site PEC MAS ambulatoire"]
[null,null,"Fournitures","Nombre RECOMMANDÉ ","Nombre EFFECTIF utilisé","Unité","Nombre d'années avant d'être remplacées","Quantité moyenne par an",null,null," 1ere année","2e année","3e année","4e année","5e année","6e année"]
[null,null,"Chemise solide pour mettre les fiches d'admission/traitement",4,4,"chemise",1,{"$f":"+IF(ISERROR(E33/G33),,E33/G33)","v":4},4,{"$f":"+IF(ISERROR(E33/G33*I33),,E33/G33*I33)","v":16},{"$f":"+IF(ISERROR(E33*I33),,E33*I33)","v":16},{"$f":"+IF(G33=1,K33,0)","v":16},{"$f":"+IF(OR(G33=1,G33=2),K33,0)","v":16},{"$f":"+IF(OR(G33=1,G33=3),K33,0)","v":16},{"$f":"+IF(OR(G33=1,G33=2,G33=4),K33,0)","v":16},{"$f":"+IF(OR(G33=1,G33=5),K33,0)","v":16},"nu "]
[null,null,"Petit réveil ou montre avec deux aiguilles",2,1,"réveil",3,0.33333333333333331,15,5,15,0,0,15,0,0,"nu "]
[null,null,"Seau – plastique, gradué, couvercle, 8,5 litres",2,1,"seau",5,0.2,6,1.2000000000000002,6,0,0,0,0,6,"nu "]
[null,null,"Cruche – transparente en plastique, graduée, 1 litre",2,2,"cruche",5,0.4,3,1.2000000000000002,6,0,0,0,0,6,"nu "]
[null,null,"Feutres (encre indélébile)",12,1,"feutre",1,1,2,2,2,2,2,2,2,2,"nu "]
[null,null,"Carnet",4,1,"carnet",1,1,4,4,4,4,4,4,4,4,"nu "]
[null,null,"Cuillères en métal",4,2,"cuillère",5,0.4,1,0.4,2,0,0,0,0,2,"nu "]
[null,null,"Petites cuillères",12,2,"cuillère",5,0.4,0.2,8.0000000000000016E-2,0.4,0,0,0,0,0.4,"nu "]
[null,null,"Coupe-ongles",4,1,"coupe-ongle",5,0.2,10,2,10,0,0,0,0,10,"nu "]
[null,null,"Seau pour porter l'eau -en plastique, couvercle, 20 litres",4,1,"seau",3,0.33333333333333331,10,3.333333333333333,10,0,0,10,0,0,"nu "]
[null,null,"Cruche à eau (avec couvercle)",4,2,"cruche",3,0.66666666666666663,4,2.6666666666666665,8,0,0,8,0,0,"nu "]
[null,null,"Petit bol en métal",4,2,"bol",5,0.4,0.5,0.2,1,0,0,0,0,1,"nu "]
[null,null,"Thermomètre électronique",2,1,"thermomètre",5,0.2,5,1,5,0,0,0,0,5,"nu "]
[null,null,"Balance enfant avec gradation 100 g",1,1,"balance",5,0.2,150,30,150,0,0,0,0,150,"nu "]
[null,null,"Balance adulte/balance électronique",1,1,"balance",5,0.2,175,35,175,0,0,0,0,175,"nu "]
[null,null,"Bracelets PB ",20,10,"bracelet",0.5,20,1.5,30,15,0,0,0,0,0,"nu "]
[null,null,"Calculatrices ",2,1,"calculatrice",5,0.2,5,1,5,0,0,0,0,5,"nu "]
[null,null,"Courbe poids pour taille",1,1,"tableau",5,0.2,0,0,0,0,0,0,0,0,"nu "]
[null,null,"Toises ",1,0,"toise",5,0,null,0,0,0,0,0,0,0,"nu "]
[null,null,"Ciseaux",1,1,"ciseaux",5,0.2,1.5,0.30000000000000004,1.5,0,0,0,0,1.5,"nu "]
[null,null,"Agrafeuses et agrafes",1,1,"agrafeuses",1,1,5,5,5,5,5,5,5,5,"nu "]
[null,null,"Gobelet – plastique en orange ( 500 ml)",2,2,"gobelet ",3,0.66666666666666663,1,0.66666666666666663,2,0,0,2,0,0,"nu "]
[null,null,"Jeu de matériel de communication pour les conseils en santé et en nutrition",2,1,"jeu",1,1,20,20,20,20,20,20,20,20,"nu "]
[null,null,"Aides au travail pour le personnel",1,1,"jeu",1,1,30,30,30,30,30,30,30,30,"nu "]
[null,null,"Exemplaire des directives de la PCMA",1,1,"directive",3,0.33333333333333331,50,16.666666666666664,50,0,0,50,0,0,"nu "]
[null,null,"Registre",1,1,"registre",1,1,2.5,2.5,2.5,2.5,2.5,2.5,2.5,2.5,"nu "]
[null,null,"Fiches de rapport mensuel",12,12,"fiche",1,12,0.2,2.4000000000000004,2.4000000000000004,2.4000000000000004,2.4000000000000004,2.4000000000000004,2.4000000000000004,2.4000000000000004,"nu "]
[null,null,"Fiches de pointage (mensuelles)",12,12," fiche",1,12,0.2,2.4000000000000004,2.4000000000000004,2.4000000000000004,2.4000000000000004,2.4000000000000004,2.4000000000000004,2.4000000000000004,"nu "]
[null,null,"Ensemble de tasses et cuillères",6,6,"jeu ",1,6,2,12,12,12,12,12,12,12,"nu "]
[null,null,"Toises supplémentaires",1,0,"toise",5,{"$f":"+IF(ISERROR(E62/G62),,E62/G62)","v":0},null,{"$f":"+IF(ISERROR(E62/G62*I62),,E62/G62*I62)","v":0},{"$f":"+IF(ISERROR(E62*I62),,E62*I62)","v":0},{"$f":"+IF(G62=1,K62,0)","v":0},{"$f":"+IF(OR(G62=1,G62=2),K62,0)","v":0},{"$f":"+IF(OR(G62=1,G62=3),K62,0)","v":0},{"$f":"+IF(OR(G62=1,G62=2,G62=4),K62,0)","v":0},{"$f":"+IF(OR(G62=1,G62=5),K62,0)","v":0},"nu "]
[null,null,"Articles supplémentaires",null,null,null,null,null," "]
[null,null,null,null,null,null,null,{"$f":"+IF(ISERROR(E64/G64),,E64/G64)","v":0},null,{"$f":"+IF(ISERROR(E64/G64*I64),,E64/G64*I64)","v":0},{"$f":"+IF(ISERROR(E64*I64),,E64*I64)","v":0},{"$f":"+IF(G64=1,K64,0)","v":0},{"$f":"+IF(OR(G64=1,G64=2),K64,0)","v":0},{"$f":"+IF(OR(G64=1,G64=3),K64,0)","v":0},{"$f":"+IF(OR(G64=1,G64=2,G64=4),K64,0)","v":0},{"$f":"+IF(OR(G64=1,G64=5),K64,0)","v":0},"u"]
[null,null,null,null,null,null,null,0,null,0,0,0,0,0,0,0,"u"]
[null,null,null,null,null,null,null,0,null,0,0,0,0,0,0,0,"u"]
[null,null,null,null,null,null,null,0,null,0,0,0,0,0,0,0,"u"]
[null,null,null,null,null,null,null,0,null,0,0,0,0,0,0,0,"u"]
[null,null,null,null,null,null,null,0,null,0,0,0,0,0,0,0,"u"]
[null,null,null,null,null,null,null,0,null,0,0,0,0,0,0,0,"u"]
[null,null,"Coût annuel pour les fournitures fixes du site PEC MAS ambulatoire",null,null,null,null,null,null,{"$f":"+SUM(J33:J70)","v":227.01333333333332},{"$f":"SUM(K33:K70)","v":558.19999999999993},96.300000000000011,96.300000000000011,181.3,96.300000000000011,458.19999999999993]
[]
[]
[null,null,"Nombre d'ensembles de fournitures pour chaque site PEC MAS hospitalière",null,null,1]
[null,null,null,null,null,null,null,null,{"$f":"+IF('D1 Données générales'!$H$14=\"\",\"\",'D1 Données générales'!$H$14)","v":2010},null,{"$f":"+IF('D1 Données générales'!$H$14=\"\",\"\",'D1 Données générales'!$H$14)","v":2010},null,{"$f":"+IF('D1 Données générales'!$H$13=\"\",\"\",'D1 Données générales'!$H$13)","v":"Cedi"},{"$f":"+IF('D1 Données générales'!$H$13=\"\",\"\",'D1 Données générales'!$H$13)","v":"Cedi"},{"$f":"+IF('D1 Données générales'!$H$13=\"\",\"\",'D1 Données générales'!$H$13)","v":"Cedi"},{"$f":"+IF('D1 Données générales'!$H$13=\"\",\"\",'D1 Données générales'!$H$13)","v":"Cedi"}]
["Retour en haut",null,"TABLEAU 2.  Site PEC MAS hospitalière",null,null,null,null,null,"Prix par unité","Coût moyen par an","Coûts pour chaque année de la durée du site PEC MAS hospitalière"]
[null,null,"Fournitures ","Nombre RECOMMANDÉ ","Nombre EFFECTIF utilisé","Unité","Nombre d'années avant d'être remplacées","Quantité moyenne par an",null,null,"1ere année","2 année","3e année","4e année","5e année","6e année"]
[null,null,"Chemise solide pour les fiches de traitement",{"$f":"+D33","v":4},4,"chemise",{"$f":"+G33","v":1},{"$f":"+IF(ISERROR(E78/G78),,E78/G78)","v":4},{"$f":"+I33","v":4},{"$f":"+IF(ISERROR(E78/G78*I78),,E78/G78*I78)","v":16},{"$f":"+IF(ISERROR(E78*I78),,E78*I78)","v":16},{"$f":"+IF(G78=1,K78,0)","v":16},{"$f":"+IF(OR(G78=1,G78=2),K78,0)","v":16},{"$f":"+IF(OR(G78=1,G78=3),K78,0)","v":16},{"$f":"+IF(OR(G78=1,G78=2,G78=4),K78,0)","v":16},{"$f":"+IF(OR(G78=1,G78=5),K78,0)","v":16},"u"]
[null,null,"Petit réveil ou montre avec deux aiguilles",{"$f":"+D34","v":2},1,"réveil",3,0.33333333333333331,{"$f":"+I34","v":15},5,15,0,0,15,0,0,"u"]
[null,null,"Seau – plastique, gradué, couvercle, 8,5 litres",2,1,"seau",5,0.2,6,1.2000000000000002,6,0,0,0,0,6,"u"]
[null,null,"Cruche – transparente en plastique, graduée, 1 litre",2,2,"cruche",5,0.4,3,1.2000000000000002,6,0,0,0,0,6,"u"]
[null,null,"Feutres (encre inélébile)",12,1,"feutre",1,1,2,2,2,2,2,2,2,2,"u"]
[null,null,"Carnet",4,1,"carnet",1,1,4,4,4,4,4,4,4,4,"u"]
[null,null,"Cuillères en métal",4,2,"cuillère",5,0.4,1,0.4,2,0,0,0,0,2,"u"]
[null,null,"Petites cuillères",12,2,"cuillère",5,0.4,0.2,8.0000000000000016E-2,0.4,0,0,0,0,0.4,"u"]
[null,null,"Coupe-ongles",4,1,"coupe-ongle",5,0.2,10,2,10,0,0,0,0,10,"u"]
[null,null,"Seau pour porter l'eau -en plastique, couvercle, 20 litres ",4,1,"seau",3,0.33333333333333331,10,3.333333333333333,10,0,0,10,0,0,"u"]
[null,null,"Cruche à eau (avec couvercle)",4,2,"cruche",3,0.66666666666666663,4,2.6666666666666665,8,0,0,8,0,0,"u"]
[null,null,"Petit bol en métal",4,2,"bol",5,0.4,0.5,0.2,1,0,0,0,0,1,"u"]
[null,null,"Thermomètre - électronique",2,1,"thermomètre",5,0.2,5,1,5,0,0,0,0,5,"u"]
[null,null,"Balance enfant avec graduation 100 grammes",1,1,"balance",5,0.2,150,30,150,0,0,0,0,150,"u"]
[null,null,"Balance adulte/électronique",1,1,"balance",5,0.2,175,35,175,0,0,0,0,175,"u"]
[null,null,"Bracelets PB",{"$f":"+D48","v":20},10,"bracelet",{"$f":"+G48","v":0.5},20,{"$f":"+I48","v":1.5},30,15,0,0,0,0,0,"u"]
[null,null,"Calculatrices",2,1,"calculatrice",5,0.2,{"$f":"+I49","v":5},1,5,0,0,0,0,5,"u"]
[null,null,"Courbe poids pour taille",1,1,"tableau",5,0.2,0,0,0,0,0,0,0,0,"u"]
[null,null,"Toises ",1,0,"toise",5,0,0,0,0,0,0,0,0,0,"u"]
[null,null,"Ciseaux",1,1,"ciseaux",5,0.2,1.5,0.30000000000000004,1.5,0,0,0,0,1.5,"u"]
[null,null,"Agrafeuses et agrafes",1,1,"agrafeuse",1,1,5,5,5,5,5,5,5,5,"u"]
[null,null,"Gobelet – orange en plastique (500 ml)",2,2,"gobelet",3,0.66666666666666663,1,0.66666666666666663,2,0,0,2,0,0,"u"]
[null,null,"Jeu de matériel de communication pour les conseils en santé et nutrition",2,1,"jeu",1,1,20,20,20,20,20,20,20,20,"u"]
[null,null,"Aides au travail pour le personnel",1,1,"jeu",1,1,30,30,30,30,30,30,30,30,"u"]
[null,null,"Exemplaire des directives de la PCMA",1,1,"directive",3,0.33333333333333331,50,16.666666666666664,50,0,0,50,0,0,"u"]
[null,null,"Registres",1,1,"registre",1,1,2.5,2.5,2.5,2.5,2.5,2.5,2.5,2.5,"u"]
[null,null,"Fiches de rapport mensuel",12,12,"fiche",1,12,0.2,2.4000000000000004,2.4000000000000004,2.4000000000000004,2.4000000000000004,2.4000000000000004,2.4000000000000004,2.4000000000000004,"u"]
[null,null,"Fiches de pointage (mensuelles)",12,12,"fiche",1,12,0.2,2.4000000000000004,2.4000000000000004,2.4000000000000004,2.4000000000000004,2.4000000000000004,2.4000000000000004,2.4000000000000004,"u"]
[null,null,"Ensemble de tasses et cuillères",6,6,"jeu",1,6,2,12,12,12,12,12,12,12,"u"]
[null,null,"Pèse-bébé avec graduation 10 grammes",1,1,"balance",3,0.33333333333333331,193,{"$f":"+IF(ISERROR(E107/G107*I107),,E107/G107*I107)","v":64.333333333333329},{"$f":"+IF(ISERROR(E107*I107),,E107*I107)","v":193},{"$f":"+IF(G107=1,K107,0)","v":0},{"$f":"+IF(OR(G107=1,G107=2),K107,0)","v":0},{"$f":"+IF(OR(G107=1,G107=3),K107,0)","v":193},{"$f":"+IF(OR(G107=1,G107=2,G107=4),K107,0)","v":0},{"$f":"+IF(OR(G107=1,G107=5),K107,0)","v":0},"nu "]
[null,null,"Pèse-aliment (jusqu'à 10 kg) pour peser le lait en poudre",1,1,"balance",3,0.33333333333333331,50,16.666666666666664,50,0,0,50,0,0,"nu "]
[null,null,"Articles supplémentaires"]
[null,null,null,null,null,null,null,{"$f":"+IF(ISERROR(E110/G110),,E110/G110)","v":0},null,{"$f":"+IF(ISERROR(E110/G110*I110),,E110/G110*I110)","v":0},{"$f":"+IF(ISERROR(E110*I110),,E110*I110)","v":0},{"$f":"+IF(G110=1,K110,0)","v":0},{"$f":"+IF(OR(G110=1,G110=2),K110,0)","v":0},{"$f":"+IF(OR(G110=1,G110=3),K110,0)","v":0},{"$f":"+IF(OR(G110=1,G110=2,G110=4),K110,0)","v":0},{"$f":"+IF(OR(G110=1,G110=5),K110,0)","v":0},"u"]
[null,null,null,null,null,null,null,0,null,0,0,0,0,0,0,0,"u"]
[null,null,null,null,null,null,null,0,null,0,0,0,0,0,0,0,"u"]
[null,null,null,null,null,null,null,0,null,0,0,0,0,0,0,0,"u"]
[null,null,null,null,null,null,null,0,null,0,0,0,0,0,0,0,"u"]
[null,null,null,null,null,null,null,0,null,0,0,0,0,0,0,0,"u"]
[null,null,null,null,null,null,null,0,null,0,0,0,0,0,0,0,"u"]
[null,null,null,null,null,null,null,0,null,0,0,0,0,0,0,0,"u"]
[null,null,null,null,null,null,null,0,null,0,0,0,0,0,0,0,"u"]
[null,null,null,null,null,null,null,0,null,0,0,0,0,0,0,0,"u"]
[null,null,null,null,null,null,null,0,null,0,0,0,0,0,0,0,"u"]
[null,null,"Coût annuel pour les fournitures fixes du site PEC MAS hospitalière",null,null,null,null,null,null,{"$f":"+SUM(J78:J120)","v":308.01333333333332},{"$f":"SUM(K78:K120)","v":801.19999999999993},96.300000000000011,96.300000000000011,424.3,96.300000000000011,458.19999999999993]

{"sheet":"D7 Fréquence des livraisons","index":11,"n_rows":75,"n_cols":10,"rows_kept":75,"cut":false,"hidden":false,"merged":[[33,2,33,3],[6,1,6,7],[1,2,1,9],[22,2,22,3],[8,1,8,6],[12,2,12,7],[10,2,10,7],[20,1,20,3],[20,4,20,8]]}
[]
["Retour au sommaire",null,"D7:  Fréquence des livraisons de l'aliment thérapeutique"]
[]
[null,"Effacez dans cette Feuille toute donnée entrée d'une application précédente de cet Outil en pressant sur ce bouton…"]
[]
[]
[null,"Les données que vous avez indiquées dans la Feuille de calcul D1 (sur le nombre de zones et de groupes-zones ainsi que le nombre d'années budgétisées) vont générér le tableau de taille appropriée dans la présente Feuille de calcul (D7). Il vous faut donc remplir d'abord la Feuille D1 avant d'essayer de remplir la présente Feuille de calcul. "]
[]
[null,"NOTER dans les cellules en or indiquées par u dans ces tableaux le nombre annuel de livraisons de l'ATPE (et autres aliments thérapeutiques) pour chacune des années que vous avez budgétisée :"]
[]
[null,1,"Livraisons du niveau central aux groupes-zones participantes."]
[]
[null,2,"Livraisons au siège de zone et du siège de zone aux sites PEC MAS ambulatoire et sites PEC MAS hospitalière. "]
[]
["hide this row",null,"number of years to budget for",{"$f":"+'D1 Données générales'!G26","v":1}]
["hide this row",null,"Number of areas",{"$f":"+'D1 Données générales'!G31","v":1}]
["hide this row",null,"Years starting",{"$f":"+'D1 Données générales'!G28","v":2011}]
["hide this row",null,"Number of Group-Areas",{"$f":"+'D1 Données générales'!G33","v":1}]
[]
[null,null,{"$f":"+IF('D1 Données générales'!$H$11=\"\",\"\",'D1 Données générales'!$H$11)","v":"Ghana"}]
[null,"Nombre de livraisons de l'aliment thérapeutique chaque année :",null,null,"Année du service/programme de la PCMA"]
[null,null,null,null,{"$f":"+D17","v":2011},{"$f":"+D17+1","v":2012},{"$f":"+D17+2","v":2013},{"$f":"+D17+3","v":2014},{"$f":"+D17+4","v":2015}]
[null,null,"1)  du niveau central aux sièges \ndes groupes-zones suivants : "]
[]
[null,null,null,{"$f":"+IF('D1 Données générales'!G36=\"\",\"\",'D1 Données générales'!G36)","v":"Greater Accra"},4,null,null,null,null,"u"]
[null,null,null,{"$f":"+IF('D1 Données générales'!G37=\"\",\"\",'D1 Données générales'!G37)","v":""},null,null,null,null,null,"u"]
[null,null,null,{"$f":"+IF('D1 Données générales'!G38=\"\",\"\",'D1 Données générales'!G38)","v":""},null,null,null,null,null,"u"]
[null,null,null,{"$f":"+IF('D1 Données générales'!G39=\"\",\"\",'D1 Données générales'!G39)","v":""},null,null,null,null,null,"u"]
[null,null,null,{"$f":"+IF('D1 Données générales'!G40=\"\",\"\",'D1 Données générales'!G40)","v":""},null,null,null,null,null,"u"]
[null,null,null,{"$f":"+IF('D1 Données générales'!G41=\"\",\"\",'D1 Données générales'!G41)","v":""},null,null,null,null,null,"u"]
[null,null,null,{"$f":"+IF('D1 Données générales'!G42=\"\",\"\",'D1 Données générales'!G42)","v":""},null,null,null,null,null,"u"]
[null,null,null,{"$f":"+IF('D1 Données générales'!G43=\"\",\"\",'D1 Données générales'!G43)","v":""},null,null,null,null,null,"u"]
[]
[null,null,"2)   à destination et en provenance des zones suivantes :"]
[]
[null,"Zone 1",{"$f":"+IF('D2 Echelle'!C31=\"\",\"\",'D2 Echelle'!C31)","v":"Ashiedu Keteke"},{"$f":"+IF('D2 Echelle'!D31=\"\",\"\",'D2 Echelle'!D31)","v":"Greater Accra"}]
[null,null," - Siège groupe-zones au siège de cette zone",null,6,null,null,null,null,"u"]
[null,null," - Siège groupe-zones au siège de cette zone",null,6,null,null,null,null,"u"]
[null,null," - Siège groupe-zones au siège de cette zone",null,6,null,null,null,null,"u"]
[null,"Zone 2",{"$f":"+IF('D2 Echelle'!C36=\"\",\"\",'D2 Echelle'!C36)","v":""},{"$f":"+IF('D2 Echelle'!D36=\"\",\"\",'D2 Echelle'!D36)","v":""}]
[null,null," - Siège groupe-zones au siège de cette zone",null,null,null,null,null,null,"u"]
[null,null," - Siège de cette zone à chaque site PEC MAS ambulatoire dans cette zone (moyenne)",null,null,null,null,null,null,"u"]
[null,null," - Siège de cette zone à chaque site PEC MAS hospitalière dans cette zone (moyenne)",null,null,null,null,null,null,"u"]
[null,"Zone 3",{"$f":"+IF('D2 Echelle'!C41=\"\",\"\",'D2 Echelle'!C41)","v":""},{"$f":"+IF('D2 Echelle'!D41=\"\",\"\",'D2 Echelle'!D41)","v":""}]
[null,null," - Siège groupe-zones au siège de cette zone",null,null,null,null,null,null,"u"]
[null,null," - Siège de cette zone à chaque site PEC MAS ambulatoire dans cette zone (moyenne)",null,null,null,null,null,null,"u"]
[null,null," - Siège de cette zone à chaque site PEC MAS hospitalière dans cette zone (moyenne)",null,null,null,null,null,null,"u"]
[null,"Zone 4",{"$f":"+IF('D2 Echelle'!C46=\"\",\"\",'D2 Echelle'!C46)","v":""},{"$f":"+IF('D2 Echelle'!D46=\"\",\"\",'D2 Echelle'!D46)","v":""}]
[null,null," - Siège groupe-zones au siège de cette zone",null,null,null,null,null,null,"u"]
[null,null," - Siège de cette zone à chaque site PEC MAS ambulatoire dans cette zone (moyenne)",null,null,null,null,null,null,"u"]
[null,null," - Siège de cette zone à chaque site PEC MAS hospitalière dans cette zone (moyenne)",null,null,null,null,null,null,"u"]
[null,"Zone 5",{"$f":"+IF('D2 Echelle'!C51=\"\",\"\",'D2 Echelle'!C51)","v":""},{"$f":"+IF('D2 Echelle'!D51=\"\",\"\",'D2 Echelle'!D51)","v":""}]
[null,null," - Siège groupe-zones au siège de cette zone",null,null,null,null,null,null,"u"]
[null,null," - Siège de cette zone à chaque site PEC MAS ambulatoire dans cette zone (moyenne)",null,null,null,null,null,null,"u"]
[null,null," - Siège de cette zone à chaque site PEC MAS hospitalière dans cette zone (moyenne)",null,null,null,null,null,null,"u"]
[null,"Zone 6",{"$f":"+IF('D2 Echelle'!C56=\"\",\"\",'D2 Echelle'!C56)","v":""},{"$f":"+IF('D2 Echelle'!D56=\"\",\"\",'D2 Echelle'!D56)","v":""}]
[null,null," - Siège groupe-zones au siège de cette zone",null,null,null,null,null,null,"u"]
[null,null," - Siège de cette zone à chaque site PEC MAS ambulatoire dans cette zone (moyenne)",null,null,null,null,null,null,"u"]
[null,null," - Siège de cette zone à chaque site PEC MAS hospitalière dans cette zone (moyenne)",null,null,null,null,null,null,"u"]
[null,"Zone 7",{"$f":"+IF('D2 Echelle'!C61=\"\",\"\",'D2 Echelle'!C61)","v":""},{"$f":"+IF('D2 Echelle'!D61=\"\",\"\",'D2 Echelle'!D61)","v":""}]
[null,null," - Siège groupe-zones au siège de cette zone",null,null,null,null,null,null,"u"]
[null,null," - Siège de cette zone à chaque site PEC MAS ambulatoire dans cette zone (moyenne)",null,null,null,null,null,null,"u"]
[null,null," - Siège de cette zone à chaque site PEC MAS hospitalière dans cette zone (moyenne)",null,null,null,null,null,null,"u"]
[null,"Zone 8",{"$f":"+IF('D2 Echelle'!C66=\"\",\"\",'D2 Echelle'!C66)","v":""},{"$f":"+IF('D2 Echelle'!D66=\"\",\"\",'D2 Echelle'!D66)","v":""}]
[null,null," - Siège groupe-zones au siège de cette zone",null,null,null,null,null,null,"u"]
[null,null," - Siège de cette zone à chaque site PEC MAS ambulatoire dans cette zone (moyenne)",null,null,null,null,null,null,"u"]
[null,null," - Siège de cette zone à chaque site PEC MAS hospitalière dans cette zone (moyenne)",null,null,null,null,null,null,"u"]
[null,"Zone 9",{"$f":"+IF('D2 Echelle'!C71=\"\",\"\",'D2 Echelle'!C71)","v":""},{"$f":"+IF('D2 Echelle'!D71=\"\",\"\",'D2 Echelle'!D71)","v":""}]
[null,null," - Siège groupe-zones au siège de cette zone",null,null,null,null,null,null,"u"]
[null,null," - Siège de cette zone à chaque site PEC MAS ambulatoire dans cette zone (moyenne)",null,null,null,null,null,null,"u"]
[null,null," - Siège de cette zone à chaque site PEC MAS hospitalière dans cette zone (moyenne)",null,null,null,null,null,null,"u"]
[null,"Zone 10",{"$f":"+IF('D2 Echelle'!C76=\"\",\"\",'D2 Echelle'!C76)","v":""},{"$f":"+IF('D2 Echelle'!D76=\"\",\"\",'D2 Echelle'!D76)","v":""}]
[null,null," - Siège groupe-zones au siège de cette zone",null,null,null,null,null,null,"u"]
[null,null," - Siège de cette zone à chaque site PEC MAS ambulatoire dans cette zone (moyenne)",null,null,null,null,null,null,"u"]
[null,null," - Siège de cette zone à chaque site PEC MAS hospitalière dans cette zone (moyenne)",null,null,null,null,null,null,"u"]

{"sheet":"D8 Statistiques","index":12,"n_rows":54,"n_cols":15,"rows_kept":54,"cut":false,"hidden":false,"merged":[[9,2,9,10],[7,2,7,10],[1,2,1,10],[20,5,21,5],[20,2,21,2],[20,3,21,3],[20,4,21,4],[11,2,11,10]]}
[]
["Retoure au sommaire",null,"D8: Statistiques au niveau groupe-zones et au niveau central"]
[]
[]
[null,null,"Effacez dans cette feuille toute donnée entrée d'une application précédente de cet Outil en  pressant sur ce bouton ……….."]
[]
[]
[null,1,"COMPLÉTER les variables dans le Tableau ci-après qui demandent des données de l'utilisateur (cellules en or indiquées par u).  "]
[]
[null,2,"(Facultatif). REVOIR les valeurs fixées par l'Outil (cellules en vert foncé indiquées par n). Lire la Section 4 du Guide de l'utilisateur pour une discussion sur ces valeurs. Si elles ne conviennent pas dans votre situation, ôtez la protection de la Feuille de calcul, procédez aux changements adéquats dans les cellules vert foncé et remettez la protection de la Feuille de calcull."]
[]
[null,3,"(Facultatif). REVOIR les hypothèses pour les quelques variables dont les valeurs se rapportant au premier groupe-zones s'appliquent également aux autres groupes-zones. Si les hypothèses ne sont pas valides, ôtez la protection de la Feuille, procédez aux changements adéquats dans les cellules en vert clair ou en jaune et remettez la protection de la Feuille. "]
[]
[]
[]
["hide this row",null,"Number of Group-Areas",{"$f":"+'D1 Données générales'!G33","v":1}]
[null,null,"EPT = Equivalent temps plein "]
[]
[null,null,{"$f":"+IF('D1 Données générales'!$H$11=\"\",\"\",'D1 Données générales'!$H$11)","v":"Ghana"}]
[]
[null,null,"Variables","Unité","Commentaires","Niveau central","Group-zones …"]
[null,null,null,null,null,null,{"$f":"+IF('D1 Données générales'!$G$36=\"\",\"\",'D1 Données générales'!$G$36)","v":"Greater Accra"},{"$f":"+IF('D1 Données générales'!$G$37=\"\",\"\",'D1 Données générales'!$G$37)","v":""},{"$f":"+IF('D1 Données générales'!$G$38=\"\",\"\",'D1 Données générales'!$G$38)","v":""},{"$f":"+IF('D1 Données générales'!$G$39=\"\",\"\",'D1 Données générales'!$G$39)","v":""},{"$f":"+IF('D1 Données générales'!$G$40=\"\",\"\",'D1 Données générales'!$G$40)","v":""},{"$f":"+IF('D1 Données générales'!$G$41=\"\",\"\",'D1 Données générales'!$G$41)","v":""},{"$f":"+IF('D1 Données générales'!$G$42=\"\",\"\",'D1 Données générales'!$G$42)","v":""},{"$f":"+IF('D1 Données générales'!$G$43=\"\",\"\",'D1 Données générales'!$G$43)","v":""}]
[null,null,"Formation du personnel du siège du groupe-zones"]
[null,null,"Nombre de personnel à former de chaque nouveau groupe-zones.","personnel","Personnel niveau intermédiaire",null,2,{"$f":"IF('D1 Données générales'!$G$33<2,,+G24)","v":0},{"$f":"IF('D1 Données générales'!$G$33<3,,+G24)","v":0},{"$f":"IF('D1 Données générales'!$G$33<4,,+G24)","v":0},{"$f":"IF('D1 Données générales'!$G$33<5,,+G24)","v":0},{"$f":"IF('D1 Données générales'!$G$33<6,,+G24)","v":0},{"$f":"IF('D1 Données générales'!$G$33<7,,+G24)","v":0},{"$f":"IF('D1 Données générales'!$G$33<8,,+G24)","v":0},"n "]
[null,null,"Nombre de personnel à recycler de chaque groupe-zones établi.","personnel","Personnel niveau intermédiaire",null,2,{"$f":"IF('D1 Données générales'!$G$33<2,,+$G$25)","v":0},{"$f":"IF('D1 Données générales'!$G$33<3,,+$G$25)","v":0},{"$f":"IF('D1 Données générales'!$G$33<4,,+$G$25)","v":0},{"$f":"IF('D1 Données générales'!$G$33<5,,+G25)","v":0},{"$f":"IF('D1 Données générales'!$G$33<6,,+G25)","v":0},{"$f":"IF('D1 Données générales'!$G$33<7,,+G25)","v":0},{"$f":"IF('D1 Données générales'!$G$33<8,,+G25)","v":0},"n "]
[null,null,"Durée de la formation du personnel de chaque nouveau groupe-zones  (formation des formateurs).","jours",null,null,10,{"$f":"IF('D1 Données générales'!$G$33<2,,+$G$26)","v":0},{"$f":"IF('D1 Données générales'!$G$33<3,,+$G$26)","v":0},{"$f":"IF('D1 Données générales'!$G$33<4,,+$G$26)","v":0},{"$f":"IF('D1 Données générales'!$G$33<5,,+G26)","v":0},{"$f":"IF('D1 Données générales'!$G$33<6,,+G26)","v":0},{"$f":"IF('D1 Données générales'!$G$33<7,,+G26)","v":0},{"$f":"IF('D1 Données générales'!$G$33<8,,+G26)","v":0},"n "]
[null,null,"Durée de la formation du personnel du groupe-zones établi.","jours",null,null,2,{"$f":"IF('D1 Données générales'!$G$33<2,,+$G$27)","v":0},{"$f":"IF('D1 Données générales'!$G$33<3,,+$G$27)","v":0},{"$f":"IF('D1 Données générales'!$G$33<4,,+$G$27)","v":0},{"$f":"IF('D1 Données générales'!$G$33<5,,+G27)","v":0},{"$f":"IF('D1 Données générales'!$G$33<6,,+G27)","v":0},{"$f":"IF('D1 Données générales'!$G$33<7,,+G27)","v":0},{"$f":"IF('D1 Données générales'!$G$33<8,,+G27)","v":0},"n "]
[null,null,"Taille maximum des classes du personnel du groupe-zones participant à la formation. ","participants","15 - 25 est une taille de classe raisonnable",null,20,{"$f":"IF('D1 Données générales'!$G$33<2,,+$G$28)","v":0},{"$f":"IF('D1 Données générales'!$G$33<3,,+$G$28)","v":0},{"$f":"IF('D1 Données générales'!$G$33<4,,+$G$28)","v":0},{"$f":"IF('D1 Données générales'!$G$33<5,,+G28)","v":0},{"$f":"IF('D1 Données générales'!$G$33<6,,+G28)","v":0},{"$f":"IF('D1 Données générales'!$G$33<7,,+G28)","v":0},{"$f":"IF('D1 Données générales'!$G$33<8,,+G28)","v":0},"n "]
[null,null,"Pour la formation de plus d'une journée, est-ce que les participants du groupe-zones restent pendant la nuit au siège central ou s'y déplacent tous les jours ? ",null,null,"restent la nuit",null,null,null,null,null,null,null,null,"u"]
[null,null,"Formation des animateurs de la PCMA "]
[null,null,"Nombre du personnel de la PCMA formé dans chaque nouveau groupe-zones pour devenir des formateurs (à savoir, formateurs d'autres personnels).","personnel","Cette formation est donnée la première année qu'un groupe-zones est fonctionnel. Un minimum de trois agents PEC MAS hospitalière doivent être formés dans chaque groupe-zones.",null,8,{"$f":"IF('D1 Données générales'!$G$33<2,,+$G$31)","v":0},{"$f":"IF('D1 Données générales'!$G$33<3,,+$G$31)","v":0},{"$f":"IF('D1 Données générales'!$G$33<4,,+$G$31)","v":0},{"$f":"IF('D1 Données générales'!$G$33<5,,+G31)","v":0},{"$f":"IF('D1 Données générales'!$G$33<6,,+G31)","v":0},{"$f":"IF('D1 Données générales'!$G$33<7,,+G31)","v":0},{"$f":"IF('D1 Données générales'!$G$33<8,,+G31)","v":0},"u"]
[null,null,"Nombre de jours de formation des formateurs de la PCMA .","jours",null,null,4,{"$f":"IF('D1 Données générales'!$G$33<2,,+$G$32)","v":0},{"$f":"IF('D1 Données générales'!$G$33<3,,+$G$32)","v":0},{"$f":"IF('D1 Données générales'!$G$33<4,,+$G$32)","v":0},{"$f":"IF('D1 Données générales'!$G$33<5,,+G32)","v":0},{"$f":"IF('D1 Données générales'!$G$33<6,,+G32)","v":0},{"$f":"IF('D1 Données générales'!$G$33<7,,+G32)","v":0},{"$f":"IF('D1 Données générales'!$G$33<8,,+G32)","v":0},"n "]
[null,null,"Logistique de l'approvisionnement"]
[null,null,"Distance du siège central au siège du groupe-zones","km",null,null,5,null,null,null,null,null,null,null,"u"]
[null,null,"Temps de conduite du siège central au siège du groupe-zones","hours",null,null,0.25,null,null,null,null,null,null,null,"u"]
[null,null,"Taille des véhicules transportant l'aliment thérapeutique du siège central aux magasins du groupe-zones.","m3",null,null,15,null,null,null,null,null,null,null,"u"]
[null,null,"Espace pour stocker l'aliment thérapeutique au magasin du groupe-zones.","m3",null,null,50,null,null,null,null,null,null,null,"u"]
[null,null,"Gestion des zones par les groupes-zones."]
[null,null,"Temps nécessaire du siège du groupe-zones pour mettre en place la PCMA dans un groupe-zones où la PCMA est nouvelle (plaidoyer, développement de systèmes, budgétisation ) par an.","jours","Personnel senior ",null,20,{"$f":"IF('D1 Données générales'!$G$33<2,,+$G$39)","v":0},{"$f":"IF('D1 Données générales'!$G$33<3,,+$G$39)","v":0},{"$f":"IF('D1 Données générales'!$G$33<4,,+$G$39)","v":0},{"$f":"IF('D1 Données générales'!$G$33<5,,+G39)","v":0},{"$f":"IF('D1 Données générales'!$G$33<6,,+G39)","v":0},{"$f":"IF('D1 Données générales'!$G$33<7,,+G39)","v":0},{"$f":"IF('D1 Données générales'!$G$33<8,,+G39)","v":0},"n "]
[null,null,"Temps nécessaire du siège du groupe-zones pour mettre en place la PCMA dans un groupe-zones où la PCMA est nouvelle (plaidoyer, développement de systèmes, budgétisation ) par an.","jours","Personnel niveau intermédiaire",null,20,{"$f":"IF('D1 Données générales'!$G$33<2,,+$G$40)","v":0},{"$f":"IF('D1 Données générales'!$G$33<3,,+$G$40)","v":0},{"$f":"IF('D1 Données générales'!$G$33<4,,+$G$40)","v":0},{"$f":"IF('D1 Données générales'!$G$33<5,,+G40)","v":0},{"$f":"IF('D1 Données générales'!$G$33<6,,+G40)","v":0},{"$f":"IF('D1 Données générales'!$G$33<7,,+G40)","v":0},{"$f":"IF('D1 Données générales'!$G$33<8,,+G40)","v":0},"n "]
[null,null,"Temps nécessaire du gestionnaire niveau intermédiaire du groupe-zones (système logistique, résolution de problèmes, suivi et de rapport)",null,null,null,null,null,null," "," "," "," "," "]
[null,null,"Pour chaque nouvelle zone (par an)","jours","Personnel niveau intermédiaire",null,20,{"$f":"IF('D1 Données générales'!$G$33<2,,+$G$42)","v":0},{"$f":"IF('D1 Données générales'!$G$33<3,,+$G$42)","v":0},{"$f":"IF('D1 Données générales'!$G$33<4,,+$G$42)","v":0},{"$f":"IF('D1 Données générales'!$G$33<5,,+G42)","v":0},{"$f":"IF('D1 Données générales'!$G$33<6,,+G42)","v":0},{"$f":"IF('D1 Données générales'!$G$33<7,,+G42)","v":0},{"$f":"IF('D1 Données générales'!$G$33<8,,+G42)","v":0},"n "]
[null,null,"Pour chaque zone établie (par an)","jours","Personnel niveau intermédiaire",null,5,{"$f":"IF('D1 Données générales'!$G$33<2,,+$G$43)","v":0},{"$f":"IF('D1 Données générales'!$G$33<3,,+$G$43)","v":0},{"$f":"IF('D1 Données générales'!$G$33<4,,+$G$43)","v":0},{"$f":"IF('D1 Données générales'!$G$33<5,,+G43)","v":0},{"$f":"IF('D1 Données générales'!$G$33<6,,+G43)","v":0},{"$f":"IF('D1 Données générales'!$G$33<7,,+G43)","v":0},{"$f":"IF('D1 Données générales'!$G$33<8,,+G43)","v":0},"n "]
[null,null,"Niveau central - Gestion régulière"]
[null,null,"Temps nécessaire par an pour le plaidoyer, la planification, la gestion financière et l'obtention du financement, activités indépendantes en grande partie selon la taille et ou le caractère nouveau des groupes-zones.","EPT","Personnel niveau intermédiaire",0.5,null,null,null,null,null,null,null,null,"n "]
[null,null,"Temps nécessaire pour la logistique, la résolution de problèmes, suivi et rapport,  la gestion des groupes-zones individuels. ",null," "]
[null,null,"Pour chaque groupe-zones établi pa an","semaines","Personnel niveau intermédiaire",5,null,null,null,null,null,null,null,null,"n "]
[null,null,"Pour chaque nouveau groupe-zones par an","semaines","Personnel niveau intermédiaire",20,null,null,null,null,null,null,null,null,"n "]
[null,null,"Déplacement aux zones "]
[null,null,"Pour chaque groupe-zones établi par an","visites","Personnel niveau intermédiaire",1,null,null,null,null,null,null,null,null,"n "]
[null,null,"Pour chaque nouveau groupe-zones par an ","visites","Personnel niveau intermédiaire",4,null,null,null,null,null,null,null,null,"n "]
[null,null,"Niveau central - Etablir la PCMA "]
[null,null,"Pour la première année uniquement de la PCMA dans le pays, le temps nécessaire au niveau central pour mettre au point des directives, aides de travail, matériels et plans de formation, outils de gestion, le système logistique, le système de suivi et de rapport, et les contacts avec les politiques et les bailleurs de fonds.","EPT","Personnel senior",1,null,null,null,null,null,null,null,null,"n "]
[null,null,"Idem","EPT","Personnel niveau intermédiaire ",1,null,null,null,null,null,null,null,null,"n "]

{"sheet":"D9 Variables temps","index":13,"n_rows":73,"n_cols":21,"rows_kept":73,"cut":false,"hidden":false,"merged":[[7,11,7,17],[9,11,9,17],[24,9,24,17],[14,2,14,5],[15,2,15,5],[13,2,13,5],[11,2,11,5],[7,1,7,5],[9,2,9,6],[1,2,1,5],[5,2,5,5],[55,2,56,2],[53,2,54,2],[25,4,27,4],[49,2,51,2]]}
[]
["Retour au sommaire",null,"D9: Variables changeantes dans le temps"]
[]
["to be hidden","Number of years you wish to budget for",null,{"$f":"+'D1 Données générales'!G26","v":1},"  (taken from Feuille de travail  D2)"]
["to be hidden",null,"Number of Areas included in the study",{"$f":"+'D1 Données générales'!G31","v":1},"  (taken from Feuille de travail 2)"]
["to be hidden",null,"Necessary when made adjustment to W\" Scope and introduced an extra pre-budget year (to void having to re-write all formulas in this and other tables)",null,null,null,{"$f":"+I10+1","v":2},"i.e.",{"$f":"+C22","v":2011}]
[]
[null,"Seule une valeur est entrée par l'Utilisateur dans cette Feuille de calcul. Le reste de la Feuille de calcul note les valeurs (pour l'année choisie) des variables clés qui changent dans le temps. "]
[]
[null,1,"CHOISIR l'année pour laquelle sera faite l'analyse. (Cela peut être n'importe quel nombre à partir de '1' jusqu'au nombre total d'années budgétisées -voir Feuille de calcul D1).",null,null,null,null,null,1,"u"]
[]
[null,2,"VÉRIFIER les lignes 26, 27, 28 et les cellules F50 à F57, elles sont formatées pour mettre en valeur avec un cadre en rouge toute zone ou groupe-zones où l'aliment thérapeutique est livré à une fréquence trop faible étant donné l'espace disponible en stockage et en véhicules. Il faut envisager d'augmenter la fréquence des livraisons dans ces zones (dans feuille de calcul D7) ou changer la taille des véhicules ou l'espace de stockage (feuilles D3 et D8) et relancer l'analyse."]
[]
[null,3,"SAUVEGARDER un exemplaire de l'Outil de calcul des coûts de la PCMA (étiquetée avec l'année utilisée pour exploiter l'outil). "]
[null,null,"."]
[null,4,"CHOISIR une autre année et refaire l'analyse. Le faire pour chacune des années pour lesquelles le budget est établi."]
[]
[]
[]
[]
[null,null,{"$f":"+IF('D1 Données générales'!$H$11=\"\",\"\",'D1 Données générales'!$H$11)","v":"Ghana"}]
[null,null,{"$f":"+IF('D2 Echelle'!I11-1+'D9 Variables temps'!I10=0,\"\",'D2 Echelle'!I11-1+'D9 Variables temps'!I10)","v":2011},null,null,"Zone 1",null,null,null,"Zone 2","Zone 3","Zone 4","Zone 5","Zone 6","Zone 7","Zone 8","Zone 9","Zone 10"]
[null,null,null,null,{"$f":"'D2 Echelle'!C30","v":"district"},{"$f":"+IF('D2 Echelle'!$C$31=\"\",\"\",'D2 Echelle'!$C$31)","v":"Ashiedu Keteke"},null,null,null,{"$f":"+IF('D2 Echelle'!$C$36=\"\",\"\",'D2 Echelle'!$C$36)","v":""},{"$f":"+IF('D2 Echelle'!$C$41=\"\",\"\",'D2 Echelle'!$C$41)","v":""},{"$f":"+IF('D2 Echelle'!$C$46=\"\",\"\",'D2 Echelle'!$C$46)","v":""},{"$f":"+IF('D2 Echelle'!$C$51=\"\",\"\",'D2 Echelle'!$C$51)","v":""},{"$f":"+IF('D2 Echelle'!$C$56=\"\",\"\",'D2 Echelle'!$C$56)","v":""},{"$f":"+IF('D2 Echelle'!$C$61=\"\",\"\",'D2 Echelle'!$C$61)","v":""},{"$f":"+IF('D2 Echelle'!$C$66=\"\",\"\",'D2 Echelle'!$C$66)","v":""},{"$f":"+IF('D2 Echelle'!$C$71=\"\",\"\",'D2 Echelle'!$C$71)","v":""},{"$f":"+IF('D2 Echelle'!$C$76=\"\",\"\",'D2 Echelle'!$C$76)","v":""}]
[null,null,null,null,{"$f":"+'D2 Echelle'!D30","v":"région"},{"$f":"+IF('D2 Echelle'!$D$31=\"\",\"\",'D2 Echelle'!$D$31)","v":"Greater Accra"},null,null,null,{"$f":"+IF('D2 Echelle'!$D$36=\"\",\"\",'D2 Echelle'!$D$36)","v":""},{"$f":"+IF('D2 Echelle'!$D$41=\"\",\"\",'D2 Echelle'!$D$41)","v":""},{"$f":"+IF('D2 Echelle'!$D$46=\"\",\"\",'D2 Echelle'!$D$46)","v":""},{"$f":"+IF('D2 Echelle'!$D$51=\"\",\"\",'D2 Echelle'!$D$51)","v":""},{"$f":"+IF('D2 Echelle'!$D$56=\"\",\"\",'D2 Echelle'!$D$56)","v":""},{"$f":"+IF('D2 Echelle'!$D$61=\"\",\"\",'D2 Echelle'!$D$61)","v":""},{"$f":"+IF('D2 Echelle'!$D$66=\"\",\"\",'D2 Echelle'!$D$66)","v":""},{"$f":"+IF('D2 Echelle'!$D$71=\"\",\"\",'D2 Echelle'!$D$71)","v":""},{"$f":"+IF('D2 Echelle'!$D$76=\"\",\"\",'D2 Echelle'!$D$76)","v":""}]
[null,null,"Variables","Unités","Commentaires"]
[null,null,"Nombre de livraisons de l'aliment thérapeutique du siège du groupe-zones au siège de la zone par an.","livraisons","Bord rouge solide  -indique le besoin d'augmenter soit la fréquence  (Feuille de calcul D7) ou la taille du véhicule transportant l'aliment sur ce site (Feuille de calcul D3).\n\nBord rouge pointillé - indique le besoin d'augmenter soit la fréquence des livraisons (Feuille de calcul D7) soit la taille du stockage sur ce site (Feuille de calcul D3).",{"$f":"+OFFSET('D7 Fréquence des livraisons'!D37,0,'D9 Variables temps'!I10,1,1)","v":6},null,null,null,{"$f":"+OFFSET('D7 Fréquence des livraisons'!D41,0,'D9 Variables temps'!$I$10,1,1)","v":0},{"$f":"+OFFSET('D7 Fréquence des livraisons'!D45,0,'D9 Variables temps'!$I$10,1,1)","v":0},{"$f":"+OFFSET('D7 Fréquence des livraisons'!D49,0,'D9 Variables temps'!$I$10,1,1)","v":0},{"$f":"+OFFSET('D7 Fréquence des livraisons'!D53,0,'D9 Variables temps'!$I$10,1,1)","v":0},{"$f":"+OFFSET('D7 Fréquence des livraisons'!D57,0,'D9 Variables temps'!$I$10,1,1)","v":0},{"$f":"+OFFSET('D7 Fréquence des livraisons'!D61,0,'D9 Variables temps'!$I$10,1,1)","v":0},{"$f":"+OFFSET('D7 Fréquence des livraisons'!D65,0,'D9 Variables temps'!$I$10,1,1)","v":0},{"$f":"+OFFSET('D7 Fréquence des livraisons'!D69,0,'D9 Variables temps'!$I$10,1,1)","v":0},{"$f":"+OFFSET('D7 Fréquence des livraisons'!D73,0,'D9 Variables temps'!$I$10,1,1)","v":0}]
[null,null,"Nombre de livraisons de l'aliment thérapeutique par an à chaque site PEC MAS ambulatoire du siège de la zone.","livraisons",null,{"$f":"+OFFSET('D7 Fréquence des livraisons'!D38,0,'D9 Variables temps'!I10,1,1)","v":6},null,null,null,{"$f":"+OFFSET('D7 Fréquence des livraisons'!D42,0,'D9 Variables temps'!I10,1,1)","v":0},{"$f":"+OFFSET('D7 Fréquence des livraisons'!D46,0,'D9 Variables temps'!$I$10,1,1)","v":0},{"$f":"+OFFSET('D7 Fréquence des livraisons'!D50,0,'D9 Variables temps'!$I$10,1,1)","v":0},{"$f":"+OFFSET('D7 Fréquence des livraisons'!D54,0,'D9 Variables temps'!$I$10,1,1)","v":0},{"$f":"+OFFSET('D7 Fréquence des livraisons'!D58,0,'D9 Variables temps'!$I$10,1,1)","v":0},{"$f":"+OFFSET('D7 Fréquence des livraisons'!D62,0,'D9 Variables temps'!$I$10,1,1)","v":0},{"$f":"+OFFSET('D7 Fréquence des livraisons'!D66,0,'D9 Variables temps'!$I$10,1,1)","v":0},{"$f":"+OFFSET('D7 Fréquence des livraisons'!D70,0,'D9 Variables temps'!$I$10,1,1)","v":0},{"$f":"+OFFSET('D7 Fréquence des livraisons'!D74,0,'D9 Variables temps'!$I$10,1,1)","v":0}]
[null,null,"Nombre de livraisons de l'aliment thérapeutique par an à chaque site PEC MAS hospitalière du siège de la zone","livraisons",null,{"$f":"+OFFSET('D7 Fréquence des livraisons'!D39,0,'D9 Variables temps'!I10,1,1)","v":6},null,null,null,{"$f":"+OFFSET('D7 Fréquence des livraisons'!D43,0,'D9 Variables temps'!I10,1,1)","v":0},{"$f":"+OFFSET('D7 Fréquence des livraisons'!D47,0,'D9 Variables temps'!$I$10,1,1)","v":0},{"$f":"+OFFSET('D7 Fréquence des livraisons'!D51,0,'D9 Variables temps'!$I$10,1,1)","v":0},{"$f":"+OFFSET('D7 Fréquence des livraisons'!D55,0,'D9 Variables temps'!$I$10,1,1)","v":0},{"$f":"+OFFSET('D7 Fréquence des livraisons'!D59,0,'D9 Variables temps'!$I$10,1,1)","v":0},{"$f":"+OFFSET('D7 Fréquence des livraisons'!D63,0,'D9 Variables temps'!$I$10,1,1)","v":0},{"$f":"+OFFSET('D7 Fréquence des livraisons'!D67,0,'D9 Variables temps'!$I$10,1,1)","v":0},{"$f":"+OFFSET('D7 Fréquence des livraisons'!D71,0,'D9 Variables temps'!$I$10,1,1)","v":0},{"$f":"+OFFSET('D7 Fréquence des livraisons'!D75,0,'D9 Variables temps'!$I$10,1,1)","v":0}]
[null,null,"Sites PEC MAS ambulatoire (nombre total)","sites","Feuille de calcul D2",{"$f":"+OFFSET('D2 Echelle'!$I$32,0,I10,1,1)","v":2},null,null,null,{"$f":"+OFFSET('D2 Echelle'!$I$37,0,'D9 Variables temps'!$G$6-1,1,1)","v":0},{"$f":"+OFFSET('D2 Echelle'!$I$42,0,'D9 Variables temps'!$G$6-1,1,1)","v":0},{"$f":"+OFFSET('D2 Echelle'!$I$47,0,'D9 Variables temps'!$G$6-1,1,1)","v":0},{"$f":"+OFFSET('D2 Echelle'!$I$52,0,'D9 Variables temps'!$G$6-1,1,1)","v":0},{"$f":"+OFFSET('D2 Echelle'!$I$57,0,'D9 Variables temps'!$G$6-1,1,1)","v":0},{"$f":"+OFFSET('D2 Echelle'!$I$62,0,'D9 Variables temps'!$G$6-1,1,1)","v":0},{"$f":"+OFFSET('D2 Echelle'!$I$67,0,'D9 Variables temps'!$G$6-1,1,1)","v":0},{"$f":"+OFFSET('D2 Echelle'!$I$72,0,'D9 Variables temps'!$G$6-1,1,1)","v":0},{"$f":"+OFFSET('D2 Echelle'!$I$77,0,'D9 Variables temps'!$G$6-1,1,1)","v":0},null,{"$f":"12/'W6with comments'!F8","v":0.5}]
[null,null,"  *   Nouveau","sites","Calculé à partir de la feuille de calculD2",{"$f":"+IF('D9 Variables temps'!$G$6=1,'D2 Echelle'!$I$32,IF(OFFSET('D2 Echelle'!$H$32,0,'D9 Variables temps'!$G$6,1,)-OFFSET('D2 Echelle'!$H$32,0,'D9 Variables temps'!$G$6-1,1,1)>0,OFFSET('D2 Echelle'!$H$32,0,'D9 Variables temps'!$G$6,1,1)-OFFSET('D2 Echelle'!$H$32,0,'D9 Variables temps'!$G$6-1,1,1),0))","v":0},null,null,null,{"$f":"+IF('D9 Variables temps'!G6=1,'D2 Echelle'!I37,IF(OFFSET('D2 Echelle'!$H$37,0,'D9 Variables temps'!$G$6,1,)-OFFSET('D2 Echelle'!$H$37,0,'D9 Variables temps'!$G$6-1,1,1)>0,OFFSET('D2 Echelle'!$H$37,0,'D9 Variables temps'!$G$6,1,1)-OFFSET('D2 Echelle'!$H$37,0,'D9 Variables temps'!$G$6-1,1,1),0))","v":0},{"$f":"+IF('D9 Variables temps'!G6=1,'D2 Echelle'!I42,IF(OFFSET('D2 Echelle'!$H$42,0,'D9 Variables temps'!$G$6,1,)-OFFSET('D2 Echelle'!$H$42,0,'D9 Variables temps'!$G$6-1,1,1)>0,OFFSET('D2 Echelle'!$H$42,0,'D9 Variables temps'!$G$6,1,1)-OFFSET('D2 Echelle'!$H$42,0,'D9 Variables temps'!$G$6-1,1,1),0))","v":0},{"$f":"+IF('D9 Variables temps'!G6=1,'D2 Echelle'!I47,IF(OFFSET('D2 Echelle'!$H$47,0,'D9 Variables temps'!$G$6,1,)-OFFSET('D2 Echelle'!$H$47,0,'D9 Variables temps'!$G$6-1,1,1)>0,OFFSET('D2 Echelle'!$H$47,0,'D9 Variables temps'!$G$6,1,1)-OFFSET('D2 Echelle'!$H$47,0,'D9 Variables temps'!$G$6-1,1,1),0))","v":0},{"$f":"+IF('D9 Variables temps'!G6=1,'D2 Echelle'!I52,IF(OFFSET('D2 Echelle'!$H$52,0,'D9 Variables temps'!$G$6,1,)-OFFSET('D2 Echelle'!$H$52,0,'D9 Variables temps'!$G$6-1,1,1)>0,OFFSET('D2 Echelle'!$H$52,0,'D9 Variables temps'!$G$6,1,1)-OFFSET('D2 Echelle'!$H$52,0,'D9 Variables temps'!$G$6-1,1,1),0))","v":0},{"$f":"+IF('D9 Variables temps'!G6=1,'D2 Echelle'!I57,IF(OFFSET('D2 Echelle'!$H$57,0,'D9 Variables temps'!$G$6,1,)-OFFSET('D2 Echelle'!$H$57,0,'D9 Variables temps'!$G$6-1,1,1)>0,OFFSET('D2 Echelle'!$H$57,0,'D9 Variables temps'!$G$6,1,1)-OFFSET('D2 Echelle'!$H$57,0,'D9 Variables temps'!$G$6-1,1,1),0))","v":0},{"$f":"+IF('D9 Variables temps'!G6=1,'D2 Echelle'!I62,IF(OFFSET('D2 Echelle'!$H$62,0,'D9 Variables temps'!$G$6,1,)-OFFSET('D2 Echelle'!$H$62,0,'D9 Variables temps'!$G$6-1,1,1)>0,OFFSET('D2 Echelle'!$H$62,0,'D9 Variables temps'!$G$6,1,1)-OFFSET('D2 Echelle'!$H$62,0,'D9 Variables temps'!$G$6-1,1,1),0))","v":0},{"$f":"+IF('D9 Variables temps'!G6=1,'D2 Echelle'!I67,IF(OFFSET('D2 Echelle'!$H$67,0,'D9 Variables temps'!$G$6,1,)-OFFSET('D2 Echelle'!$H$67,0,'D9 Variables temps'!$G$6-1,1,1)>0,OFFSET('D2 Echelle'!$H$67,0,'D9 Variables temps'!$G$6,1,1)-OFFSET('D2 Echelle'!$H$67,0,'D9 Variables temps'!$G$6-1,1,1),0))","v":0},{"$f":"+IF('D9 Variables temps'!G6=1,'D2 Echelle'!I72,IF(OFFSET('D2 Echelle'!$H$72,0,'D9 Variables temps'!$G$6,1,)-OFFSET('D2 Echelle'!$H$72,0,'D9 Variables temps'!$G$6-1,1,1)>0,OFFSET('D2 Echelle'!$H$72,0,'D9 Variables temps'!$G$6,1,1)-OFFSET('D2 Echelle'!$H$72,0,'D9 Variables temps'!$G$6-1,1,1),0))","v":0},{"$f":"+IF('D9 Variables temps'!G6=1,'D2 Echelle'!I77,IF(OFFSET('D2 Echelle'!$H$77,0,'D9 Variables temps'!$G$6,1,)-OFFSET('D2 Echelle'!$H$77,0,'D9 Variables temps'!$G$6-1,1,1)>0,OFFSET('D2 Echelle'!$H$77,0,'D9 Variables temps'!$G$6,1,1)-OFFSET('D2 Echelle'!$H$77,0,'D9 Variables temps'!$G$6-1,1,1),0))","v":0}]
[null,null,"  *   Etabli","sites","Calculé à partir de la feuille de calcul D2",{"$f":"+F29-F30","v":2},null,null,null,{"$f":"+J29-J30","v":0},0,0,0,0,0,0,0,0]
[null,null,"Sites PEC MAS hospitalière (nombre total)","sites","Feuille de calcul D2",{"$f":"+OFFSET('D2 Echelle'!$I$33,0,I10,1,1)","v":1},null,null,null,{"$f":"+OFFSET('D2 Echelle'!$I$38,0,'D9 Variables temps'!$G$6-1,1,1)","v":0},{"$f":"+OFFSET('D2 Echelle'!$I$43,0,'D9 Variables temps'!$G$6-1,1,1)","v":0},{"$f":"+OFFSET('D2 Echelle'!$I$48,0,'D9 Variables temps'!$G$6-1,1,1)","v":0},{"$f":"+OFFSET('D2 Echelle'!$I$53,0,'D9 Variables temps'!$I$10,1,1)","v":0},{"$f":"+OFFSET('D2 Echelle'!$I$58,0,'D9 Variables temps'!$G$6-1,1,1)","v":0},{"$f":"+OFFSET('D2 Echelle'!$I$63,0,'D9 Variables temps'!$G$6-1,1,1)","v":0},{"$f":"+OFFSET('D2 Echelle'!$I$68,0,'D9 Variables temps'!$G$6-1,1,1)","v":0},{"$f":"+OFFSET('D2 Echelle'!$I$73,0,'D9 Variables temps'!$G$6-1,1,1)","v":0},{"$f":"+OFFSET('D2 Echelle'!$I$78,0,'D9 Variables temps'!$G$6-1,1,1)","v":0}]
[null,null,"  *  Nouveau","sites","Calculé à partir de la feuille de calcul D2",{"$f":"+IF('D9 Variables temps'!$G$6=1,'D2 Echelle'!$I$33,IF(OFFSET('D2 Echelle'!$H$33,0,'D9 Variables temps'!$G$6,1,)-OFFSET('D2 Echelle'!$H$33,0,'D9 Variables temps'!$G$6-1,1,1)>0,OFFSET('D2 Echelle'!$H$33,0,'D9 Variables temps'!$G$6,1,1)-OFFSET('D2 Echelle'!$H$33,0,'D9 Variables temps'!$G$6-1,1,1),0))","v":0},null,null,null,{"$f":"+IF('D9 Variables temps'!$G$6=1,'D2 Echelle'!$I$38,IF(OFFSET('D2 Echelle'!$H$38,0,'D9 Variables temps'!$G$6,1,)-OFFSET('D2 Echelle'!$H$38,0,'D9 Variables temps'!$G$6-1,1,1)>0,OFFSET('D2 Echelle'!$H$38,0,'D9 Variables temps'!$G$6,1,1)-OFFSET('D2 Echelle'!$H$38,0,'D9 Variables temps'!$G$6-1,1,1),0))","v":0},{"$f":"+IF('D9 Variables temps'!$G$6=1,'D2 Echelle'!$I$43,IF(OFFSET('D2 Echelle'!$H$43,0,'D9 Variables temps'!$G$6,1,)-OFFSET('D2 Echelle'!$H$43,0,'D9 Variables temps'!$G$6-1,1,1)>0,OFFSET('D2 Echelle'!$H$43,0,'D9 Variables temps'!$G$6,1,1)-OFFSET('D2 Echelle'!$H$43,0,'D9 Variables temps'!$G$6-1,1,1),0))","v":0},{"$f":"+IF('D9 Variables temps'!$G$6=1,'D2 Echelle'!$I$48,IF(OFFSET('D2 Echelle'!$H$48,0,'D9 Variables temps'!$G$6,1,)-OFFSET('D2 Echelle'!$H$48,0,'D9 Variables temps'!$G$6-1,1,1)>0,OFFSET('D2 Echelle'!$H$48,0,'D9 Variables temps'!$G$6,1,1)-OFFSET('D2 Echelle'!$H$48,0,'D9 Variables temps'!$G$6-1,1,1),0))","v":0},{"$f":"+IF('D9 Variables temps'!$G$6=1,'D2 Echelle'!$I$53,IF(OFFSET('D2 Echelle'!$H$53,0,'D9 Variables temps'!$G$6,1,)-OFFSET('D2 Echelle'!$H$53,0,'D9 Variables temps'!$G$6-1,1,1)>0,OFFSET('D2 Echelle'!$H$53,0,'D9 Variables temps'!$G$6,1,1)-OFFSET('D2 Echelle'!$H$53,0,'D9 Variables temps'!$G$6-1,1,1),0))","v":0},{"$f":"+IF('D9 Variables temps'!$G$6=1,'D2 Echelle'!$I$58,IF(OFFSET('D2 Echelle'!$H$58,0,'D9 Variables temps'!$G$6,1,)-OFFSET('D2 Echelle'!$H$58,0,'D9 Variables temps'!$G$6-1,1,1)>0,OFFSET('D2 Echelle'!$H$58,0,'D9 Variables temps'!$G$6,1,1)-OFFSET('D2 Echelle'!$H$58,0,'D9 Variables temps'!$G$6-1,1,1),0))","v":0},{"$f":"+IF('D9 Variables temps'!$G$6=1,'D2 Echelle'!$I$63,IF(OFFSET('D2 Echelle'!$H$63,0,'D9 Variables temps'!$G$6,1,)-OFFSET('D2 Echelle'!$H$63,0,'D9 Variables temps'!$G$6-1,1,1)>0,OFFSET('D2 Echelle'!$H$63,0,'D9 Variables temps'!$G$6,1,1)-OFFSET('D2 Echelle'!$H$63,0,'D9 Variables temps'!$G$6-1,1,1),0))","v":0},{"$f":"+IF('D9 Variables temps'!$G$6=1,'D2 Echelle'!$I$68,IF(OFFSET('D2 Echelle'!$H$68,0,'D9 Variables temps'!$G$6,1,)-OFFSET('D2 Echelle'!$H$68,0,'D9 Variables temps'!$G$6-1,1,1)>0,OFFSET('D2 Echelle'!$H$68,0,'D9 Variables temps'!$G$6,1,1)-OFFSET('D2 Echelle'!$H$68,0,'D9 Variables temps'!$G$6-1,1,1),0))","v":0},{"$f":"+IF('D9 Variables temps'!$G$6=1,'D2 Echelle'!$I$73,IF(OFFSET('D2 Echelle'!$H$73,0,'D9 Variables temps'!$G$6,1,)-OFFSET('D2 Echelle'!$H$73,0,'D9 Variables temps'!$G$6-1,1,1)>0,OFFSET('D2 Echelle'!$H$73,0,'D9 Variables temps'!$G$6,1,1)-OFFSET('D2 Echelle'!$H$73,0,'D9 Variables temps'!$G$6-1,1,1),0))","v":0},{"$f":"+IF('D9 Variables temps'!$G$6=1,'D2 Echelle'!$I$78,IF(OFFSET('D2 Echelle'!$H$78,0,'D9 Variables temps'!$G$6,1,)-OFFSET('D2 Echelle'!$H$78,0,'D9 Variables temps'!$G$6-1,1,1)>0,OFFSET('D2 Echelle'!$H$78,0,'D9 Variables temps'!$G$6,1,1)-OFFSET('D2 Echelle'!$H$78,0,'D9 Variables temps'!$G$6-1,1,1),0))","v":0}]
[null,null,"  *  Etabli","sites","Calculé à partir de la feuille de calcul D2",{"$f":"+F32-F33","v":1},null,null,null,{"$f":"+J32-J33","v":0},0,0,0,0,0,0,0,0]
[null,null,"Site d'activité d'extension communautaire (nombre total)","sites","Feuille de calcul  D2",{"$f":"+OFFSET('D2 Echelle'!$I$35,0,I10,1,1)","v":100},null,null,null,{"$f":"+OFFSET('D2 Echelle'!$I$40,0,'D9 Variables temps'!$G$6-1,1,1)","v":0},{"$f":"+OFFSET('D2 Echelle'!$I$45,0,'D9 Variables temps'!$G$6-1,1,1)","v":0},{"$f":"+OFFSET('D2 Echelle'!$I$50,0,'D9 Variables temps'!$G$6-1,1,1)","v":0},{"$f":"+OFFSET('D2 Echelle'!$I$55,0,'D9 Variables temps'!$I$10,1,1)","v":0},{"$f":"+OFFSET('D2 Echelle'!$I$60,0,'D9 Variables temps'!$G$6-1,1,1)","v":0},{"$f":"+OFFSET('D2 Echelle'!$I$65,0,'D9 Variables temps'!$G$6-1,1,1)","v":0},{"$f":"+OFFSET('D2 Echelle'!$I$70,0,'D9 Variables temps'!$G$6-1,1,1)","v":0},{"$f":"+OFFSET('D2 Echelle'!$I$75,0,'D9 Variables temps'!$G$6-1,1,1)","v":0},{"$f":"+OFFSET('D2 Echelle'!$I$80,0,'D9 Variables temps'!$G$6-1,1,1)","v":0}]
[null,null," *    Nouveau","sites","Calculé à partir de la feuille de calcul D2",{"$f":"+IF('D9 Variables temps'!$G$6=1,'D2 Echelle'!$I$35,IF(OFFSET('D2 Echelle'!$H$35,0,'D9 Variables temps'!$G$6,1,)-OFFSET('D2 Echelle'!$H$35,0,'D9 Variables temps'!$G$6-1,1,1)>0,OFFSET('D2 Echelle'!$H$35,0,'D9 Variables temps'!$G$6,1,1)-OFFSET('D2 Echelle'!$H$35,0,'D9 Variables temps'!$G$6-1,1,1),0))","v":100},null,null,null,{"$f":"+IF('D9 Variables temps'!G6=1,'D2 Echelle'!I45,IF(OFFSET('D2 Echelle'!$H$40,0,'D9 Variables temps'!$G$6,1,1)-OFFSET('D2 Echelle'!$H$40,0,'D9 Variables temps'!$G$6-1,1,1)>0,OFFSET('D2 Echelle'!$H$40,0,'D9 Variables temps'!$G$6,1,1)-OFFSET('D2 Echelle'!$H$40,0,'D9 Variables temps'!$G$6-1,1,1),0))","v":0},{"$f":"+IF('D9 Variables temps'!G6=1,'D2 Echelle'!I50,IF(OFFSET('D2 Echelle'!$H$45,0,'D9 Variables temps'!$G$6,1,1)-OFFSET('D2 Echelle'!$H$45,0,'D9 Variables temps'!$G$6-1,1,1)>0,OFFSET('D2 Echelle'!$H$45,0,'D9 Variables temps'!$G$6,1,1)-OFFSET('D2 Echelle'!$H$45,0,'D9 Variables temps'!$G$6-1,1,1),0))","v":0},{"$f":"+IF('D9 Variables temps'!G6=1,'D2 Echelle'!I55,IF(OFFSET('D2 Echelle'!$H$50,0,'D9 Variables temps'!$G$6,1,1)-OFFSET('D2 Echelle'!$H$50,0,'D9 Variables temps'!$G$6-1,1,1)>0,OFFSET('D2 Echelle'!$H$50,0,'D9 Variables temps'!$G$6,1,1)-OFFSET('D2 Echelle'!$H$50,0,'D9 Variables temps'!$G$6-1,1,1),0))","v":0},{"$f":"+IF('D9 Variables temps'!G6=1,'D2 Echelle'!I60,IF(OFFSET('D2 Echelle'!$H$55,0,'D9 Variables temps'!$G$6,1,1)-OFFSET('D2 Echelle'!$H$55,0,'D9 Variables temps'!$G$6-1,1,1)>0,OFFSET('D2 Echelle'!$H$55,0,'D9 Variables temps'!$G$6,1,1)-OFFSET('D2 Echelle'!$H$55,0,'D9 Variables temps'!$G$6-1,1,1),0))","v":0},{"$f":"+IF('D9 Variables temps'!G6=1,'D2 Echelle'!I65,IF(OFFSET('D2 Echelle'!$H$60,0,'D9 Variables temps'!$G$6,1,1)-OFFSET('D2 Echelle'!$H$60,0,'D9 Variables temps'!$G$6-1,1,1)>0,OFFSET('D2 Echelle'!$H$60,0,'D9 Variables temps'!$G$6,1,1)-OFFSET('D2 Echelle'!$H$60,0,'D9 Variables temps'!$G$6-1,1,1),0))","v":0},{"$f":"+IF('D9 Variables temps'!G6=1,'D2 Echelle'!I70,IF(OFFSET('D2 Echelle'!$H$65,0,'D9 Variables temps'!$G$6,1,1)-OFFSET('D2 Echelle'!$H$65,0,'D9 Variables temps'!$G$6-1,1,1)>0,OFFSET('D2 Echelle'!$H$65,0,'D9 Variables temps'!$G$6,1,1)-OFFSET('D2 Echelle'!$H$65,0,'D9 Variables temps'!$G$6-1,1,1),0))","v":0},{"$f":"+IF('D9 Variables temps'!G6=1,'D2 Echelle'!I75,IF(OFFSET('D2 Echelle'!$H$70,0,'D9 Variables temps'!$G$6,1,1)-OFFSET('D2 Echelle'!$H$70,0,'D9 Variables temps'!$G$6-1,1,1)>0,OFFSET('D2 Echelle'!$H$70,0,'D9 Variables temps'!$G$6,1,1)-OFFSET('D2 Echelle'!$H$70,0,'D9 Variables temps'!$G$6-1,1,1),0))","v":0},{"$f":"+IF('D9 Variables temps'!G6=1,'D2 Echelle'!I80,IF(OFFSET('D2 Echelle'!$H$75,0,'D9 Variables temps'!$G$6,1,1)-OFFSET('D2 Echelle'!$H$75,0,'D9 Variables temps'!$G$6-1,1,1)>0,OFFSET('D2 Echelle'!$H$75,0,'D9 Variables temps'!$G$6,1,1)-OFFSET('D2 Echelle'!$H$75,0,'D9 Variables temps'!$G$6-1,1,1),0))","v":0},{"$f":"+IF('D9 Variables temps'!G6=1,'D2 Echelle'!I85,IF(OFFSET('D2 Echelle'!$H$80,0,'D9 Variables temps'!$G$6,1,1)-OFFSET('D2 Echelle'!$H$80,0,'D9 Variables temps'!$G$6-1,1,1)>0,OFFSET('D2 Echelle'!$H$80,0,'D9 Variables temps'!$G$6,1,1)-OFFSET('D2 Echelle'!$H$80,0,'D9 Variables temps'!$G$6-1,1,1),0))","v":0}]
[null,null," *  Etabli","sites","Calculé à partir des la feuille  D2",{"$f":"+F35-F36","v":0},null,null,null,{"$f":"+J35-J36","v":0},0,0,0,0,0,0,0,0]
[null,null,"Nombre minimum d'AEC nécessaires","AEC","Calculé de la  Feuille de calcul D3 et du nombre de sites PEC MAS ambulatoire",{"$f":"+ROUNDUP('D3 Données épi. démo'!F80*'D9 Variables temps'!F35,0)","v":100},null,null,null,{"$f":"+ROUNDUP('D3 Données épi. démo'!J80*'D9 Variables temps'!J35,0)","v":0},{"$f":"+ROUNDUP('D3 Données épi. démo'!K80*'D9 Variables temps'!K35,0)","v":0},{"$f":"+ROUNDUP('D3 Données épi. démo'!L80*'D9 Variables temps'!L35,0)","v":0},{"$f":"+ROUNDUP('D3 Données épi. démo'!M80*'D9 Variables temps'!M35,0)","v":0},{"$f":"+ROUNDUP('D3 Données épi. démo'!N80*'D9 Variables temps'!N35,0)","v":0},{"$f":"+ROUNDUP('D3 Données épi. démo'!O80*'D9 Variables temps'!O35,0)","v":0},{"$f":"+ROUNDUP('D3 Données épi. démo'!P80*'D9 Variables temps'!P35,0)","v":0},{"$f":"+ROUNDUP('D3 Données épi. démo'!Q80*'D9 Variables temps'!Q35,0)","v":0},{"$f":"+ROUNDUP('D3 Données épi. démo'!R80*'D9 Variables temps'!R35,0)","v":0}]
[null,null,"Nombre de cas avec MAS par an","cas","Feuille de calcul  D2",{"$f":"+OFFSET('D2 Echelle'!$I34,0,$G$6-1,1,1)","v":150},null,null,null,{"$f":"+OFFSET('D2 Echelle'!$I39,0,$G$6-1,1,1)","v":0},{"$f":"+OFFSET('D2 Echelle'!$I44,0,$G$6-1,1,1)","v":0},{"$f":"+OFFSET('D2 Echelle'!$I49,0,$G$6-1,1,1)","v":0},{"$f":"+OFFSET('D2 Echelle'!$I54,0,$G$6-1,1,1)","v":0},{"$f":"+OFFSET('D2 Echelle'!$I59,0,$G$6-1,1,1)","v":0},{"$f":"+OFFSET('D2 Echelle'!$I64,0,$G$6-1,1,1)","v":0},{"$f":"+OFFSET('D2 Echelle'!$I69,0,$G$6-1,1,1)","v":0},{"$f":"+OFFSET('D2 Echelle'!$I74,0,$G$6-1,1,1)","v":0},{"$f":"+OFFSET('D2 Echelle'!$I79,0,$G$6-1,1,1)","v":0}]
[null,null,"Nombre d'enfants avec MAS par an venant aux séances PEC MAS ambulatoire (tous, sauf les enfants de moins de 6 mois).","cas","Calculé à partir des feuilles  D3 et D2",{"$f":"+F39*(100-'D3 Données épi. démo'!F22)/100","v":135},null,null,null,{"$f":"+J39*(100-'D3 Données épi. démo'!J22)/100","v":0},{"$f":"+K39*(100-'D3 Données épi. démo'!K22)/100","v":0},{"$f":"+L39*(100-'D3 Données épi. démo'!L22)/100","v":0},{"$f":"+M39*(100-'D3 Données épi. démo'!M22)/100","v":0},{"$f":"+N39*(100-'D3 Données épi. démo'!N22)/100","v":0},{"$f":"+O39*(100-'D3 Données épi. démo'!O22)/100","v":0},{"$f":"+P39*(100-'D3 Données épi. démo'!P22)/100","v":0},{"$f":"+Q39*(100-'D3 Données épi. démo'!Q22)/100","v":0},{"$f":"+R39*(100-'D3 Données épi. démo'!R22)/100","v":0}]
[null,null,"Nombre d'enfants avec MAS dans la PEC MAS ambulatoire à un point donné du temps (prévalence)","cas","Nombre de cas >6 mois * durée (semaines)(Feuille de travail D3)/52",{"$f":"+F39*(1-'D3 Données épi. démo'!F22/100)*'D3 Données épi. démo'!F32/52","v":20.76923076923077},null,null,null,{"$f":"+J39*(1-'D3 Données épi. démo'!J22/100)*'D3 Données épi. démo'!J32/52","v":0},{"$f":"+K39*(1-'D3 Données épi. démo'!K22/100)*'D3 Données épi. démo'!K32/52","v":0},{"$f":"+L39*(1-'D3 Données épi. démo'!L22/100)*'D3 Données épi. démo'!L32/52","v":0},{"$f":"+M39*(1-'D3 Données épi. démo'!M22/100)*'D3 Données épi. démo'!M32/52","v":0},{"$f":"+N39*(1-'D3 Données épi. démo'!N22/100)*'D3 Données épi. démo'!N32/52","v":0},{"$f":"+O39*(1-'D3 Données épi. démo'!O22/100)*'D3 Données épi. démo'!O32/52","v":0},{"$f":"+P39*(1-'D3 Données épi. démo'!P22/100)*'D3 Données épi. démo'!P32/52","v":0},{"$f":"+Q39*(1-'D3 Données épi. démo'!Q22/100)*'D3 Données épi. démo'!Q32/52","v":0},{"$f":"+R39*(1-'D3 Données épi. démo'!R22/100)*'D3 Données épi. démo'!R32/52","v":0}]
[null,null,"Nombre d'enfants avec MAS demandant PEC MAS hospitalière en un an","cas",null,{"$f":"+F39*'D3 Données épi. démo'!F28","v":35.25},null,null,null,{"$f":"+J39*'D3 Données épi. démo'!J28","v":0},{"$f":"+K39*'D3 Données épi. démo'!K28","v":0},{"$f":"+L39*'D3 Données épi. démo'!L28","v":0},{"$f":"+M39*'D3 Données épi. démo'!M28","v":0},{"$f":"+N39*'D3 Données épi. démo'!N28","v":0},{"$f":"+O39*'D3 Données épi. démo'!O28","v":0},{"$f":"+P39*'D3 Données épi. démo'!P28","v":0},{"$f":"+Q39*'D3 Données épi. démo'!Q28","v":0},{"$f":"+R39*'D3 Données épi. démo'!R28","v":0}]
[null,null,"Nombre d'enfants avec MAS dans la PEC MAS hospitalière à un point donné du temps (arrondi)","cas","Nombre de cas de MAS exigeant une PEC MAS hospitalière * nombre de jours en PEC MAS hospitalière/365",{"$f":"+ROUNDUP(F42*'D3 Données épi. démo'!F31/365,0)","v":2},null,null,null,{"$f":"+ROUNDUP(J42*'D3 Données épi. démo'!J31/365,0)","v":0},{"$f":"+ROUNDUP(K42*'D3 Données épi. démo'!K31/365,0)","v":0},{"$f":"+ROUNDUP(L42*'D3 Données épi. démo'!L31/365,0)","v":0},{"$f":"+ROUNDUP(M42*'D3 Données épi. démo'!M31/365,0)","v":0},{"$f":"+ROUNDUP(N42*'D3 Données épi. démo'!N31/365,0)","v":0},{"$f":"+ROUNDUP(O42*'D3 Données épi. démo'!O31/365,0)","v":0},{"$f":"+ROUNDUP(P42*'D3 Données épi. démo'!P31/365,0)","v":0},{"$f":"+ROUNDUP(Q42*'D3 Données épi. démo'!Q31/365,0)","v":0},{"$f":"+ROUNDUP(R42*'D3 Données épi. démo'!R31/365,0)","v":0}]
[null,null,"Pourcentage de jours lorsque les sites PEC MAS hospitalière auront probablement au moins un enfant hospitalisé avec MAS.","%","(Suppose des cas distribués également) (365-nombre de jours par cas * no.de cas en PEC MAS hospitalière)",{"$f":"+IF(F32=0,0,IF(F42*'D3 Données épi. démo'!F31/F32>365,100,F42*'D3 Données épi. démo'!F31/F32/365*100))","v":100},null,null,null,{"$f":"+IF(J32=0,0,IF(J42*'D3 Données épi. démo'!J31/J32>365,100,J42*'D3 Données épi. démo'!J31/J32/365*100))","v":0},{"$f":"+IF(K32=0,0,IF(K42*'D3 Données épi. démo'!K31/K32>365,100,K42*'D3 Données épi. démo'!K31/K32/365*100))","v":0},{"$f":"+IF(L32=0,0,IF(L42*'D3 Données épi. démo'!L31/L32>365,100,L42*'D3 Données épi. démo'!L31/L32/365*100))","v":0},{"$f":"+IF(M32=0,0,IF(M42*'D3 Données épi. démo'!M31/M32>365,100,M42*'D3 Données épi. démo'!M31/M32/365*100))","v":0},{"$f":"+IF(N32=0,0,IF(N42*'D3 Données épi. démo'!N31/N32>365,100,N42*'D3 Données épi. démo'!N31/N32/365*100))","v":0},{"$f":"+IF(O32=0,0,IF(O42*'D3 Données épi. démo'!O31/O32>365,100,O42*'D3 Données épi. démo'!O31/O32/365*100))","v":0},{"$f":"+IF(P32=0,0,IF(P42*'D3 Données épi. démo'!P31/P32>365,100,P42*'D3 Données épi. démo'!P31/P32/365*100))","v":0},{"$f":"+IF(Q32=0,0,IF(Q42*'D3 Données épi. démo'!Q31/Q32>365,100,Q42*'D3 Données épi. démo'!Q31/Q32/365*100))","v":0},{"$f":"+IF(R32=0,0,IF(R42*'D3 Données épi. démo'!R31/R32>365,100,R42*'D3 Données épi. démo'!R31/R32/365*100))","v":0}]
[null,null,"Cette zone a-t-elle un programme/service actif de la PCMA pour l'année analysée.","\"0\" ou \"1\"","Une zone active est identifiée par \"1\"; une zone inactive par \"0\"",{"$f":"+IF(F29+F32>0,1,0)","v":1},null,null,null,{"$f":"+IF(J29+J32>0,1,0)","v":0},0,0,0,0,0,0,0,0]
[null,null,"La PCMA a-t-elle déjà été établie dans cette zone, est-elle une approche nouvelle dans cette zone ou ne fonctionne-t-elle pas encore ?","nouvelle/ établie/ inactive","Une zone est 'établie' s'il existe au moins un site PEC MAS ambulatoire ou hospitalière, sinon 'nouvelle' (s'il existe au moins un nouveau site PEC MAS ambulatoire ou hospitalière) ou \"inactive\".",{"$f":"+IF(F31+F34>0,\"établie\",IF(F30+F33>0,\"nouvelle\",\"inactive\"))","v":"établie"},null,null,null,{"$f":"+IF(J31+J34>0,\"établie\",IF(J30+J33>0,\"nouvelle\",\"inactive\"))","v":"inactive"},{"$f":"+IF(K31+K34>0,\"établie\",IF(K30+K33>0,\"nouvelle\",\"inactive\"))","v":"inactive"},{"$f":"+IF(L31+L34>0,\"établie\",IF(L30+L33>0,\"nouvelle\",\"inactive\"))","v":"inactive"},{"$f":"+IF(M31+M34>0,\"établie\",IF(M30+M33>0,\"nouvelle\",\"inactive\"))","v":"inactive"},"inactive","inactive","inactive","inactive","inactive"]
[null,null,"La PCMA est-elle une approche nouvelle dans cette zone.","0 , 1","Zone où la PCMA est nouvelle (définie comme une zone avec certains nouveaux sites PEC MAS ambulatoire ou hospitalière et pas de sites établis PEC MAS ambulatoire ou hospitalière) ent Care  sites) : elle est identifiée par  \"1\"; sinon par  \"0\".",{"$f":"+IF(AND((F31+F34)=0,(F30+F33>0)),1,0)","v":0},null,null,null,{"$f":"+IF(AND((J31+J34)=0,(J30+J33>0)),1,0)","v":0},0,0,0,0,0,0,0,0]
[]
[null,null,null,"Alerts (Can be hidden)","Groupe-Zones","Nombre de livraisons"]
[null,null,"Ce tableau indique le nombre annuel de livraisons de l'aliment thérapeutique du siège du niveau central au groupe-zones pendant l'année spécifiée (Feuille de calcul D7).  Si les livraisons ne sont pas assez fréquentes pour la quantité de l'aliment et la taille des véhicules et capacité de stockage, le tableau met en alerte avec des bords rouges :     \n",{"$f":"+'R6 Niveau group-zones et centre'!G155","v":""},{"$f":"+IF('D1 Données générales'!G36=\"\",\"\",'D1 Données générales'!G36)","v":"Greater Accra"},{"$f":"+OFFSET('D7 Fréquence des livraisons'!D25,0,'D9 Variables temps'!$I$10,1,1)","v":4}]
[null,null,null,{"$f":"+'R6 Niveau group-zones et centre'!H155","v":""},{"$f":"+IF('D1 Données générales'!G37=\"\",\"\",'D1 Données générales'!G37)","v":""},{"$f":"+OFFSET('D7 Fréquence des livraisons'!D26,0,'D9 Variables temps'!$I$10,1,1)","v":0}]
[null,null,null,{"$f":"+'R6 Niveau group-zones et centre'!I155","v":""},{"$f":"+IF('D1 Données générales'!G38=\"\",\"\",'D1 Données générales'!G38)","v":""},{"$f":"+OFFSET('D7 Fréquence des livraisons'!D27,0,'D9 Variables temps'!$I$10,1,1)","v":0}]
[null,null,null,{"$f":"+'R6 Niveau group-zones et centre'!J155","v":""},{"$f":"+IF('D1 Données générales'!G39=\"\",\"\",'D1 Données générales'!G39)","v":""},{"$f":"+OFFSET('D7 Fréquence des livraisons'!D28,0,'D9 Variables temps'!$I$10,1,1)","v":0}]
[null,null,"Bord rouge solide  - indique le besoin d'augmenter soit la fréquence des livraisons  (D7) ou la taille du véhicule transportant l'aliment thérapeutique au siège de ce groupe-zones (D8).",{"$f":"+'R6 Niveau group-zones et centre'!K155","v":""},{"$f":"+IF('D1 Données générales'!G40=\"\",\"\",'D1 Données générales'!G40)","v":""},{"$f":"+OFFSET('D7 Fréquence des livraisons'!D29,0,'D9 Variables temps'!$I$10,1,1)","v":0}]
[null,null,null,{"$f":"+'R6 Niveau group-zones et centre'!L155","v":""},{"$f":"+IF('D1 Données générales'!G41=\"\",\"\",'D1 Données générales'!G41)","v":""},{"$f":"+OFFSET('D7 Fréquence des livraisons'!D30,0,'D9 Variables temps'!$I$10,1,1)","v":0}]
[null,null,"Bord rouge pointillés -indique le besoin d'augmenter soit la fréquence des livraisons (D7) soit la taille du stockage au siège de ce groupe-zones  (D8).",{"$f":"+'R6 Niveau group-zones et centre'!M155","v":""},{"$f":"+IF('D1 Données générales'!G42=\"\",\"\",'D1 Données générales'!G42)","v":""},{"$f":"+OFFSET('D7 Fréquence des livraisons'!D31,0,'D9 Variables temps'!$I$10,1,1)","v":0}]
[null,null,null,{"$f":"+'R6 Niveau group-zones et centre'!N155","v":""},{"$f":"+IF('D1 Données générales'!G43=\"\",\"\",'D1 Données générales'!G43)","v":""},{"$f":"+OFFSET('D7 Fréquence des livraisons'!D32,0,'D9 Variables temps'!$I$10,1,1)","v":0}]
[]
[]
[]
[]
[]
[null,null,{"$f":"+'R11 Logistique approvisionnemen'!C52:E52","v":"!!  Indicates a need to increase either frequency of delivery of therapeutic food to Area's HQ or the size  of vehicle transporting it there. "},null,null,{"$f":"+'R11 Logistique approvisionnemen'!F52:H52","v":""}," "," "," ",{"$f":"+'R11 Logistique approvisionnemen'!J52:L52","v":""},{"$f":"+'R11 Logistique approvisionnemen'!K52:M52","v":""},{"$f":"+'R11 Logistique approvisionnemen'!L52:N52","v":""},{"$f":"+'R11 Logistique approvisionnemen'!M52:O52","v":""},{"$f":"+'R11 Logistique approvisionnemen'!N52:P52","v":""},{"$f":"+'R11 Logistique approvisionnemen'!O52:Q52","v":""},{"$f":"+'R11 Logistique approvisionnemen'!P52:R52","v":""},{"$f":"+'R11 Logistique approvisionnemen'!Q52:S52","v":""},{"$f":"+'R11 Logistique approvisionnemen'!R52:T52","v":""},{"$f":"+'R11 Logistique approvisionnemen'!S52:U52","v":""}," "," "]
[null,null,{"$f":"+'R11 Logistique approvisionnemen'!C53:E53","v":"!!  indicates a need to increase either frequency of delivery of therapeutic food to Area's HQ or the storage space for it there. "},null,null,{"$f":"+'R11 Logistique approvisionnemen'!F53:H53","v":""}," "," "," ",{"$f":"+'R11 Logistique approvisionnemen'!J53:L53","v":""},{"$f":"+'R11 Logistique approvisionnemen'!K53:M53","v":""},{"$f":"+'R11 Logistique approvisionnemen'!L53:N53","v":""},{"$f":"+'R11 Logistique approvisionnemen'!M53:O53","v":""},{"$f":"+'R11 Logistique approvisionnemen'!N53:P53","v":""},{"$f":"+'R11 Logistique approvisionnemen'!O53:Q53","v":""},{"$f":"+'R11 Logistique approvisionnemen'!P53:R53","v":""},{"$f":"+'R11 Logistique approvisionnemen'!Q53:S53","v":""},{"$f":"+'R11 Logistique approvisionnemen'!R53:T53","v":""},{"$f":"+'R11 Logistique approvisionnemen'!S53:U53","v":""}," "," "]
[null,null,{"$f":"+'R11 Logistique approvisionnemen'!C54:E54","v":"!! indicates a need to increase either frequency of delivery of therapeutic food to OC sites or the size of vehicle transporting it there."},null,null,{"$f":"+'R11 Logistique approvisionnemen'!F54:H54","v":""}," "," "," ",{"$f":"+'R11 Logistique approvisionnemen'!J54:L54","v":""},{"$f":"+'R11 Logistique approvisionnemen'!K54:M54","v":""},{"$f":"+'R11 Logistique approvisionnemen'!L54:N54","v":""},{"$f":"+'R11 Logistique approvisionnemen'!M54:O54","v":""},{"$f":"+'R11 Logistique approvisionnemen'!N54:P54","v":""},{"$f":"+'R11 Logistique approvisionnemen'!O54:Q54","v":""},{"$f":"+'R11 Logistique approvisionnemen'!P54:R54","v":""},{"$f":"+'R11 Logistique approvisionnemen'!Q54:S54","v":""},{"$f":"+'R11 Logistique approvisionnemen'!R54:T54","v":""},{"$f":"+'R11 Logistique approvisionnemen'!S54:U54","v":""}," "," "]
[null,null,{"$f":"+'R11 Logistique approvisionnemen'!C55:E55","v":"!! indicates a need to increase either frequency of delivery of therapeutic food to OC sites or the storage space  for it there.  "},null,null,{"$f":"+'R11 Logistique approvisionnemen'!F55:H55","v":""}," "," "," ",{"$f":"+'R11 Logistique approvisionnemen'!J55:L55","v":""},{"$f":"+'R11 Logistique approvisionnemen'!K55:M55","v":""},{"$f":"+'R11 Logistique approvisionnemen'!L55:N55","v":""},{"$f":"+'R11 Logistique approvisionnemen'!M55:O55","v":""},{"$f":"+'R11 Logistique approvisionnemen'!N55:P55","v":""},{"$f":"+'R11 Logistique approvisionnemen'!O55:Q55","v":""},{"$f":"+'R11 Logistique approvisionnemen'!P55:R55","v":""},{"$f":"+'R11 Logistique approvisionnemen'!Q55:S55","v":""},{"$f":"+'R11 Logistique approvisionnemen'!R55:T55","v":""},{"$f":"+'R11 Logistique approvisionnemen'!S55:U55","v":""},"  ","  "]
[null,null,{"$f":"+'R11 Logistique approvisionnemen'!C56:E56","v":"!! indicates a need to increase either frequency of delivery of therapeutic food to IC sites or the size of vehicle transporting it there."},null,null,{"$f":"+'R11 Logistique approvisionnemen'!F56:H56","v":""}," "," "," ",{"$f":"+'R11 Logistique approvisionnemen'!J56:L56","v":""},{"$f":"+'R11 Logistique approvisionnemen'!K56:M56","v":""},{"$f":"+'R11 Logistique approvisionnemen'!L56:N56","v":""},{"$f":"+'R11 Logistique approvisionnemen'!M56:O56","v":""},{"$f":"+'R11 Logistique approvisionnemen'!N56:P56","v":""},{"$f":"+'R11 Logistique approvisionnemen'!O56:Q56","v":""},{"$f":"+'R11 Logistique approvisionnemen'!P56:R56","v":""},{"$f":"+'R11 Logistique approvisionnemen'!Q56:S56","v":""},{"$f":"+'R11 Logistique approvisionnemen'!R56:T56","v":""},{"$f":"+'R11 Logistique approvisionnemen'!S56:U56","v":""}," "," "]
[null,null,{"$f":"+'R11 Logistique approvisionnemen'!C57:E57","v":"!! indicates a need to increase either frequency of delivery of therapeutic food to IC sites or the storage space  for it there."},null,null,{"$f":"+'R11 Logistique approvisionnemen'!F57:H57","v":""}," "," "," ",{"$f":"+'R11 Logistique approvisionnemen'!J57:L57","v":""},{"$f":"+'R11 Logistique approvisionnemen'!K57:M57","v":""},{"$f":"+'R11 Logistique approvisionnemen'!L57:N57","v":""},{"$f":"+'R11 Logistique approvisionnemen'!M57:O57","v":""},{"$f":"+'R11 Logistique approvisionnemen'!N57:P57","v":""},{"$f":"+'R11 Logistique approvisionnemen'!O57:Q57","v":""},{"$f":"+'R11 Logistique approvisionnemen'!P57:R57","v":""},{"$f":"+'R11 Logistique approvisionnemen'!Q57:S57","v":""},{"$f":"+'R11 Logistique approvisionnemen'!R57:T57","v":""},{"$f":"+'R11 Logistique approvisionnemen'!S57:U57","v":""}," "," "]
[null,null,{"$f":"+'R11 Logistique approvisionnemen'!C58:E58","v":0}]
[null,null,{"$f":"+'R11 Logistique approvisionnemen'!C83:E83","v":0}]
[null,null,{"$f":"+'R11 Logistique approvisionnemen'!C84:E84","v":0}]
[null,null,{"$f":"+'R11 Logistique approvisionnemen'!C85:E85","v":0}]
[null,null,"Number of Group-Areas",{"$f":"+'D1 Données générales'!G33","v":1}]

{"sheet":"Rappel sur les résultats","index":14,"n_rows":7,"n_cols":2,"rows_kept":7,"cut":false,"hidden":false,"merged":[]}
[]
[null,"Rappel sur les feuilles de calcul avec les résultats [R1 à R14]"]
[null,"Les Feuilles de calcul suivantes (R1 à R14) présentent les résultats."]
[]
[null,"L'Utilisateur ne devrait PAS changer les cellules dans les feuilles de calcul avec les résultats. Si l'utilisateur identifie des variables dont les valeurs doivent être changées, ce changement doit être fait lorsque la variable apparaît pour la première fois (Feuilles de calcul  D1 à D9)."]
[]
[null,"Les quatre Feuilles de calcul suivantes récapitulent la quantité des intrants clés, à savoir la gestion (R1), les transports (R2), les fournitures (R3), et l'espace (R4), nécessaires pendant l'année spécifiée dans la Feuille de calcul D9 pour mettre en place un programme de la PCMA de l'échelle définie dans la Feuille de calcul D2. "]

{"sheet":"R1 Main-d'oeuvres","index":15,"n_rows":96,"n_cols":19,"rows_kept":96,"cut":false,"hidden":false,"merged":[[13,10,13,18],[11,5,12,5],[4,2,4,9],[4,11,4,17]]}
[]
["Retour au sommaire",null,"R1: Besoins annuels en main-d'oeuvre pour la PCMA"]
[]
[null,null,"Number of Areas included ",{"$f":"+'D1 Données générales'!G31","v":1},"  (taken from Worksheet 2)"]
[null,null,"Cette Feuille de calcul montre pour l'année choisie le niveau de personnel nécessaire pour mettre en oeuvre la PCMA. Un équivalent plein temps (EPT) est égal à une année de travail (environ 260 jours).",null,null,null,null,null,null,null,null,"Change hidden references so that appropraite columns revealed"]
[]
[null,null,{"$f":"+IF('D1 Données générales'!$H$11=\"\",\"\",'D1 Données générales'!$H$11)","v":"Ghana"}]
[null,null,{"$f":"+'D9 Variables temps'!$I$6","v":2011}]
["Hidden row - factors to ensure that areas not identified in scope of budget are not included",null,null,null,null,null,{"$f":"+IF('D1 Données générales'!$G$31<1,0,1)","v":1},null,null,null,{"$f":"+IF('D1 Données générales'!$G$31<2,0,1)","v":0},{"$f":"+IF('D1 Données générales'!$G$31<3,0,1)","v":0},{"$f":"+IF('D1 Données générales'!$G$31<4,0,1)","v":0},{"$f":"+IF('D1 Données générales'!$G$31<5,0,1)","v":0},{"$f":"+IF('D1 Données générales'!$G$31<6,0,1)","v":0},{"$f":"+IF('D1 Données générales'!$G$31<7,0,1)","v":0},{"$f":"+IF('D1 Données générales'!$G$31<8,0,1)","v":0},{"$f":"+IF('D1 Données générales'!$G$31<9,0,1)","v":0},{"$f":"+IF('D1 Données générales'!$G$31<10,0,1)","v":0}]
[]
[null,null,null,null,null,null,"Zone 1",null,null,null,"Zone 2","Zone 3","Zone 4","Zone 5","Zone 6","Zone 7","Zone 8","Zone 9","Zone 10"]
[null,null,null,{"$f":"'D2 Echelle'!$C$30","v":"district"},null,"TOTAL  toutes zones",{"$f":"+IF('D2 Echelle'!$C$31=\"\",\"\",'D2 Echelle'!$C$31)","v":"Ashiedu Keteke"},null,null,null,{"$f":"+IF('D2 Echelle'!$C$36=\"\",\"\",'D2 Echelle'!$C$36)","v":""},{"$f":"+IF('D2 Echelle'!$C$41=\"\",\"\",'D2 Echelle'!$C$41)","v":""},{"$f":"+IF('D2 Echelle'!$C$46=\"\",\"\",'D2 Echelle'!$C$46)","v":""},{"$f":"+IF('D2 Echelle'!$C$51=\"\",\"\",'D2 Echelle'!$C$51)","v":""},{"$f":"+IF('D2 Echelle'!$C$56=\"\",\"\",'D2 Echelle'!$C$56)","v":""},{"$f":"+IF('D2 Echelle'!$C$61=\"\",\"\",'D2 Echelle'!$C$61)","v":""},{"$f":"+IF('D2 Echelle'!$C$66=\"\",\"\",'D2 Echelle'!$C$66)","v":""},{"$f":"+IF('D2 Echelle'!$C$71=\"\",\"\",'D2 Echelle'!$C$71)","v":""},{"$f":"+IF('D2 Echelle'!$C$76=\"\",\"\",'D2 Echelle'!$C$76)","v":""}]
[null,null,null,{"$f":"+'D2 Echelle'!$D$30","v":"région"},null,null,{"$f":"+IF('D2 Echelle'!$D$31=\"\",\"\",'D2 Echelle'!$D$31)","v":"Greater Accra"},null,null,null,{"$f":"+IF('D2 Echelle'!$D$36=\"\",\"\",'D2 Echelle'!$D$36)","v":""},{"$f":"+IF('D2 Echelle'!$D$41=\"\",\"\",'D2 Echelle'!$D$41)","v":""},{"$f":"+IF('D2 Echelle'!$D$46=\"\",\"\",'D2 Echelle'!$D$46)","v":""},{"$f":"+IF('D2 Echelle'!$D$51=\"\",\"\",'D2 Echelle'!$D$51)","v":""},{"$f":"+IF('D2 Echelle'!$D$56=\"\",\"\",'D2 Echelle'!$D$56)","v":""},{"$f":"+IF('D2 Echelle'!$D$61=\"\",\"\",'D2 Echelle'!$D$61)","v":""},{"$f":"+IF('D2 Echelle'!$D$66=\"\",\"\",'D2 Echelle'!$D$66)","v":""},{"$f":"+IF('D2 Echelle'!$D$71=\"\",\"\",'D2 Echelle'!$D$71)","v":""},{"$f":"+IF('D2 Echelle'!$D$76=\"\",\"\",'D2 Echelle'!$D$76)","v":""}]
[null,"Niveau","Type de personnel","Activités","Unités"]
[null,"Extension communautaire"]
[null,null,"Agents extension communautaire","TOTAL","EPT",{"$f":"+(G16*$G$9+K16*$K$9+L16*$L$9+M16*$M$9+N16*$N$9+O16*$O$9+P16*$P$9+Q16*$Q$9+R16*$R$9+S16*$S$9)","v":20},{"$f":"+G20/'D5 Salaires'!$I$20","v":20},null,null,null,{"$f":"+K20/'D5 Salaires'!$I$20","v":0},{"$f":"+L20/'D5 Salaires'!$I$20","v":0},{"$f":"+M20/'D5 Salaires'!$I$20","v":0},{"$f":"+N20/'D5 Salaires'!$I$20","v":0},{"$f":"+O20/'D5 Salaires'!$I$20","v":0},{"$f":"+P20/'D5 Salaires'!$I$20","v":0},{"$f":"+Q20/'D5 Salaires'!$I$20","v":0},{"$f":"+R20/'D5 Salaires'!$I$20","v":0},{"$f":"+S20/'D5 Salaires'!$I$20","v":0}]
[null,null,null,"Par site PEC MAS ambulatoire ","EPT",null,{"$f":"+IF('D9 Variables temps'!F29=0,0,G16/'D9 Variables temps'!F29)","v":10},null,null,null,{"$f":"+IF('D9 Variables temps'!J29=0,0,K16/'D9 Variables temps'!J29)","v":0},{"$f":"+IF('D9 Variables temps'!K29=0,0,L16/'D9 Variables temps'!K29)","v":0},{"$f":"+IF('D9 Variables temps'!L29=0,0,M16/'D9 Variables temps'!L29)","v":0},{"$f":"+IF('D9 Variables temps'!M29=0,0,N16/'D9 Variables temps'!M29)","v":0},{"$f":"+IF('D9 Variables temps'!N29=0,0,O16/'D9 Variables temps'!N29)","v":0},{"$f":"+IF('D9 Variables temps'!O29=0,0,P16/'D9 Variables temps'!O29)","v":0},{"$f":"+IF('D9 Variables temps'!P29=0,0,Q16/'D9 Variables temps'!P29)","v":0},{"$f":"+IF('D9 Variables temps'!Q29=0,0,R16/'D9 Variables temps'!Q29)","v":0},{"$f":"+IF('D9 Variables temps'!R29=0,0,S16/'D9 Variables temps'!R29)","v":0}]
[null,null,null,"Extension communautaire","days",{"$f":"+(G18*$G$9+K18*$K$9+L18*$L$9+M18*$M$9+N18*$N$9+O18*$O$9+P18*$P$9+Q18*$Q$9+R18*$R$9+S18*$S$9)","v":5000},{"$f":"+'R14 Extension communautaire'!F36","v":5000},null,null,null,{"$f":"+'R14 Extension communautaire'!J36","v":0},{"$f":"+'R14 Extension communautaire'!K36","v":0},{"$f":"+'R14 Extension communautaire'!L36","v":0},{"$f":"+'R14 Extension communautaire'!M36","v":0},{"$f":"+'R14 Extension communautaire'!N36","v":0},{"$f":"+'R14 Extension communautaire'!O36","v":0},{"$f":"+'R14 Extension communautaire'!P36","v":0},{"$f":"+'R14 Extension communautaire'!Q36","v":0},{"$f":"+'R14 Extension communautaire'!R36","v":0}]
[null,null,null,"en formation","days",{"$f":"+(G19*$G$9+K19*$K$9+L19*$L$9+M19*$M$9+N19*$N$9+O19*$O$9+P19*$P$9+Q19*$Q$9+R19*$R$9+S19*$S$9)","v":200},{"$f":"+'R12 Formation'!F63","v":200},null,null,null,{"$f":"+'R12 Formation'!J63","v":0},{"$f":"+'R12 Formation'!K63","v":0},{"$f":"+'R12 Formation'!L63","v":0},{"$f":"+'R12 Formation'!M63","v":0},{"$f":"+'R12 Formation'!N63","v":0},{"$f":"+'R12 Formation'!O63","v":0},{"$f":"+'R12 Formation'!P63","v":0},{"$f":"+'R12 Formation'!Q63","v":0},{"$f":"+'R12 Formation'!R63","v":0}]
[null,null,null,"Total","days",{"$f":"+(G20*$G$9+K20*$K$9+L20*$L$9+M20*$M$9+N20*$N$9+O20*$O$9+P20*$P$9+Q20*$Q$9+R20*$R$9+S20*$S$9)","v":5200},{"$f":"+SUM(G18:G19)","v":5200},null,null,null,{"$f":"+SUM(K18:K19)","v":0},0,0,0,0,0,0,0,0]
[]
[null,"PEC MAS ambulatoire"]
[null,null,"Personnel senior\nPEC MAS ambulatoire","TOTAL","EPT",{"$f":"+(G23*$G$9+K23*$K$9+L23*$L$9+M23*$M$9+N23*$N$9+O23*$O$9+P23*$P$9+Q23*$Q$9+R23*$R$9+S23*$S$9)","v":2.6028846153846152},{"$f":"+G30/'D5 Salaires'!$I$20","v":2.6028846153846152},null,null,null,{"$f":"+K30/'D5 Salaires'!$I$20","v":0},{"$f":"+L30/'D5 Salaires'!$I$20","v":0},{"$f":"+M30/'D5 Salaires'!$I$20","v":0},{"$f":"+N30/'D5 Salaires'!$I$20","v":0},{"$f":"+O30/'D5 Salaires'!$I$20","v":0},{"$f":"+P30/'D5 Salaires'!$I$20","v":0},{"$f":"+Q30/'D5 Salaires'!$I$20","v":0},{"$f":"+R30/'D5 Salaires'!$I$20","v":0},{"$f":"+S30/'D5 Salaires'!$I$20","v":0}]
[null,null,null,"Par site PEC MAS ambulatoire ","EPT",null,{"$f":"+IF('D9 Variables temps'!F29=0,0,G23/'D9 Variables temps'!F29)","v":1.3014423076923076},null,null,null,{"$f":"+IF('D9 Variables temps'!J29=0,0,K23/'D9 Variables temps'!J29)","v":0},{"$f":"+IF('D9 Variables temps'!K29=0,0,L23/'D9 Variables temps'!K29)","v":0},{"$f":"+IF('D9 Variables temps'!L29=0,0,M23/'D9 Variables temps'!L29)","v":0},{"$f":"+IF('D9 Variables temps'!M29=0,0,N23/'D9 Variables temps'!M29)","v":0},{"$f":"+IF('D9 Variables temps'!N29=0,0,O23/'D9 Variables temps'!N29)","v":0},{"$f":"+IF('D9 Variables temps'!O29=0,0,P23/'D9 Variables temps'!O29)","v":0},{"$f":"+IF('D9 Variables temps'!P29=0,0,Q23/'D9 Variables temps'!P29)","v":0},{"$f":"+IF('D9 Variables temps'!Q29=0,0,R23/'D9 Variables temps'!Q29)","v":0},{"$f":"+IF('D9 Variables temps'!R29=0,0,S23/'D9 Variables temps'!R29)","v":0}]
[null,null,null,"case management","EPT",{"$f":"+SUM(K25:S25)+G25","v":71.75},{"$f":"+'R8 Traitement (main-d''oeuvres)'!F32","v":71.75},null,null,null,{"$f":"+'R8 Traitement (main-d''oeuvres)'!J32","v":0},{"$f":"+'R8 Traitement (main-d''oeuvres)'!K32","v":0},{"$f":"+'R8 Traitement (main-d''oeuvres)'!L32","v":0},{"$f":"+'R8 Traitement (main-d''oeuvres)'!M32","v":0},{"$f":"+'R8 Traitement (main-d''oeuvres)'!N32","v":0},{"$f":"+'R8 Traitement (main-d''oeuvres)'!O32","v":0},{"$f":"+'R8 Traitement (main-d''oeuvres)'!P32","v":0},{"$f":"+'R8 Traitement (main-d''oeuvres)'!Q32","v":0},{"$f":"+'R8 Traitement (main-d''oeuvres)'!R32","v":0}]
[null,null,null,"supervising COWs","EPT",375,{"$f":"+'R13 Supervision'!F43","v":375},null,null,null,{"$f":"+'R13 Supervision'!J43","v":0},{"$f":"+'R13 Supervision'!K43","v":0},{"$f":"+'R13 Supervision'!L43","v":0},{"$f":"+'R13 Supervision'!M43","v":0},{"$f":"+'R13 Supervision'!N43","v":0},{"$f":"+'R13 Supervision'!O43","v":0},{"$f":"+'R13 Supervision'!P43","v":0},{"$f":"+'R13 Supervision'!Q43","v":0},{"$f":"+'R13 Supervision'!R43","v":0}]
[null,null,null,"training COWs","EPT",24,{"$f":"+'R12 Formation'!F58","v":24},null,null,null,{"$f":"+'R12 Formation'!J58","v":0},{"$f":"+'R12 Formation'!K58","v":0},{"$f":"+'R12 Formation'!L58","v":0},{"$f":"+'R12 Formation'!M58","v":0},{"$f":"+'R12 Formation'!N58","v":0},{"$f":"+'R12 Formation'!O58","v":0},{"$f":"+'R12 Formation'!P58","v":0},{"$f":"+'R12 Formation'!Q58","v":0},{"$f":"+'R12 Formation'!R58","v":0}]
[null,null,null,"being trained","EPT",6,{"$f":"+'R12 Formation'!F64/2","v":6},null,null,null,{"$f":"+'R12 Formation'!J64/2","v":0},{"$f":"+'R12 Formation'!K64/2","v":0},{"$f":"+'R12 Formation'!L64/2","v":0},{"$f":"+'R12 Formation'!M64/2","v":0},{"$f":"+'R12 Formation'!N64/2","v":0},{"$f":"+'R12 Formation'!O64/2","v":0},{"$f":"+'R12 Formation'!P64/2","v":0},{"$f":"+'R12 Formation'!Q64/2","v":0},{"$f":"+'R12 Formation'!R64/2","v":0}]
[null,null,null,"establishing community outreach","EPT",200,{"$f":"+'R14 Extension communautaire'!F31","v":200},null,null,null,{"$f":"+'R14 Extension communautaire'!J31","v":0},{"$f":"+'R14 Extension communautaire'!K31","v":0},{"$f":"+'R14 Extension communautaire'!L31","v":0},{"$f":"+'R14 Extension communautaire'!M31","v":0},{"$f":"+'R14 Extension communautaire'!N31","v":0},{"$f":"+'R14 Extension communautaire'!O31","v":0},{"$f":"+'R14 Extension communautaire'!P31","v":0},{"$f":"+'R14 Extension communautaire'!Q31","v":0},{"$f":"+'R14 Extension communautaire'!R31","v":0}]
[null,null,null,"Total","EPT",676.75,{"$f":"+SUM(G25:G29)","v":676.75},null,null,null,{"$f":"+SUM(K25:K29)","v":0},0,0,0,0,0,0,0,0]
[null,null,"Personnel junior \nPEC MAS ambulatoire","TOTAL","EPT",{"$f":"+(G31*$G$9+K31*$K$9+L31*$L$9+M31*$M$9+N31*$N$9+O31*$O$9+P31*$P$9+Q31*$Q$9+R31*$R$9+S31*$S$9)","v":1.0682692307692307},{"$f":"+G36/'D5 Salaires'!$I$20","v":1.0682692307692307},null,null,null,{"$f":"+K36/'D5 Salaires'!$I$20","v":0},{"$f":"+L36/'D5 Salaires'!$I$20","v":0},{"$f":"+M36/'D5 Salaires'!$I$20","v":0},{"$f":"+N36/'D5 Salaires'!$I$20","v":0},{"$f":"+O36/'D5 Salaires'!$I$20","v":0},{"$f":"+P36/'D5 Salaires'!$I$20","v":0},{"$f":"+Q36/'D5 Salaires'!$I$20","v":0},{"$f":"+R36/'D5 Salaires'!$I$20","v":0},{"$f":"+S36/'D5 Salaires'!$I$20","v":0}]
[null,null,null,"Par site PEC MAS ambulatoire ","EPT",null,{"$f":"+IF('D9 Variables temps'!F29=0,0,G31/'D9 Variables temps'!F29)","v":0.53413461538461537},null,null,null,{"$f":"+IF('D9 Variables temps'!J29=0,0,K31/'D9 Variables temps'!J29)","v":0},{"$f":"+IF('D9 Variables temps'!K29=0,0,L31/'D9 Variables temps'!K29)","v":0},{"$f":"+IF('D9 Variables temps'!L29=0,0,M31/'D9 Variables temps'!L29)","v":0},{"$f":"+IF('D9 Variables temps'!M29=0,0,N31/'D9 Variables temps'!M29)","v":0},{"$f":"+IF('D9 Variables temps'!N29=0,0,O31/'D9 Variables temps'!N29)","v":0},{"$f":"+IF('D9 Variables temps'!O29=0,0,P31/'D9 Variables temps'!O29)","v":0},{"$f":"+IF('D9 Variables temps'!P29=0,0,Q31/'D9 Variables temps'!P29)","v":0},{"$f":"+IF('D9 Variables temps'!Q29=0,0,R31/'D9 Variables temps'!Q29)","v":0},{"$f":"+IF('D9 Variables temps'!R29=0,0,S31/'D9 Variables temps'!R29)","v":0}]
[null,null,null,"case management","EPT",{"$f":"+SUM(K33:S33)+G33","v":71.75},{"$f":"+'R8 Traitement (main-d''oeuvres)'!F33","v":71.75},null,null,null,{"$f":"+'R8 Traitement (main-d''oeuvres)'!J33","v":0},{"$f":"+'R8 Traitement (main-d''oeuvres)'!K33","v":0},{"$f":"+'R8 Traitement (main-d''oeuvres)'!L33","v":0},{"$f":"+'R8 Traitement (main-d''oeuvres)'!M33","v":0},{"$f":"+'R8 Traitement (main-d''oeuvres)'!N33","v":0},{"$f":"+'R8 Traitement (main-d''oeuvres)'!O33","v":0},{"$f":"+'R8 Traitement (main-d''oeuvres)'!P33","v":0},{"$f":"+'R8 Traitement (main-d''oeuvres)'!Q33","v":0},{"$f":"+'R8 Traitement (main-d''oeuvres)'!R33","v":0}]
[null,null,null,"being trained","EPT",{"$f":"+SUM(K34:S34)+G34","v":6},{"$f":"+'R12 Formation'!F64/2","v":6},null,null,null,{"$f":"+'R12 Formation'!J64/2","v":0},{"$f":"+'R12 Formation'!K64/2","v":0},{"$f":"+'R12 Formation'!L64/2","v":0},{"$f":"+'R12 Formation'!M64/2","v":0},{"$f":"+'R12 Formation'!N64/2","v":0},{"$f":"+'R12 Formation'!O64/2","v":0},{"$f":"+'R12 Formation'!P64/2","v":0},{"$f":"+'R12 Formation'!Q64/2","v":0},{"$f":"+'R12 Formation'!R64/2","v":0}]
[null,null,null,"establishing community outreach","EPT",{"$f":"+SUM(K35:S35)+G35","v":200},{"$f":"+'R14 Extension communautaire'!F32","v":200},null,null,null,{"$f":"+'R14 Extension communautaire'!J32","v":0},{"$f":"+'R14 Extension communautaire'!K32","v":0},{"$f":"+'R14 Extension communautaire'!L32","v":0},{"$f":"+'R14 Extension communautaire'!M32","v":0},{"$f":"+'R14 Extension communautaire'!N32","v":0},{"$f":"+'R14 Extension communautaire'!O32","v":0},{"$f":"+'R14 Extension communautaire'!P32","v":0},{"$f":"+'R14 Extension communautaire'!Q32","v":0},{"$f":"+'R14 Extension communautaire'!R32","v":0}]
[null,null,null,"Total","EPT",{"$f":"+SUM(K36:S36)+G36","v":277.75},{"$f":"+SUM(G33:G35)","v":277.75},null,null,null,{"$f":"+SUM(K33:K35)","v":0},0,0,0,0,0,0,0,0]
[null,null,"Gardiens","TOTAL","EPT",{"$f":"+(G37*$G$9+K37*$K$9+L37*$L$9+M37*$M$9+N37*$N$9+O37*$O$9+P37*$P$9+Q37*$Q$9+R37*$R$9+S37*$S$9)","v":2},{"$f":"+'R11 Logistique approvisionnemen'!F33","v":2},null,null,null,{"$f":"+'R11 Logistique approvisionnemen'!J33","v":0},{"$f":"+'R11 Logistique approvisionnemen'!K33","v":0},{"$f":"+'R11 Logistique approvisionnemen'!L33","v":0},{"$f":"+'R11 Logistique approvisionnemen'!M33","v":0},{"$f":"+'R11 Logistique approvisionnemen'!N33","v":0},{"$f":"+'R11 Logistique approvisionnemen'!O33","v":0},{"$f":"+'R11 Logistique approvisionnemen'!P33","v":0},{"$f":"+'R11 Logistique approvisionnemen'!Q33","v":0},{"$f":"+'R11 Logistique approvisionnemen'!R33","v":0}]
[null,null,null,"Par site PEC MAS ambulatoire ","EPT",null,{"$f":"+IF('D9 Variables temps'!F29=0,0,G37/'D9 Variables temps'!F29)","v":1},null,null,null,{"$f":"+IF('D9 Variables temps'!J29=0,0,K37/'D9 Variables temps'!J29)","v":0},{"$f":"+IF('D9 Variables temps'!K29=0,0,L37/'D9 Variables temps'!K29)","v":0},{"$f":"+IF('D9 Variables temps'!L29=0,0,M37/'D9 Variables temps'!L29)","v":0},{"$f":"+IF('D9 Variables temps'!M29=0,0,N37/'D9 Variables temps'!M29)","v":0},{"$f":"+IF('D9 Variables temps'!N29=0,0,O37/'D9 Variables temps'!N29)","v":0},{"$f":"+IF('D9 Variables temps'!O29=0,0,P37/'D9 Variables temps'!O29)","v":0},{"$f":"+IF('D9 Variables temps'!P29=0,0,Q37/'D9 Variables temps'!P29)","v":0},{"$f":"+IF('D9 Variables temps'!Q29=0,0,R37/'D9 Variables temps'!Q29)","v":0},{"$f":"+IF('D9 Variables temps'!R29=0,0,S37/'D9 Variables temps'!R29)","v":0}]
[]
[null,"PEC MAS hospitalière"]
[null,null,"Personnel senior\nPEC MAS hospitalière","TOTAL","EPT",{"$f":"+(G41*$G$9+K41*$K$9+L41*$L$9+M41*$M$9+N41*$N$9+O41*$O$9+P41*$P$9+Q41*$Q$9+R41*$R$9+S41*$S$9)","v":0.43221153846153848},{"$f":"+G45/'D5 Salaires'!$I$20","v":0.43221153846153848},null,null,null,{"$f":"+K45/'D5 Salaires'!$I$20","v":0},{"$f":"+L45/'D5 Salaires'!$I$20","v":0},{"$f":"+M45/'D5 Salaires'!$I$20","v":0},{"$f":"+N45/'D5 Salaires'!$I$20","v":0},{"$f":"+O45/'D5 Salaires'!$I$20","v":0},{"$f":"+P45/'D5 Salaires'!$I$20","v":0},{"$f":"+Q45/'D5 Salaires'!$I$20","v":0},{"$f":"+R45/'D5 Salaires'!$I$20","v":0},{"$f":"+S45/'D5 Salaires'!$I$20","v":0}]
[null,null,null,"Par site PEC MAS hospitalière ","EPT",null,{"$f":"+IF('D9 Variables temps'!F32=0,0,G41/'D9 Variables temps'!F32)","v":0.43221153846153848},null,null,null,{"$f":"+IF('D9 Variables temps'!J32=0,0,K41/'D9 Variables temps'!J32)","v":0},{"$f":"+IF('D9 Variables temps'!K32=0,0,L41/'D9 Variables temps'!K32)","v":0},{"$f":"+IF('D9 Variables temps'!L32=0,0,M41/'D9 Variables temps'!L32)","v":0},{"$f":"+IF('D9 Variables temps'!M32=0,0,N41/'D9 Variables temps'!M32)","v":0},{"$f":"+IF('D9 Variables temps'!N32=0,0,O41/'D9 Variables temps'!N32)","v":0},{"$f":"+IF('D9 Variables temps'!O32=0,0,P41/'D9 Variables temps'!O32)","v":0},{"$f":"+IF('D9 Variables temps'!P32=0,0,Q41/'D9 Variables temps'!P32)","v":0},{"$f":"+IF('D9 Variables temps'!Q32=0,0,R41/'D9 Variables temps'!Q32)","v":0},{"$f":"+IF('D9 Variables temps'!R32=0,0,S41/'D9 Variables temps'!R32)","v":0}]
[null,null,null,"case management","EPT",{"$f":"+SUM(K43:S43)+G43","v":106.375},{"$f":"+'R8 Traitement (main-d''oeuvres)'!F34","v":106.375},null,null,null,{"$f":"+'R8 Traitement (main-d''oeuvres)'!J34","v":0},{"$f":"+'R8 Traitement (main-d''oeuvres)'!K34","v":0},{"$f":"+'R8 Traitement (main-d''oeuvres)'!L34","v":0},{"$f":"+'R8 Traitement (main-d''oeuvres)'!M34","v":0},{"$f":"+'R8 Traitement (main-d''oeuvres)'!N34","v":0},{"$f":"+'R8 Traitement (main-d''oeuvres)'!O34","v":0},{"$f":"+'R8 Traitement (main-d''oeuvres)'!P34","v":0},{"$f":"+'R8 Traitement (main-d''oeuvres)'!Q34","v":0},{"$f":"+'R8 Traitement (main-d''oeuvres)'!R34","v":0}]
[null,null,null,"being trained","EPT",6,{"$f":"+'R12 Formation'!F65/2","v":6},null,null,null,{"$f":"+'R12 Formation'!J65/2","v":0},{"$f":"+'R12 Formation'!K65/2","v":0},{"$f":"+'R12 Formation'!L65/2","v":0},{"$f":"+'R12 Formation'!M65/2","v":0},{"$f":"+'R12 Formation'!N65/2","v":0},{"$f":"+'R12 Formation'!O65/2","v":0},{"$f":"+'R12 Formation'!P65/2","v":0},{"$f":"+'R12 Formation'!Q65/2","v":0},{"$f":"+'R12 Formation'!R65/2","v":0}]
[null,null,null,"Total","EPT",112.375,{"$f":"+SUM(G43:G44)","v":112.375},null,null,null,{"$f":"+SUM(K43:K44)","v":0},0,0,0,0,0,0,0,0]
[null,null,"Personnel junior \nPEC MAS hospitalière","TOTAL","EPT",{"$f":"+(G46*$G$9+K46*$K$9+L46*$L$9+M46*$M$9+N46*$N$9+O46*$O$9+P46*$P$9+Q46*$Q$9+R46*$R$9+S46*$S$9)","v":4.2346153846153847},{"$f":"+G50/'D5 Salaires'!$I$20","v":4.2346153846153847},null,null,null,{"$f":"+K50/'D5 Salaires'!$I$20","v":0},{"$f":"+L50/'D5 Salaires'!$I$20","v":0},{"$f":"+M50/'D5 Salaires'!$I$20","v":0},{"$f":"+N50/'D5 Salaires'!$I$20","v":0},{"$f":"+O50/'D5 Salaires'!$I$20","v":0},{"$f":"+P50/'D5 Salaires'!$I$20","v":0},{"$f":"+Q50/'D5 Salaires'!$I$20","v":0},{"$f":"+R50/'D5 Salaires'!$I$20","v":0},{"$f":"+S50/'D5 Salaires'!$I$20","v":0}]
[null,null,null,"Par site PEC MAS hospitalière ","EPT",null,{"$f":"+IF('D9 Variables temps'!F32=0,0,G46/'D9 Variables temps'!F32)","v":4.2346153846153847},null,null,null,{"$f":"+IF('D9 Variables temps'!J32=0,0,K46/'D9 Variables temps'!J32)","v":0},{"$f":"+IF('D9 Variables temps'!K32=0,0,L46/'D9 Variables temps'!K32)","v":0},{"$f":"+IF('D9 Variables temps'!L32=0,0,M46/'D9 Variables temps'!L32)","v":0},{"$f":"+IF('D9 Variables temps'!M32=0,0,N46/'D9 Variables temps'!M32)","v":0},{"$f":"+IF('D9 Variables temps'!N32=0,0,O46/'D9 Variables temps'!N32)","v":0},{"$f":"+IF('D9 Variables temps'!O32=0,0,P46/'D9 Variables temps'!O32)","v":0},{"$f":"+IF('D9 Variables temps'!P32=0,0,Q46/'D9 Variables temps'!P32)","v":0},{"$f":"+IF('D9 Variables temps'!Q32=0,0,R46/'D9 Variables temps'!Q32)","v":0},{"$f":"+IF('D9 Variables temps'!R32=0,0,S46/'D9 Variables temps'!R32)","v":0}]
[null,null,null,"case management","EPT",1095,{"$f":"+'R8 Traitement (main-d''oeuvres)'!F35","v":1095},null,null,null,{"$f":"+'R8 Traitement (main-d''oeuvres)'!J35","v":0},{"$f":"+'R8 Traitement (main-d''oeuvres)'!K35","v":0},{"$f":"+'R8 Traitement (main-d''oeuvres)'!L35","v":0},{"$f":"+'R8 Traitement (main-d''oeuvres)'!M35","v":0},{"$f":"+'R8 Traitement (main-d''oeuvres)'!N35","v":0},{"$f":"+'R8 Traitement (main-d''oeuvres)'!O35","v":0},{"$f":"+'R8 Traitement (main-d''oeuvres)'!P35","v":0},{"$f":"+'R8 Traitement (main-d''oeuvres)'!Q35","v":0},{"$f":"+'R8 Traitement (main-d''oeuvres)'!R35","v":0}]
[null,null,null,"being trained","EPT",6,{"$f":"+'R12 Formation'!F65/2","v":6},null,null,null,{"$f":"+'R12 Formation'!J65/2","v":0},{"$f":"+'R12 Formation'!K65/2","v":0},{"$f":"+'R12 Formation'!L65/2","v":0},{"$f":"+'R12 Formation'!M65/2","v":0},{"$f":"+'R12 Formation'!N65/2","v":0},{"$f":"+'R12 Formation'!O65/2","v":0},{"$f":"+'R12 Formation'!P65/2","v":0},{"$f":"+'R12 Formation'!Q65/2","v":0},{"$f":"+'R12 Formation'!R65/2","v":0}]
[null,null,null,"Total","EPT",1101,{"$f":"+SUM(G48:G49)","v":1101},null,null,null,{"$f":"+SUM(K48:K49)","v":0},0,0,0,0,0,0,0,0]
[null,null,"Gardiens","TOTAL","EPT",{"$f":"+(G51*$G$9+K51*$K$9+L51*$L$9+M51*$M$9+N51*$N$9+O51*$O$9+P51*$P$9+Q51*$Q$9+R51*$R$9+S51*$S$9)","v":1},{"$f":"+'R11 Logistique approvisionnemen'!F34","v":1},null,null,null,{"$f":"+'R11 Logistique approvisionnemen'!J34","v":0},{"$f":"+'R11 Logistique approvisionnemen'!K34","v":0},{"$f":"+'R11 Logistique approvisionnemen'!L34","v":0},{"$f":"+'R11 Logistique approvisionnemen'!M34","v":0},{"$f":"+'R11 Logistique approvisionnemen'!N34","v":0},{"$f":"+'R11 Logistique approvisionnemen'!O34","v":0},{"$f":"+'R11 Logistique approvisionnemen'!P34","v":0},{"$f":"+'R11 Logistique approvisionnemen'!Q34","v":0},{"$f":"+'R11 Logistique approvisionnemen'!R34","v":0}]
[null,null,null,"Par site PEC MAS hospitalière ","EPT",null,{"$f":"+IF('D9 Variables temps'!F32=0,0,G51/'D9 Variables temps'!F32)","v":1},null,null,null,{"$f":"+IF('D9 Variables temps'!J32=0,0,K51/'D9 Variables temps'!J32)","v":0},{"$f":"+IF('D9 Variables temps'!K32=0,0,L51/'D9 Variables temps'!K32)","v":0},{"$f":"+IF('D9 Variables temps'!L32=0,0,M51/'D9 Variables temps'!L32)","v":0},{"$f":"+IF('D9 Variables temps'!M32=0,0,N51/'D9 Variables temps'!M32)","v":0},{"$f":"+IF('D9 Variables temps'!N32=0,0,O51/'D9 Variables temps'!N32)","v":0},{"$f":"+IF('D9 Variables temps'!O32=0,0,P51/'D9 Variables temps'!O32)","v":0},{"$f":"+IF('D9 Variables temps'!P32=0,0,Q51/'D9 Variables temps'!P32)","v":0},{"$f":"+IF('D9 Variables temps'!Q32=0,0,R51/'D9 Variables temps'!Q32)","v":0},{"$f":"+IF('D9 Variables temps'!R32=0,0,S51/'D9 Variables temps'!R32)","v":0}]
[]
[null,"Siège zone"]
[null,null,"Personnel senior","TOTAL","EPT",{"$f":"+(G55*$G$9+K55*$K$9+L55*$L$9+M55*$M$9+N55*$N$9+O55*$O$9+P55*$P$9+Q55*$Q$9+R55*$R$9+S55*$S$9)","v":4.6153846153846156E-2},{"$f":"+G56/'D5 Salaires'!$I$20","v":4.6153846153846156E-2},null,null,null,{"$f":"+K56/'D5 Salaires'!$I$20","v":0},{"$f":"+L56/'D5 Salaires'!$I$20","v":0},{"$f":"+M56/'D5 Salaires'!$I$20","v":0},{"$f":"+N56/'D5 Salaires'!$I$20","v":0},{"$f":"+O56/'D5 Salaires'!$I$20","v":0},{"$f":"+P56/'D5 Salaires'!$I$20","v":0},{"$f":"+Q56/'D5 Salaires'!$I$20","v":0},{"$f":"+R56/'D5 Salaires'!$I$20","v":0},{"$f":"+S56/'D5 Salaires'!$I$20","v":0}]
[null,null,null,"general management  (planning, budgeting, MIS etc)","EPT",12,{"$f":"+'R7 Gestion au siège de la zone'!F28","v":12},null,null,null,{"$f":"+'R7 Gestion au siège de la zone'!J28","v":0},{"$f":"+'R7 Gestion au siège de la zone'!K28","v":0},{"$f":"+'R7 Gestion au siège de la zone'!L28","v":0},{"$f":"+'R7 Gestion au siège de la zone'!M28","v":0},{"$f":"+'R7 Gestion au siège de la zone'!N28","v":0},{"$f":"+'R7 Gestion au siège de la zone'!O28","v":0},{"$f":"+'R7 Gestion au siège de la zone'!P28","v":0},{"$f":"+'R7 Gestion au siège de la zone'!Q28","v":0},{"$f":"+'R7 Gestion au siège de la zone'!R28","v":0}]
[null,null,"Personnel intermédiaire","TOTAL","EPT",0.27403846153846156,{"$f":"+G62/'D5 Salaires'!$I$20","v":0.27403846153846156},null,null,null,{"$f":"+K62/'D5 Salaires'!$I$20","v":0},{"$f":"+L62/'D5 Salaires'!$I$20","v":0},{"$f":"+M62/'D5 Salaires'!$I$20","v":0},{"$f":"+N62/'D5 Salaires'!$I$20","v":0},{"$f":"+O62/'D5 Salaires'!$I$20","v":0},{"$f":"+P62/'D5 Salaires'!$I$20","v":0},{"$f":"+Q62/'D5 Salaires'!$I$20","v":0},{"$f":"+R62/'D5 Salaires'!$I$20","v":0},{"$f":"+S62/'D5 Salaires'!$I$20","v":0}]
[null,null,null,"general management  (planning, budgeting, MIS etc)","EPT",42,{"$f":"+'R7 Gestion au siège de la zone'!F29","v":42},null,null,null,{"$f":"+'R7 Gestion au siège de la zone'!J29","v":0},{"$f":"+'R7 Gestion au siège de la zone'!K29","v":0},{"$f":"+'R7 Gestion au siège de la zone'!L29","v":0},{"$f":"+'R7 Gestion au siège de la zone'!M29","v":0},{"$f":"+'R7 Gestion au siège de la zone'!N29","v":0},{"$f":"+'R7 Gestion au siège de la zone'!O29","v":0},{"$f":"+'R7 Gestion au siège de la zone'!P29","v":0},{"$f":"+'R7 Gestion au siège de la zone'!Q29","v":0},{"$f":"+'R7 Gestion au siège de la zone'!R29","v":0}]
[null,null,null,"training OC and IC staff","EPT",16,{"$f":"+'R12 Formation'!F59+'R12 Formation'!F60","v":16},null,null,null,{"$f":"+'R12 Formation'!J59+'R12 Formation'!J60","v":0},{"$f":"+'R12 Formation'!K59+'R12 Formation'!K60","v":0},{"$f":"+'R12 Formation'!L59+'R12 Formation'!L60","v":0},{"$f":"+'R12 Formation'!M59+'R12 Formation'!M60","v":0},{"$f":"+'R12 Formation'!N59+'R12 Formation'!N60","v":0},{"$f":"+'R12 Formation'!O59+'R12 Formation'!O60","v":0},{"$f":"+'R12 Formation'!P59+'R12 Formation'!P60","v":0},{"$f":"+'R12 Formation'!Q59+'R12 Formation'!Q60","v":0},{"$f":"+'R12 Formation'!R59+'R12 Formation'!R60","v":0}]
[null,null,null,"supervising OC and iC staff","EPT",11.25,{"$f":"+'R13 Supervision'!F36","v":11.25},null,null,null,{"$f":"+'R13 Supervision'!J36","v":0},{"$f":"+'R13 Supervision'!K36","v":0},{"$f":"+'R13 Supervision'!L36","v":0},{"$f":"+'R13 Supervision'!M36","v":0},{"$f":"+'R13 Supervision'!N36","v":0},{"$f":"+'R13 Supervision'!O36","v":0},{"$f":"+'R13 Supervision'!P36","v":0},{"$f":"+'R13 Supervision'!Q36","v":0},{"$f":"+'R13 Supervision'!R36","v":0}]
[null,null,null,"being trained","EPT",2,{"$f":"+'R12 Formation'!F66","v":2},null,null,null,{"$f":"+'R12 Formation'!J66","v":0},{"$f":"+'R12 Formation'!K66","v":0},{"$f":"+'R12 Formation'!L66","v":0},{"$f":"+'R12 Formation'!M66","v":0},{"$f":"+'R12 Formation'!N66","v":0},{"$f":"+'R12 Formation'!O66","v":0},{"$f":"+'R12 Formation'!P66","v":0},{"$f":"+'R12 Formation'!Q66","v":0},{"$f":"+'R12 Formation'!R66","v":0}]
[null,null,null,"Total","EPT",71.25,{"$f":"+SUM(G58:G61)","v":71.25},null,null,null,{"$f":"+SUM(K58:K61)","v":0},0,0,0,0,0,0,0,0]
[null,null,"Personnel junior","TOTAL","EPT",0.3,{"$f":"+G64/'D5 Salaires'!$I$20","v":0.3},null,null,null,{"$f":"+K64/'D5 Salaires'!$I$20","v":0},{"$f":"+L64/'D5 Salaires'!$I$20","v":0},{"$f":"+M64/'D5 Salaires'!$I$20","v":0},{"$f":"+N64/'D5 Salaires'!$I$20","v":0},{"$f":"+O64/'D5 Salaires'!$I$20","v":0},{"$f":"+P64/'D5 Salaires'!$I$20","v":0},{"$f":"+Q64/'D5 Salaires'!$I$20","v":0},{"$f":"+R64/'D5 Salaires'!$I$20","v":0},{"$f":"+S64/'D5 Salaires'!$I$20","v":0}]
[null,null,null,"support for general management (planning, budgeting MIS etc)","EPT",{"$f":"+SUM(K64:S64)+G64","v":78},{"$f":"+'R7 Gestion au siège de la zone'!F30","v":78},null,null,null,{"$f":"+'R7 Gestion au siège de la zone'!J30","v":0},{"$f":"+'R7 Gestion au siège de la zone'!K30","v":0},{"$f":"+'R7 Gestion au siège de la zone'!L30","v":0},{"$f":"+'R7 Gestion au siège de la zone'!M30","v":0},{"$f":"+'R7 Gestion au siège de la zone'!N30","v":0},{"$f":"+'R7 Gestion au siège de la zone'!O30","v":0},{"$f":"+'R7 Gestion au siège de la zone'!P30","v":0},{"$f":"+'R7 Gestion au siège de la zone'!Q30","v":0},{"$f":"+'R7 Gestion au siège de la zone'!R30","v":0}]
[null,null,"Gardiens","TOTAL","EPT",{"$f":"+SUM(F66:F67)","v":4}]
[null,null,null,"For Area HQ","EPT",{"$f":"+SUM(K66:S66)+G66","v":1},{"$f":"+'R11 Logistique approvisionnemen'!F35","v":1},null,null,null,{"$f":"+'R11 Logistique approvisionnemen'!J35","v":0},{"$f":"+'R11 Logistique approvisionnemen'!K35","v":0},{"$f":"+'R11 Logistique approvisionnemen'!L35","v":0},{"$f":"+'R11 Logistique approvisionnemen'!M35","v":0},{"$f":"+'R11 Logistique approvisionnemen'!N35","v":0},{"$f":"+'R11 Logistique approvisionnemen'!O35","v":0},{"$f":"+'R11 Logistique approvisionnemen'!P35","v":0},{"$f":"+'R11 Logistique approvisionnemen'!Q35","v":0},{"$f":"+'R11 Logistique approvisionnemen'!R35","v":0}]
[null,null,null,"For OC and IC stores","EPT",{"$f":"+SUM(K67:S67)+G67","v":3},{"$f":"+'R11 Logistique approvisionnemen'!F33+'R11 Logistique approvisionnemen'!F34","v":3},null,null,null,{"$f":"+'R11 Logistique approvisionnemen'!J33+'R11 Logistique approvisionnemen'!J34","v":0},{"$f":"+'R11 Logistique approvisionnemen'!K33+'R11 Logistique approvisionnemen'!K34","v":0},{"$f":"+'R11 Logistique approvisionnemen'!L33+'R11 Logistique approvisionnemen'!L34","v":0},{"$f":"+'R11 Logistique approvisionnemen'!M33+'R11 Logistique approvisionnemen'!M34","v":0},{"$f":"+'R11 Logistique approvisionnemen'!N33+'R11 Logistique approvisionnemen'!N34","v":0},{"$f":"+'R11 Logistique approvisionnemen'!O33+'R11 Logistique approvisionnemen'!O34","v":0},{"$f":"+'R11 Logistique approvisionnemen'!P33+'R11 Logistique approvisionnemen'!P34","v":0},{"$f":"+'R11 Logistique approvisionnemen'!Q33+'R11 Logistique approvisionnemen'!Q34","v":0},{"$f":"+'R11 Logistique approvisionnemen'!R33+'R11 Logistique approvisionnemen'!R34","v":0}]
[null,null,"Chauffeurs","TOTAL","EPT",{"$f":"+F69/'D5 Salaires'!I20","v":2.1634615384615384E-2},{"$f":"+G69/'D5 Salaires'!$I$20","v":2.1634615384615384E-2},null,null,null,{"$f":"+K69/'D5 Salaires'!$I$20","v":0},{"$f":"+L69/'D5 Salaires'!$I$20","v":0},{"$f":"+M69/'D5 Salaires'!$I$20","v":0},{"$f":"+N69/'D5 Salaires'!$I$20","v":0},{"$f":"+O69/'D5 Salaires'!$I$20","v":0},{"$f":"+P69/'D5 Salaires'!$I$20","v":0},{"$f":"+Q69/'D5 Salaires'!$I$20","v":0},{"$f":"+R69/'D5 Salaires'!$I$20","v":0},{"$f":"+S69/'D5 Salaires'!$I$20","v":0}]
[null,null,null,"delivering therapeutic food from Area HQ to Outpatient and Inpatient Care sites ","days",{"$f":"+(G69*$G$9+K69*$K$9+L69*$L$9+M69*$M$9+N69*$N$9+O69*$O$9+P69*$P$9+Q69*$Q$9+R69*$R$9+S69*$S$9)","v":5.625},{"$f":"+'R11 Logistique approvisionnemen'!F38+'R11 Logistique approvisionnemen'!F39","v":5.625},null,null,null,{"$f":"+'R11 Logistique approvisionnemen'!J38+'R11 Logistique approvisionnemen'!J39","v":0},{"$f":"+'R11 Logistique approvisionnemen'!K38+'R11 Logistique approvisionnemen'!K39","v":0},{"$f":"+'R11 Logistique approvisionnemen'!L38+'R11 Logistique approvisionnemen'!L39","v":0},{"$f":"+'R11 Logistique approvisionnemen'!M38+'R11 Logistique approvisionnemen'!M39","v":0},{"$f":"+'R11 Logistique approvisionnemen'!N38+'R11 Logistique approvisionnemen'!N39","v":0},{"$f":"+'R11 Logistique approvisionnemen'!O38+'R11 Logistique approvisionnemen'!O39","v":0},{"$f":"+'R11 Logistique approvisionnemen'!P38+'R11 Logistique approvisionnemen'!P39","v":0},{"$f":"+'R11 Logistique approvisionnemen'!Q38+'R11 Logistique approvisionnemen'!Q39","v":0},{"$f":"+'R11 Logistique approvisionnemen'!R38+'R11 Logistique approvisionnemen'!R39","v":0}]
[]
[null,"Siège groupe-zones"]
[null,null,"Personnel senior","TOTAL","EPT",{"$f":"+F73*5/'D5 Salaires'!I20","v":0}]
[null,null,null,"general management  (planning, budgeting, MIS etc)","EPT",{"$f":"+'R6 Niveau group-zones et centre'!Q42","v":0}]
[null,null,"Personnel intermédiaire","TOTAL","EPT",{"$f":"+(F75*5+F76+F77+F78)/'D5 Salaires'!I20","v":4.2307692307692315E-3}]
[null,null,null,"general management  (planning, budgeting, MIS etc)","EPT",{"$f":"+'R6 Niveau group-zones et centre'!Q43+'R6 Niveau group-zones et centre'!Q44","v":0}]
[null,null,null,"training Area HQ staff","EPT",{"$f":"+'R6 Niveau group-zones et centre'!Q17","v":0}]
[null,null,null,"supervising Area HQ staff","EPT",{"$f":"+SUM('R13 Supervision'!F47:R47)","v":1.1000000000000001}]
[null,null,null,"being trained","EPT",{"$f":"+'R6 Niveau group-zones et centre'!Q23","v":0}]
[null,null,"Gardiens","TOTAL","EPT",{"$f":"+'R6 Niveau group-zones et centre'!O37","v":0}]
[null,null,"Chauffeurs","TOTAL","EPT",{"$f":"+F81/'D5 Salaires'!I20","v":6.3461538461538469E-3}]
[null,null,null,"Delivering therapeutic food from Group -Area to Area HQ ","days",{"$f":"+SUM(K81:S81)+G81","v":1.6500000000000001},{"$f":"+'R11 Logistique approvisionnemen'!F40","v":1.6500000000000001},null,null,null,{"$f":"+'R11 Logistique approvisionnemen'!J40","v":0},{"$f":"+'R11 Logistique approvisionnemen'!K40","v":0},{"$f":"+'R11 Logistique approvisionnemen'!L40","v":0},{"$f":"+'R11 Logistique approvisionnemen'!M40","v":0},{"$f":"+'R11 Logistique approvisionnemen'!N40","v":0},{"$f":"+'R11 Logistique approvisionnemen'!O40","v":0},{"$f":"+'R11 Logistique approvisionnemen'!P40","v":0},{"$f":"+'R11 Logistique approvisionnemen'!Q40","v":0},{"$f":"+'R11 Logistique approvisionnemen'!R40","v":0}]
[]
[null,"Niveau national"]
[null,null,"Personnel senior","TOTAL","EPT",{"$f":"+'R6 Niveau group-zones et centre'!Q50","v":0}]
[null,null,null,"establishing CMAM in the country","EPT",{"$f":"+'R6 Niveau group-zones et centre'!Q50","v":0}]
[null,null,"Personnel intermédiaire","TOTAL","EPT",{"$f":"+F87+F89+F88/'D5 Salaires'!I20","v":0.5}]
[null,null,null,"general management  (planning, budgeting, MIS etc)","EPT",{"$f":"+'R6 Niveau group-zones et centre'!Q47","v":0.5}]
[null,null,null,"training GroupArea HQ staff","EPT",{"$f":"+'R6 Niveau group-zones et centre'!Q24","v":0}]
[null,null,null,"assisting in the establishment of CMAM","EPT",{"$f":"+'R6 Niveau group-zones et centre'!Q51","v":0}]
[null,null,"Gardiens","TOTAL","EPT",{"$f":"+'R6 Niveau group-zones et centre'!P37","v":1}]
[null,null,"Chauffeurs","TOTAL","EPT",{"$f":"+F92/'D5 Salaires'!I20","v":0}]
[null,null,null,"Delivering therapeutic food to Group-Areas from national HQ","days",{"$f":"+'R6 Niveau group-zones et centre'!Q35","v":0}]
[]
[]
[]
[null,"*"]

{"sheet":"R2 Transport","index":16,"n_rows":33,"n_cols":18,"rows_kept":33,"cut":false,"hidden":false,"merged":[[10,4,11,4],[4,2,4,8]]}
[]
["Retour au sommaire",null,"R2: Besoins annuels en transports pour la PCMA"]
[]
[null,null,"Number of Areas included ",{"$f":"+'D1 Données générales'!G31","v":1},null,"  (taken from Worksheet 2)"]
[null,null,"Cette Feuille de calcul montre (pour l'année choisie) les distances parcourues pour le transport des fournitures et des personnes pour la mise en oeuvre de la PCMA. "]
[]
[null,null,{"$f":"+IF('D1 Données générales'!$H$11=\"\",\"\",'D1 Données générales'!$H$11)","v":"Ghana"}]
[null,null,{"$f":"+'D9 Variables temps'!$I$6","v":2011}]
[null,null,null,null,null,{"$f":"+IF('D1 Données générales'!$G$31<1,0,1)","v":1},null,null,null,{"$f":"+IF('D1 Données générales'!$G$31<2,0,1)","v":0},{"$f":"+IF('D1 Données générales'!$G$31<3,0,1)","v":0},{"$f":"+IF('D1 Données générales'!$G$31<4,0,1)","v":0},{"$f":"+IF('D1 Données générales'!$G$31<5,0,1)","v":0},{"$f":"+IF('D1 Données générales'!$G$31<6,0,1)","v":0},{"$f":"+IF('D1 Données générales'!$G$31<7,0,1)","v":0},{"$f":"+IF('D1 Données générales'!$G$31<8,0,1)","v":0},{"$f":"+IF('D1 Données générales'!$G$31<9,0,1)","v":0},{"$f":"+IF('D1 Données générales'!$G$31<10,0,1)","v":0}]
[null,null,null,null,"Toutes zones","Zone 1",null,null,null,"Zone 2","Zone3","Zone 4","Zone 5","Zone 6","Zone 7","Zone 8","Zone 9","Zone 10"]
[null,null,null,{"$f":"'D2 Echelle'!$C$30","v":"district"},"TOTAL toutes zones",{"$f":"+IF('D2 Echelle'!$C$31=\"\",\"\",'D2 Echelle'!$C$31)","v":"Ashiedu Keteke"},null,null,null,{"$f":"+IF('D2 Echelle'!$C$36=\"\",\"\",'D2 Echelle'!$C$36)","v":""},{"$f":"+IF('D2 Echelle'!$C$41=\"\",\"\",'D2 Echelle'!$C$41)","v":""},{"$f":"+IF('D2 Echelle'!$C$46=\"\",\"\",'D2 Echelle'!$C$46)","v":""},{"$f":"+IF('D2 Echelle'!$C$51=\"\",\"\",'D2 Echelle'!$C$51)","v":""},{"$f":"+IF('D2 Echelle'!$C$56=\"\",\"\",'D2 Echelle'!$C$56)","v":""},{"$f":"+IF('D2 Echelle'!$C$61=\"\",\"\",'D2 Echelle'!$C$61)","v":""},{"$f":"+IF('D2 Echelle'!$C$66=\"\",\"\",'D2 Echelle'!$C$66)","v":""},{"$f":"+IF('D2 Echelle'!$C$71=\"\",\"\",'D2 Echelle'!$C$71)","v":""},{"$f":"+IF('D2 Echelle'!$C$76=\"\",\"\",'D2 Echelle'!$C$76)","v":""}]
[null,null,null,{"$f":"+'D2 Echelle'!$D$30","v":"région"},null,{"$f":"+IF('D2 Echelle'!$D$31=\"\",\"\",'D2 Echelle'!$D$31)","v":"Greater Accra"},null,null,null,{"$f":"+IF('D2 Echelle'!$D$36=\"\",\"\",'D2 Echelle'!$D$36)","v":""},{"$f":"+IF('D2 Echelle'!$D$41=\"\",\"\",'D2 Echelle'!$D$41)","v":""},{"$f":"+IF('D2 Echelle'!$D$46=\"\",\"\",'D2 Echelle'!$D$46)","v":""},{"$f":"+IF('D2 Echelle'!$D$51=\"\",\"\",'D2 Echelle'!$D$51)","v":""},{"$f":"+IF('D2 Echelle'!$D$56=\"\",\"\",'D2 Echelle'!$D$56)","v":""},{"$f":"+IF('D2 Echelle'!$D$61=\"\",\"\",'D2 Echelle'!$D$61)","v":""},{"$f":"+IF('D2 Echelle'!$D$66=\"\",\"\",'D2 Echelle'!$D$66)","v":""},{"$f":"+IF('D2 Echelle'!$D$71=\"\",\"\",'D2 Echelle'!$D$71)","v":""},{"$f":"+IF('D2 Echelle'!$D$76=\"\",\"\",'D2 Echelle'!$D$76)","v":""}]
[null,"Lieu","Activité","Unités"]
[null,"Entre la communauté et les sites PEC MAS ambulatoire"]
[null,null,"Formation (AEC aux sites PEC MAS ambulatoire)","km-pers.",{"$f":"+F15*$F$9+J15*$J$9+K15*$K$9+$L$9*L15+M15*$M$9+$N$9*N15+O15*$O$9+$P$9*P15+Q15*$Q$9+$R$9*R15","v":1200},{"$f":"+'R12 Formation'!F78","v":1200},null,null,null,{"$f":"+'R12 Formation'!J78","v":0},{"$f":"+'R12 Formation'!K78","v":0},{"$f":"+'R12 Formation'!L78","v":0},{"$f":"+'R12 Formation'!M78","v":0},{"$f":"+'R12 Formation'!N78","v":0},{"$f":"+'R12 Formation'!O78","v":0},{"$f":"+'R12 Formation'!P78","v":0},{"$f":"+'R12 Formation'!Q78","v":0},{"$f":"+'R12 Formation'!R78","v":0}]
[null,null,"Supervision (Personnel PEC MAS ambulatoire à communauté)","km-pers.",{"$f":"+F16*$F$9+J16*$J$9+K16*$K$9+$L$9*L16+M16*$M$9+$N$9*N16+O16*$O$9+$P$9*P16+Q16*$Q$9+$R$9*R16","v":7200},{"$f":"+'R13 Supervision'!F44","v":7200},null,null,null,{"$f":"+'R13 Supervision'!J44","v":0},{"$f":"+'R13 Supervision'!K44","v":0},{"$f":"+'R13 Supervision'!L44","v":0},{"$f":"+'R13 Supervision'!M44","v":0},{"$f":"+'R13 Supervision'!N44","v":0},{"$f":"+'R13 Supervision'!O44","v":0},{"$f":"+'R13 Supervision'!P44","v":0},{"$f":"+'R13 Supervision'!Q44","v":0},{"$f":"+'R13 Supervision'!R44","v":0}]
[]
[null,"Entre sites PEC MAS ambulatoire et sites PEC MAS hospitalière"]
[null,null,"Transport des enfants avec complications médicales du site PEC MAS ambulatoire au site PEC MAS hospitalière et retour une fois que les complications sont résolues","km-pers.",{"$f":"+F19*$F$9+J19*$J$9+K19*$K$9+$L$9*L19+M19*$M$9+$N$9*N19+O19*$O$9+$P$9*P19+Q19*$Q$9+$R$9*R19","v":105.75},{"$f":"+'R10 Traitement (fournitures)'!G37","v":105.75},null,null,null,{"$f":"+'R10 Traitement (fournitures)'!I37","v":0},{"$f":"+'R10 Traitement (fournitures)'!K37","v":0},{"$f":"+'R10 Traitement (fournitures)'!M37","v":0},{"$f":"+'R10 Traitement (fournitures)'!O37","v":0},{"$f":"+'R10 Traitement (fournitures)'!Q37","v":0},{"$f":"+'R10 Traitement (fournitures)'!S37","v":0},{"$f":"+'R10 Traitement (fournitures)'!U37","v":0},{"$f":"+'R10 Traitement (fournitures)'!W37","v":0},{"$f":"+'R10 Traitement (fournitures)'!Y37","v":0}]
[null,"Entre les sites PEC MAS ambulatoire ou les sites PEC MAS hospitalière et le siège de la zone"]
[null,null,"Livraison de l'aliment thérapeutique aux sites","km",{"$f":"+F21*$F$9+J21*$J$9+K21*$K$9+$L$9*L21+M21*$M$9+$N$9*N21+O21*$O$9+$P$9*P21+Q21*$Q$9+$R$9*R21","v":180},{"$f":"+'R11 Logistique approvisionnemen'!F31","v":180},null,null,null,{"$f":"+'R11 Logistique approvisionnemen'!J31","v":0},{"$f":"+'R11 Logistique approvisionnemen'!K31","v":0},{"$f":"+'R11 Logistique approvisionnemen'!L31","v":0},{"$f":"+'R11 Logistique approvisionnemen'!M31","v":0},{"$f":"+'R11 Logistique approvisionnemen'!N31","v":0},{"$f":"+'R11 Logistique approvisionnemen'!O31","v":0},{"$f":"+'R11 Logistique approvisionnemen'!P31","v":0},{"$f":"+'R11 Logistique approvisionnemen'!Q31","v":0},{"$f":"+'R11 Logistique approvisionnemen'!R31","v":0}]
[null,null,"Formation (personnel PEC MAS ambulatoire ou hospitalière au siège de la zone)","km-pers.",{"$f":"+F22*$F$9+J22*$J$9+K22*$K$9+$L$9*L22+M22*$M$9+$N$9*N22+O22*$O$9+$P$9*P22+Q22*$Q$9+$R$9*R22","v":80},{"$f":"+('R12 Formation'!F79+'R12 Formation'!F80)","v":80},null,null,null,{"$f":"+('R12 Formation'!J79+'R12 Formation'!J80)","v":0},{"$f":"+('R12 Formation'!K79+'R12 Formation'!K80)","v":0},{"$f":"+('R12 Formation'!L79+'R12 Formation'!L80)","v":0},{"$f":"+('R12 Formation'!M79+'R12 Formation'!M80)","v":0},{"$f":"+('R12 Formation'!N79+'R12 Formation'!N80)","v":0},{"$f":"+('R12 Formation'!O79+'R12 Formation'!O80)","v":0},{"$f":"+('R12 Formation'!P79+'R12 Formation'!P80)","v":0},{"$f":"+('R12 Formation'!Q79+'R12 Formation'!Q80)","v":0},{"$f":"+('R12 Formation'!R79+'R12 Formation'!R80)","v":0}]
[null,null,"Supervision (Personnel siège de la zone au site de soins PEC MAS ambulatoire/hospitalière)","km-pers.",{"$f":"+F23*$F$9+J23*$J$9+K23*$K$9+$L$9*L23+M23*$M$9+$N$9*N23+O23*$O$9+$P$9*P23+Q23*$Q$9+$R$9*R23","v":96},{"$f":"+'R13 Supervision'!F38","v":96},null,null,null,{"$f":"+'R13 Supervision'!J38","v":0},{"$f":"+'R13 Supervision'!K38","v":0},{"$f":"+'R13 Supervision'!L38","v":0},{"$f":"+'R13 Supervision'!M38","v":0},{"$f":"+'R13 Supervision'!N38","v":0},{"$f":"+'R13 Supervision'!O38","v":0},{"$f":"+'R13 Supervision'!P38","v":0},{"$f":"+'R13 Supervision'!Q38","v":0},{"$f":"+'R13 Supervision'!R38","v":0}]
[]
[null,"Entre le siège de la zone et le siège du groupe-zones"]
[null,null,"Livraison de l'aliment thérapeutique (du groupe-zones au siège de la zone)","km",{"$f":"+F26*$F$9+J26*$J$9+K26*$K$9+$L$9*L26+M26*$M$9+$N$9*N26+O26*$O$9+$P$9*P26+Q26*$Q$9+$R$9*R26","v":12},{"$f":"+'R11 Logistique approvisionnemen'!F30","v":12},null,null,null,{"$f":"+'R11 Logistique approvisionnemen'!J30","v":0},{"$f":"+'R11 Logistique approvisionnemen'!K30","v":0},{"$f":"+'R11 Logistique approvisionnemen'!L30","v":0},{"$f":"+'R11 Logistique approvisionnemen'!M30","v":0},{"$f":"+'R11 Logistique approvisionnemen'!N30","v":0},{"$f":"+'R11 Logistique approvisionnemen'!O30","v":0},{"$f":"+'R11 Logistique approvisionnemen'!P30","v":0},{"$f":"+'R11 Logistique approvisionnemen'!Q30","v":0},{"$f":"+'R11 Logistique approvisionnemen'!R30","v":0}]
[null,null,"Formation (personnel siège de la zone au siège du groupe-zones)","km-pers.",{"$f":"+F27*$F$9+J27*$J$9+K27*$K$9+$L$9*L27+M27*$M$9+$N$9*N27+O27*$O$9+$P$9*P27+Q27*$Q$9+$R$9*R27","v":4},{"$f":"+'R12 Formation'!F81","v":4},null,null,null,{"$f":"+'R12 Formation'!J81","v":0},{"$f":"+'R12 Formation'!K81","v":0},{"$f":"+'R12 Formation'!L81","v":0},{"$f":"+'R12 Formation'!M81","v":0},{"$f":"+'R12 Formation'!N81","v":0},{"$f":"+'R12 Formation'!O81","v":0},{"$f":"+'R12 Formation'!P81","v":0},{"$f":"+'R12 Formation'!Q81","v":0},{"$f":"+'R12 Formation'!R81","v":0}]
[null,null,"Supervision (personnel du siège du groupe-zones au siège de zone)","km-pers.",{"$f":"+F28*$F$9+J28*$J$9+K28*$K$9+$L$9*L28+M28*$M$9+$N$9*N28+O28*$O$9+$P$9*P28+Q28*$Q$9+$R$9*R28","v":8},{"$f":"+'R13 Supervision'!F48","v":8},null,null,null,{"$f":"+'R13 Supervision'!J48","v":0},{"$f":"+'R13 Supervision'!K48","v":0},{"$f":"+'R13 Supervision'!L48","v":0},{"$f":"+'R13 Supervision'!M48","v":0},{"$f":"+'R13 Supervision'!N48","v":0},{"$f":"+'R13 Supervision'!O48","v":0},{"$f":"+'R13 Supervision'!P48","v":0},{"$f":"+'R13 Supervision'!Q48","v":0},{"$f":"+'R13 Supervision'!R48","v":0}]
[]
[null,"Entre le siège du groupe-zones et le siège national"]
[null,null,"Livraison de l'aliment thérapeutique (du siège national au siège du groupe-zones)","km",{"$f":"+'R6 Niveau group-zones et centre'!Q34","v":0}]
[null,null,"Formation (personnel du siège du groupe-zones au siège national)","km-pers.",{"$f":"+'R6 Niveau group-zones et centre'!Q26","v":0}]
[null,null,"Gestion (Personnel nationau au siège du groupe-zones)","km-pers.",{"$f":"+'R6 Niveau group-zones et centre'!Q48","v":0}]

{"sheet":"R3 Fournitures","index":17,"n_rows":82,"n_cols":19,"rows_kept":82,"cut":false,"hidden":false,"merged":[[58,4,61,4],[12,5,13,5],[5,2,5,9],[44,1,44,2]]}
[]
["Retour au sommaire",null,"R3: Besoins annuels en fournitures pour la PCMA"]
[]
[]
[null,null,"Number of Areas included ",{"$f":"+'D1 Données générales'!G31","v":1},"  (taken from Worksheet 2)"]
[null,null,"Cette Feuille de calcul montre (pour l'année choisie) les quantités de fournitures nécessaires pour mettre en oeuvre la PCMA."]
[]
[null,null,null,null,null,null,{"$f":"+IF('D1 Données générales'!$G$31<1,0,1)","v":1},null,null,null,{"$f":"+IF('D1 Données générales'!$G$31<2,0,1)","v":0},{"$f":"+IF('D1 Données générales'!$G$31<3,0,1)","v":0},{"$f":"+IF('D1 Données générales'!$G$31<4,0,1)","v":0},{"$f":"+IF('D1 Données générales'!$G$31<5,0,1)","v":0},{"$f":"+IF('D1 Données générales'!$G$31<6,0,1)","v":0},{"$f":"+IF('D1 Données générales'!$G$31<7,0,1)","v":0},{"$f":"+IF('D1 Données générales'!$G$31<8,0,1)","v":0},{"$f":"+IF('D1 Données générales'!$G$31<9,0,1)","v":0},{"$f":"+IF('D1 Données générales'!$G$31<10,0,1)","v":0}]
[]
[null,null,{"$f":"+IF('D1 Données générales'!$H$11=\"\",\"\",'D1 Données générales'!$H$11)","v":"Ghana"}]
[null,null,{"$f":"+'D9 Variables temps'!$I$6","v":2011}]
[null,null,null,null,null,"Toutes zones","Zone 1",null,null,null,"Zone 2","Zone 3","Zone 4","Zone 5","Zone 6","Zone 7","Zone 8","Zone 9","Zone 10"]
[null,null,null,null,{"$f":"'D2 Echelle'!$C$30","v":"district"},"TOTAL toutes zones",{"$f":"+IF('D2 Echelle'!$C$31=\"\",\"\",'D2 Echelle'!$C$31)","v":"Ashiedu Keteke"},null,null,null,{"$f":"+IF('D2 Echelle'!$C$36=\"\",\"\",'D2 Echelle'!$C$36)","v":""},{"$f":"+IF('D2 Echelle'!$C$41=\"\",\"\",'D2 Echelle'!$C$41)","v":""},{"$f":"+IF('D2 Echelle'!$C$46=\"\",\"\",'D2 Echelle'!$C$46)","v":""},{"$f":"+IF('D2 Echelle'!$C$51=\"\",\"\",'D2 Echelle'!$C$51)","v":""},{"$f":"+IF('D2 Echelle'!$C$56=\"\",\"\",'D2 Echelle'!$C$56)","v":""},{"$f":"+IF('D2 Echelle'!$C$61=\"\",\"\",'D2 Echelle'!$C$61)","v":""},{"$f":"+IF('D2 Echelle'!$C$66=\"\",\"\",'D2 Echelle'!$C$66)","v":""},{"$f":"+IF('D2 Echelle'!$C$71=\"\",\"\",'D2 Echelle'!$C$71)","v":""},{"$f":"+IF('D2 Echelle'!$C$76=\"\",\"\",'D2 Echelle'!$C$76)","v":""}]
[null,null,null,null,{"$f":"+'D2 Echelle'!$D$30","v":"région"},null,{"$f":"+IF('D2 Echelle'!$D$31=\"\",\"\",'D2 Echelle'!$D$31)","v":"Greater Accra"},null,null,null,{"$f":"+IF('D2 Echelle'!$D$36=\"\",\"\",'D2 Echelle'!$D$36)","v":""},{"$f":"+IF('D2 Echelle'!$D$41=\"\",\"\",'D2 Echelle'!$D$41)","v":""},{"$f":"+IF('D2 Echelle'!$D$46=\"\",\"\",'D2 Echelle'!$D$46)","v":""},{"$f":"+IF('D2 Echelle'!$D$51=\"\",\"\",'D2 Echelle'!$D$51)","v":""},{"$f":"+IF('D2 Echelle'!$D$56=\"\",\"\",'D2 Echelle'!$D$56)","v":""},{"$f":"+IF('D2 Echelle'!$D$61=\"\",\"\",'D2 Echelle'!$D$61)","v":""},{"$f":"+IF('D2 Echelle'!$D$66=\"\",\"\",'D2 Echelle'!$D$66)","v":""},{"$f":"+IF('D2 Echelle'!$D$71=\"\",\"\",'D2 Echelle'!$D$71)","v":""},{"$f":"+IF('D2 Echelle'!$D$76=\"\",\"\",'D2 Echelle'!$D$76)","v":""}]
[null,"Fournitures",null,"Activité","Unités"]
[null,"Aliment thérapeutique",null,"Traitement"]
[null,null,"ATPE (sites PEC MAS ambulatoire et PEC MAS hospitalière)",null,"kg",{"$f":"+SUM(K17:S17)+G17","v":1993.5712500000002},{"$f":"+'R10 Traitement (fournitures)'!G26","v":1993.5712500000002},null,null,null,{"$f":"+'R10 Traitement (fournitures)'!I26","v":0},{"$f":"+'R10 Traitement (fournitures)'!K26","v":0},{"$f":"+'R10 Traitement (fournitures)'!M26","v":0},{"$f":"+'R10 Traitement (fournitures)'!O26","v":0},{"$f":"+'R10 Traitement (fournitures)'!Q26","v":0},{"$f":"+'R10 Traitement (fournitures)'!S26","v":0},{"$f":"+'R10 Traitement (fournitures)'!U26","v":0},{"$f":"+'R10 Traitement (fournitures)'!W26","v":0},{"$f":"+'R10 Traitement (fournitures)'!Y26","v":0}]
[null,null,"F-75 (Sites PEC MAS hospitalière)",null,"kg",{"$f":"+SUM(K18:S18)+G18","v":77.55},{"$f":"+'R10 Traitement (fournitures)'!G27","v":77.55},null,null,null,{"$f":"+'R10 Traitement (fournitures)'!I27","v":0},{"$f":"+'R10 Traitement (fournitures)'!K27","v":0},{"$f":"+'R10 Traitement (fournitures)'!M27","v":0},{"$f":"+'R10 Traitement (fournitures)'!O27","v":0},{"$f":"+'R10 Traitement (fournitures)'!Q27","v":0},{"$f":"+'R10 Traitement (fournitures)'!S27","v":0},{"$f":"+'R10 Traitement (fournitures)'!U27","v":0},{"$f":"+'R10 Traitement (fournitures)'!W27","v":0},{"$f":"+'R10 Traitement (fournitures)'!Y27","v":0}]
[]
[]
[null,null,"F-100 (sites PEC MAS ambulatoire)",null,"kg",{"$f":"+SUM(K21:S21)+G21","v":23.265000000000001},{"$f":"+'R10 Traitement (fournitures)'!G28","v":23.265000000000001},null,null,null,{"$f":"+'R10 Traitement (fournitures)'!I28","v":0},{"$f":"+'R10 Traitement (fournitures)'!K28","v":0},{"$f":"+'R10 Traitement (fournitures)'!M28","v":0},{"$f":"+'R10 Traitement (fournitures)'!O28","v":0},{"$f":"+'R10 Traitement (fournitures)'!Q28","v":0},{"$f":"+'R10 Traitement (fournitures)'!S28","v":0},{"$f":"+'R10 Traitement (fournitures)'!U28","v":0},{"$f":"+'R10 Traitement (fournitures)'!W28","v":0},{"$f":"+'R10 Traitement (fournitures)'!Y28","v":0}]
[]
[]
[]
[null,"Médicaments ",null,"Traitement"]
[null,null,"Vitamine A",null,"Gélules 100 000 UI",{"$f":"+SUM(K26:S26)+G26","v":250.5},{"$f":"+'R9 Traitement (médicaments)'!I29","v":250.5},null,null,null,{"$f":"+'R9 Traitement (médicaments)'!N29","v":0},{"$f":"+'R9 Traitement (médicaments)'!P29","v":0},{"$f":"+'R9 Traitement (médicaments)'!R29","v":0},{"$f":"+'R9 Traitement (médicaments)'!T29","v":0},{"$f":"+'R9 Traitement (médicaments)'!V29","v":0},{"$f":"+'R9 Traitement (médicaments)'!X29","v":0},{"$f":"+'R9 Traitement (médicaments)'!Z29","v":0},{"$f":"+'R9 Traitement (médicaments)'!AB29","v":0},{"$f":"+'R9 Traitement (médicaments)'!AD29","v":0}]
[null,null,"Eau sucrée",null,"litres",108,{"$f":"+'R9 Traitement (médicaments)'!I30","v":108},null,null,null,{"$f":"+'R9 Traitement (médicaments)'!N30","v":0},{"$f":"+'R9 Traitement (médicaments)'!P30","v":0},{"$f":"+'R9 Traitement (médicaments)'!R30","v":0},{"$f":"+'R9 Traitement (médicaments)'!T30","v":0},{"$f":"+'R9 Traitement (médicaments)'!V30","v":0},{"$f":"+'R9 Traitement (médicaments)'!X30","v":0},{"$f":"+'R9 Traitement (médicaments)'!Z30","v":0},{"$f":"+'R9 Traitement (médicaments)'!AB30","v":0},{"$f":"+'R9 Traitement (médicaments)'!AD30","v":0}]
[null,null,"Amoxicilline",null,"g",450,{"$f":"+'R9 Traitement (médicaments)'!I28","v":450},null,null,null,{"$f":"+'R9 Traitement (médicaments)'!N28","v":0},{"$f":"+'R9 Traitement (médicaments)'!P28","v":0},{"$f":"+'R9 Traitement (médicaments)'!R28","v":0},{"$f":"+'R9 Traitement (médicaments)'!T28","v":0},{"$f":"+'R9 Traitement (médicaments)'!V28","v":0},{"$f":"+'R9 Traitement (médicaments)'!X28","v":0},{"$f":"+'R9 Traitement (médicaments)'!Z28","v":0},{"$f":"+'R9 Traitement (médicaments)'!AB28","v":0},{"$f":"+'R9 Traitement (médicaments)'!AD28","v":0}]
[null,null,"Antipaludiques",null,"protocole entier",150,{"$f":"+'R9 Traitement (médicaments)'!I32","v":150},null,null,null,{"$f":"+'R9 Traitement (médicaments)'!N32","v":0},{"$f":"+'R9 Traitement (médicaments)'!P32","v":0},{"$f":"+'R9 Traitement (médicaments)'!R32","v":0},{"$f":"+'R9 Traitement (médicaments)'!T32","v":0},{"$f":"+'R9 Traitement (médicaments)'!V32","v":0},{"$f":"+'R9 Traitement (médicaments)'!X32","v":0},{"$f":"+'R9 Traitement (médicaments)'!Z32","v":0},{"$f":"+'R9 Traitement (médicaments)'!AB32","v":0},{"$f":"+'R9 Traitement (médicaments)'!AD32","v":0}]
[null,null,"Tests diagnostiques du paludisme",null,"tests",0,{"$f":"+'R9 Traitement (médicaments)'!I33","v":0},null,null,null,{"$f":"+'R9 Traitement (médicaments)'!N33","v":0},{"$f":"+'R9 Traitement (médicaments)'!P33","v":0},{"$f":"+'R9 Traitement (médicaments)'!R33","v":0},{"$f":"+'R9 Traitement (médicaments)'!T33","v":0},{"$f":"+'R9 Traitement (médicaments)'!V33","v":0},{"$f":"+'R9 Traitement (médicaments)'!X33","v":0},{"$f":"+'R9 Traitement (médicaments)'!Z33","v":0},{"$f":"+'R9 Traitement (médicaments)'!AB33","v":0},{"$f":"+'R9 Traitement (médicaments)'!AD33","v":0}]
[null,null,"Albendazole",null,"100 mg",387,{"$f":"+'R9 Traitement (médicaments)'!I37","v":387},null,null,null,{"$f":"+'R9 Traitement (médicaments)'!N37","v":0},{"$f":"+'R9 Traitement (médicaments)'!P37","v":0},{"$f":"+'R9 Traitement (médicaments)'!R37","v":0},{"$f":"+'R9 Traitement (médicaments)'!T37","v":0},{"$f":"+'R9 Traitement (médicaments)'!V37","v":0},{"$f":"+'R9 Traitement (médicaments)'!X37","v":0},{"$f":"+'R9 Traitement (médicaments)'!Z37","v":0},{"$f":"+'R9 Traitement (médicaments)'!AB37","v":0},{"$f":"+'R9 Traitement (médicaments)'!AD37","v":0}]
[null,null,"Vaccins contre la rougeole",null,"doses",155.25,{"$f":"+'R9 Traitement (médicaments)'!I38","v":155.25},null,null,null,{"$f":"+'R9 Traitement (médicaments)'!N38","v":0},{"$f":"+'R9 Traitement (médicaments)'!P38","v":0},{"$f":"+'R9 Traitement (médicaments)'!R38","v":0},{"$f":"+'R9 Traitement (médicaments)'!T38","v":0},{"$f":"+'R9 Traitement (médicaments)'!V38","v":0},{"$f":"+'R9 Traitement (médicaments)'!X38","v":0},{"$f":"+'R9 Traitement (médicaments)'!Z38","v":0},{"$f":"+'R9 Traitement (médicaments)'!AB38","v":0},{"$f":"+'R9 Traitement (médicaments)'!AD38","v":0}]
[null,null,"Seringue autodestructibles contre la rougeole",null,"seringues",155.25,{"$f":"+'R9 Traitement (médicaments)'!I39","v":155.25},null,null,null,{"$f":"+'R9 Traitement (médicaments)'!N39","v":0},{"$f":"+'R9 Traitement (médicaments)'!P39","v":0},{"$f":"+'R9 Traitement (médicaments)'!R39","v":0},{"$f":"+'R9 Traitement (médicaments)'!T39","v":0},{"$f":"+'R9 Traitement (médicaments)'!V39","v":0},{"$f":"+'R9 Traitement (médicaments)'!X39","v":0},{"$f":"+'R9 Traitement (médicaments)'!Z39","v":0},{"$f":"+'R9 Traitement (médicaments)'!AB39","v":0},{"$f":"+'R9 Traitement (médicaments)'!AD39","v":0}]
[null,null,"Seringues mélange rougeole",null,"seringues",15.525000000000002,{"$f":"+'R9 Traitement (médicaments)'!I40","v":15.525000000000002},null,null,null,{"$f":"+'R9 Traitement (médicaments)'!N40","v":0},{"$f":"+'R9 Traitement (médicaments)'!P40","v":0},{"$f":"+'R9 Traitement (médicaments)'!R40","v":0},{"$f":"+'R9 Traitement (médicaments)'!T40","v":0},{"$f":"+'R9 Traitement (médicaments)'!V40","v":0},{"$f":"+'R9 Traitement (médicaments)'!X40","v":0},{"$f":"+'R9 Traitement (médicaments)'!Z40","v":0},{"$f":"+'R9 Traitement (médicaments)'!AB40","v":0},{"$f":"+'R9 Traitement (médicaments)'!AD40","v":0}]
[]
[null,"Equipement",null,"Traitement"]
[null,null,"Ensemble équipement PEC MAS ambulatoire",null,"nouveaux ensembles",{"$f":"+SUM(K37:S37)+G37","v":0},{"$f":"+'R10 Traitement (fournitures)'!G29","v":0},null,null,null,{"$f":"+'R10 Traitement (fournitures)'!I29","v":0},{"$f":"+'R10 Traitement (fournitures)'!K29","v":0},{"$f":"+'R10 Traitement (fournitures)'!M29","v":0},{"$f":"+'R10 Traitement (fournitures)'!O29","v":0},{"$f":"+'R10 Traitement (fournitures)'!Q29","v":0},{"$f":"+'R10 Traitement (fournitures)'!S29","v":0},{"$f":"+'R10 Traitement (fournitures)'!U29","v":0},{"$f":"+'R10 Traitement (fournitures)'!W29","v":0},{"$f":"+'R10 Traitement (fournitures)'!Y29","v":0}]
[null,null,"Ensembles équipement PEC MAS ambulatoire",null,"remplacement",2,{"$f":"+'R10 Traitement (fournitures)'!G30","v":2},null,null,null,{"$f":"+'R10 Traitement (fournitures)'!I30","v":0},{"$f":"+'R10 Traitement (fournitures)'!K30","v":0},{"$f":"+'R10 Traitement (fournitures)'!M30","v":0},{"$f":"+'R10 Traitement (fournitures)'!O30","v":0},{"$f":"+'R10 Traitement (fournitures)'!Q30","v":0},{"$f":"+'R10 Traitement (fournitures)'!S30","v":0},{"$f":"+'R10 Traitement (fournitures)'!U30","v":0},{"$f":"+'R10 Traitement (fournitures)'!W30","v":0},{"$f":"+'R10 Traitement (fournitures)'!Y30","v":0}]
[null,null,"Ensemble équipement PEC MAS hospitalière",null,"nouveaux ensembles",0,{"$f":"+'R10 Traitement (fournitures)'!G40","v":0},null,null,null,{"$f":"+'R10 Traitement (fournitures)'!I40","v":0},{"$f":"+'R10 Traitement (fournitures)'!K40","v":0},{"$f":"+'R10 Traitement (fournitures)'!M40","v":0},{"$f":"+'R10 Traitement (fournitures)'!O40","v":0},{"$f":"+'R10 Traitement (fournitures)'!Q40","v":0},{"$f":"+'R10 Traitement (fournitures)'!S40","v":0},{"$f":"+'R10 Traitement (fournitures)'!U40","v":0},{"$f":"+'R10 Traitement (fournitures)'!W40","v":0},{"$f":"+'R10 Traitement (fournitures)'!Y40","v":0}]
[null,null,"Ensembles équipement PEC MAS hospitalière",null,"remplacement",1,{"$f":"+'R10 Traitement (fournitures)'!G41","v":1},null,null,null,{"$f":"+'R10 Traitement (fournitures)'!I41","v":0},{"$f":"+'R10 Traitement (fournitures)'!K41","v":0},{"$f":"+'R10 Traitement (fournitures)'!M41","v":0},{"$f":"+'R10 Traitement (fournitures)'!O41","v":0},{"$f":"+'R10 Traitement (fournitures)'!Q41","v":0},{"$f":"+'R10 Traitement (fournitures)'!S41","v":0},{"$f":"+'R10 Traitement (fournitures)'!U41","v":0},{"$f":"+'R10 Traitement (fournitures)'!W41","v":0},{"$f":"+'R10 Traitement (fournitures)'!Y41","v":0}]
[null,null,"Lits adultes (sites PEC MAS hospitalière)",null,"lits",2,{"$f":"+'R10 Traitement (fournitures)'!G84","v":2},null,null,null,{"$f":"+'R10 Traitement (fournitures)'!I84","v":0},{"$f":"+'R10 Traitement (fournitures)'!K84","v":0},{"$f":"+'R10 Traitement (fournitures)'!M84","v":0},{"$f":"+'R10 Traitement (fournitures)'!O84","v":0},{"$f":"+'R10 Traitement (fournitures)'!Q84","v":0},{"$f":"+'R10 Traitement (fournitures)'!S84","v":0},{"$f":"+'R10 Traitement (fournitures)'!U84","v":0},{"$f":"+'R10 Traitement (fournitures)'!W84","v":0},{"$f":"+'R10 Traitement (fournitures)'!Y84","v":0}]
[null,null,"Lits (sites PEC MAS hospitalière)",null,"jours-lit",2,{"$f":"+'R10 Traitement (fournitures)'!G84","v":2},null,null,null,{"$f":"+'R10 Traitement (fournitures)'!I84","v":0},{"$f":"+'R10 Traitement (fournitures)'!K84","v":0},{"$f":"+'R10 Traitement (fournitures)'!M84","v":0},{"$f":"+'R10 Traitement (fournitures)'!O84","v":0},{"$f":"+'R10 Traitement (fournitures)'!Q84","v":0},{"$f":"+'R10 Traitement (fournitures)'!S84","v":0},{"$f":"+'R10 Traitement (fournitures)'!U84","v":0},{"$f":"+'R10 Traitement (fournitures)'!W84","v":0},{"$f":"+'R10 Traitement (fournitures)'!Y84","v":0}]
[null,null,"Nourriture pour l'accompagnant (sites PEC MAS hospitalière)",null,"repas-jours",652.49999999999989,{"$f":"+'R10 Traitement (fournitures)'!G79","v":652.49999999999989},null,null,null,{"$f":"+'R10 Traitement (fournitures)'!I79","v":0},{"$f":"+'R10 Traitement (fournitures)'!K79","v":0},{"$f":"+'R10 Traitement (fournitures)'!M79","v":0},{"$f":"+'R10 Traitement (fournitures)'!O79","v":0},{"$f":"+'R10 Traitement (fournitures)'!Q79","v":0},{"$f":"+'R10 Traitement (fournitures)'!S79","v":0},{"$f":"+'R10 Traitement (fournitures)'!U79","v":0},{"$f":"+'R10 Traitement (fournitures)'!W79","v":0},{"$f":"+'R10 Traitement (fournitures)'!Y79","v":0}]
[null,null,"Jours-lit /site PEC MAS hospitalière",null,"jours-lit",652.49999999999989,{"$f":"+'R10 Traitement (fournitures)'!G42","v":652.49999999999989},null,null,null,{"$f":"+'R10 Traitement (fournitures)'!I42","v":0},{"$f":"+'R10 Traitement (fournitures)'!K42","v":0},{"$f":"+'R10 Traitement (fournitures)'!M42","v":0},{"$f":"+'R10 Traitement (fournitures)'!O42","v":0},{"$f":"+'R10 Traitement (fournitures)'!Q42","v":0},{"$f":"+'R10 Traitement (fournitures)'!S42","v":0},{"$f":"+'R10 Traitement (fournitures)'!U3046","v":0},{"$f":"+'R10 Traitement (fournitures)'!W42","v":0},{"$f":"+'R10 Traitement (fournitures)'!Y42","v":0}]
[null,"Autres fournitures se rapportant au traitement",null,"Traitement"]
[null,null,"Bracelets PB",null,"bracelets",{"$f":"+SUM(K46:S46)+G46","v":150},{"$f":"+'R10 Traitement (fournitures)'!G33","v":150},null,null,null,{"$f":"+'R10 Traitement (fournitures)'!I33","v":0},{"$f":"+'R10 Traitement (fournitures)'!K33","v":0},{"$f":"+'R10 Traitement (fournitures)'!M33","v":0},{"$f":"+'R10 Traitement (fournitures)'!O33","v":0},{"$f":"+'R10 Traitement (fournitures)'!Q33","v":0},{"$f":"+'R10 Traitement (fournitures)'!S33","v":0},{"$f":"+'R10 Traitement (fournitures)'!U33","v":0},{"$f":"+'R10 Traitement (fournitures)'!W33","v":0},{"$f":"+'R10 Traitement (fournitures)'!Y33","v":0}]
[null,null,"Essuie-mains",null,"rouleaux",{"$f":"+SUM(K47:S47)+G47","v":208},{"$f":"+'R10 Traitement (fournitures)'!G34","v":208},null,null,null,{"$f":"+'R10 Traitement (fournitures)'!I34","v":0},{"$f":"+'R10 Traitement (fournitures)'!K34","v":0},{"$f":"+'R10 Traitement (fournitures)'!M34","v":0},{"$f":"+'R10 Traitement (fournitures)'!O34","v":0},{"$f":"+'R10 Traitement (fournitures)'!Q34","v":0},{"$f":"+'R10 Traitement (fournitures)'!S34","v":0},{"$f":"+'R10 Traitement (fournitures)'!U34","v":0},{"$f":"+'R10 Traitement (fournitures)'!W34","v":0},{"$f":"+'R10 Traitement (fournitures)'!Y34","v":0}]
[null,null,"Savon",null,"pièce",{"$f":"+SUM(K48:S48)+G48","v":104},{"$f":"+'R10 Traitement (fournitures)'!G35","v":104},null,null,null,{"$f":"+'R10 Traitement (fournitures)'!I35","v":0},{"$f":"+'R10 Traitement (fournitures)'!K35","v":0},{"$f":"+'R10 Traitement (fournitures)'!M35","v":0},{"$f":"+'R10 Traitement (fournitures)'!O35","v":0},{"$f":"+'R10 Traitement (fournitures)'!Q35","v":0},{"$f":"+'R10 Traitement (fournitures)'!S35","v":0},{"$f":"+'R10 Traitement (fournitures)'!U35","v":0},{"$f":"+'R10 Traitement (fournitures)'!W35","v":0},{"$f":"+'R10 Traitement (fournitures)'!Y35","v":0}]
[null,null,"Eau de boisson",null,"litre",{"$f":"+SUM(K49:S49)+G49","v":104},{"$f":"+'R10 Traitement (fournitures)'!G36","v":104},null,null,null,{"$f":"+'R10 Traitement (fournitures)'!I36","v":0},{"$f":"+'R10 Traitement (fournitures)'!K36","v":0},{"$f":"+'R10 Traitement (fournitures)'!M36","v":0},{"$f":"+'R10 Traitement (fournitures)'!O36","v":0},{"$f":"+'R10 Traitement (fournitures)'!Q36","v":0},{"$f":"+'R10 Traitement (fournitures)'!S36","v":0},{"$f":"+'R10 Traitement (fournitures)'!U36","v":0},{"$f":"+'R10 Traitement (fournitures)'!W36","v":0},{"$f":"+'R10 Traitement (fournitures)'!Y36","v":0}]
[]
[null,"Indemnités et rafraîchissements"]
[null,"Indemnités journalières ",null,"Formation"]
[null,null,"AEC",null,"indemnités journalières",{"$f":"+SUM(K53:S53)+G53","v":200},{"$f":"+'R12 Formation'!F83","v":200},null,null,null,{"$f":"+'R12 Formation'!J83","v":0},{"$f":"+'R12 Formation'!K83","v":0},{"$f":"+'R12 Formation'!L83","v":0},{"$f":"+'R12 Formation'!M83","v":0},{"$f":"+'R12 Formation'!N83","v":0},{"$f":"+'R12 Formation'!O83","v":0},{"$f":"+'R12 Formation'!P83","v":0},{"$f":"+'R12 Formation'!Q83","v":0},{"$f":"+'R12 Formation'!R83","v":0}]
[null,null,"Personnel PEC MAS ambulatoire",null,null,{"$f":"+SUM(K54:S54)+G54","v":12},{"$f":"+'R12 Formation'!F84","v":12},null,null,null,{"$f":"+'R12 Formation'!J84","v":0},{"$f":"+'R12 Formation'!K84","v":0},{"$f":"+'R12 Formation'!L84","v":0},{"$f":"+'R12 Formation'!M84","v":0},{"$f":"+'R12 Formation'!N84","v":0},{"$f":"+'R12 Formation'!O84","v":0},{"$f":"+'R12 Formation'!P84","v":0},{"$f":"+'R12 Formation'!Q84","v":0},{"$f":"+'R12 Formation'!R84","v":0}]
[null,null,"Personnel PEC MAS hospitalière",null,null,{"$f":"+SUM(K55:S55)+G55","v":12},{"$f":"+'R12 Formation'!F85","v":12},null,null,null,{"$f":"+'R12 Formation'!J85","v":0},{"$f":"+'R12 Formation'!K85","v":0},{"$f":"+'R12 Formation'!L85","v":0},{"$f":"+'R12 Formation'!M85","v":0},{"$f":"+'R12 Formation'!N85","v":0},{"$f":"+'R12 Formation'!O85","v":0},{"$f":"+'R12 Formation'!P85","v":0},{"$f":"+'R12 Formation'!Q85","v":0},{"$f":"+'R12 Formation'!R85","v":0}]
[null,null,"Personnel siège de la zone",null,null,{"$f":"+SUM(K56:S56)+G56","v":2},{"$f":"+'R12 Formation'!F86","v":2},null,null,null,{"$f":"+'R12 Formation'!J86","v":0},{"$f":"+'R12 Formation'!K86","v":0},{"$f":"+'R12 Formation'!L86","v":0},{"$f":"+'R12 Formation'!M86","v":0},{"$f":"+'R12 Formation'!N86","v":0},{"$f":"+'R12 Formation'!O86","v":0},{"$f":"+'R12 Formation'!P86","v":0},{"$f":"+'R12 Formation'!Q86","v":0},{"$f":"+'R12 Formation'!R86","v":0}]
[null,null,"Personnel du groupe-zones",null,null,{"$f":"+'R6 Niveau group-zones et centre'!Q31","v":0}]
[null,"Rafraîchissements",null,"Formation"]
[null,null,"AEC",null,"jours-pers. de raffraîchissements",{"$f":"+SUM(K59:S59)+G59","v":200},{"$f":"+'R12 Formation'!F88","v":200},null,null,null,{"$f":"+'R12 Formation'!J88","v":0},{"$f":"+'R12 Formation'!K88","v":0},{"$f":"+'R12 Formation'!L88","v":0},{"$f":"+'R12 Formation'!M88","v":0},{"$f":"+'R12 Formation'!N88","v":0},{"$f":"+'R12 Formation'!O88","v":0},{"$f":"+'R12 Formation'!P88","v":0},{"$f":"+'R12 Formation'!Q88","v":0},{"$f":"+'R12 Formation'!R88","v":0}]
[null,null,"Personnel PEC MAS ambulatoire",null,null,{"$f":"+SUM(K60:S60)+G60","v":12},{"$f":"+'R12 Formation'!F89","v":12},null,null,null,{"$f":"+'R12 Formation'!J89","v":0},{"$f":"+'R12 Formation'!K89","v":0},{"$f":"+'R12 Formation'!L89","v":0},{"$f":"+'R12 Formation'!M89","v":0},{"$f":"+'R12 Formation'!N89","v":0},{"$f":"+'R12 Formation'!O89","v":0},{"$f":"+'R12 Formation'!P89","v":0},{"$f":"+'R12 Formation'!Q89","v":0},{"$f":"+'R12 Formation'!R89","v":0}]
[null,null,"Personnel PEC MAS hospitalière",null,null,{"$f":"+SUM(K61:S61)+G61","v":12},{"$f":"+'R12 Formation'!F90","v":12},null,null,null,{"$f":"+'R12 Formation'!J90","v":0},{"$f":"+'R12 Formation'!K90","v":0},{"$f":"+'R12 Formation'!L90","v":0},{"$f":"+'R12 Formation'!M90","v":0},{"$f":"+'R12 Formation'!N90","v":0},{"$f":"+'R12 Formation'!O90","v":0},{"$f":"+'R12 Formation'!P90","v":0},{"$f":"+'R12 Formation'!Q90","v":0},{"$f":"+'R12 Formation'!R90","v":0}]
[null,null,"Personnel siège de la zone",null,null,{"$f":"+SUM(K62:S62)+G62","v":2},{"$f":"+'R12 Formation'!F91","v":2},null,null,null,{"$f":"+'R12 Formation'!J91","v":0},{"$f":"+'R12 Formation'!K91","v":0},{"$f":"+'R12 Formation'!L91","v":0},{"$f":"+'R12 Formation'!M91","v":0},{"$f":"+'R12 Formation'!N91","v":0},{"$f":"+'R12 Formation'!O91","v":0},{"$f":"+'R12 Formation'!P91","v":0},{"$f":"+'R12 Formation'!Q91","v":0},{"$f":"+'R12 Formation'!R91","v":0}]
[null,null,"Personnel du groupe-zones",null,null,{"$f":"+'R6 Niveau group-zones et centre'!Q30","v":0}]
[]
[null,"Matériel écrit (certains déjà compris dans les jeux d'équipement PEC MAS ambulatoire/hospitalière)"]
[null,"Listes de pointage pour la supervision",null,"Supervision"]
[null,null,"Supervision des AEC",null,"listes de pointage",{"$f":"+SUM(K67:S67)+G67","v":1200},{"$f":"+'R13 Supervision'!F45","v":1200},null,null,null,{"$f":"+'R13 Supervision'!J45","v":0},{"$f":"+'R13 Supervision'!K45","v":0},{"$f":"+'R13 Supervision'!L45","v":0},{"$f":"+'R13 Supervision'!M45","v":0},{"$f":"+'R13 Supervision'!N45","v":0},{"$f":"+'R13 Supervision'!O45","v":0},{"$f":"+'R13 Supervision'!P45","v":0},{"$f":"+'R13 Supervision'!Q45","v":0},{"$f":"+'R13 Supervision'!R45","v":0}]
[null,null,"Supervision des sites PEC MAS ambulatoire et hospitalière",null,"listes de pointage",{"$f":"+SUM(K68:S68)+G68","v":36},{"$f":"+'R13 Supervision'!F39","v":36},null,null,null,{"$f":"+'R13 Supervision'!J39","v":0},{"$f":"+'R13 Supervision'!K39","v":0},{"$f":"+'R13 Supervision'!L39","v":0},{"$f":"+'R13 Supervision'!M39","v":0},{"$f":"+'R13 Supervision'!N39","v":0},{"$f":"+'R13 Supervision'!O39","v":0},{"$f":"+'R13 Supervision'!P39","v":0},{"$f":"+'R13 Supervision'!Q39","v":0},{"$f":"+'R13 Supervision'!R39","v":0}]
[null,null,"Supervision du siège de la zone",null,"listes de pointage",{"$f":"+SUM(K69:S69)+G69","v":4},{"$f":"+'R13 Supervision'!F50","v":4},null,null,null,{"$f":"+'R13 Supervision'!J50","v":0},{"$f":"+'R13 Supervision'!K50","v":0},{"$f":"+'R13 Supervision'!L50","v":0},{"$f":"+'R13 Supervision'!M50","v":0},{"$f":"+'R13 Supervision'!N50","v":0},{"$f":"+'R13 Supervision'!O50","v":0},{"$f":"+'R13 Supervision'!P50","v":0},{"$f":"+'R13 Supervision'!Q50","v":0},{"$f":"+'R13 Supervision'!R50","v":0}]
[null,"Fiches de stock",null,"Logistique de l'approvisionnement"]
[null,null,"Dans les dépôts des zones, des sites PEC MAS ambulatoire et hospitalière",null,null,{"$f":"+SUM(G71:S71)","v":48},{"$f":"+'R11 Logistique approvisionnemen'!F42+'R11 Logistique approvisionnemen'!F43+'R11 Logistique approvisionnemen'!F44","v":48},null,null,null,{"$f":"+'R11 Logistique approvisionnemen'!J42+'R11 Logistique approvisionnemen'!J43+'R11 Logistique approvisionnemen'!J44","v":0},{"$f":"+'R11 Logistique approvisionnemen'!K42+'R11 Logistique approvisionnemen'!K43+'R11 Logistique approvisionnemen'!K44","v":0},{"$f":"+'R11 Logistique approvisionnemen'!L42+'R11 Logistique approvisionnemen'!L43+'R11 Logistique approvisionnemen'!L44","v":0},{"$f":"+'R11 Logistique approvisionnemen'!M42+'R11 Logistique approvisionnemen'!M43+'R11 Logistique approvisionnemen'!M44","v":0},{"$f":"+'R11 Logistique approvisionnemen'!N42+'R11 Logistique approvisionnemen'!N43+'R11 Logistique approvisionnemen'!N44","v":0},{"$f":"+'R11 Logistique approvisionnemen'!O42+'R11 Logistique approvisionnemen'!O43+'R11 Logistique approvisionnemen'!O44","v":0},{"$f":"+'R11 Logistique approvisionnemen'!P42+'R11 Logistique approvisionnemen'!P43+'R11 Logistique approvisionnemen'!P44","v":0},{"$f":"+'R11 Logistique approvisionnemen'!Q42+'R11 Logistique approvisionnemen'!Q43+'R11 Logistique approvisionnemen'!Q44","v":0},{"$f":"+'R11 Logistique approvisionnemen'!R42+'R11 Logistique approvisionnemen'!R43+'R11 Logistique approvisionnemen'!R44","v":0}]
[null,null,"Dans les groupes-zones et au niveau national",null,null,{"$f":"+'R6 Niveau group-zones et centre'!Q38","v":12}]
[null,"Matériel de formation et aides professionnelles","riel de formation","Formation"]
[null,null,"Formation des AEC",null,"ensemble de matériel",{"$f":"+SUM(K74:S74)+G74","v":100},{"$f":"+'R12 Formation'!F73","v":100},null,null,null,{"$f":"+'R12 Formation'!J73","v":0},{"$f":"+'R12 Formation'!K73","v":0},{"$f":"+'R12 Formation'!L73","v":0},{"$f":"+'R12 Formation'!M73","v":0},{"$f":"+'R12 Formation'!N73","v":0},{"$f":"+'R12 Formation'!O73","v":0},{"$f":"+'R12 Formation'!P73","v":0},{"$f":"+'R12 Formation'!Q73","v":0},{"$f":"+'R12 Formation'!R73","v":0}]
[null,null,"Formation agents PEC MAS ambulatoire",null,"ensemble de matériel",{"$f":"+SUM(K75:S75)+G75","v":6},{"$f":"+'R12 Formation'!F74","v":6},null,null,null,{"$f":"+'R12 Formation'!J74","v":0},{"$f":"+'R12 Formation'!K74","v":0},{"$f":"+'R12 Formation'!L74","v":0},{"$f":"+'R12 Formation'!M74","v":0},{"$f":"+'R12 Formation'!N74","v":0},{"$f":"+'R12 Formation'!O74","v":0},{"$f":"+'R12 Formation'!P74","v":0},{"$f":"+'R12 Formation'!Q74","v":0},{"$f":"+'R12 Formation'!R74","v":0}]
[null,null,"Formation agents PEC MAS hospitalière",null,"ensemble de matériel",{"$f":"+SUM(K76:S76)+G76","v":2},{"$f":"+'R12 Formation'!F75","v":2},null,null,null,{"$f":"+'R12 Formation'!J75","v":0},{"$f":"+'R12 Formation'!K75","v":0},{"$f":"+'R12 Formation'!L75","v":0},{"$f":"+'R12 Formation'!M75","v":0},{"$f":"+'R12 Formation'!N75","v":0},{"$f":"+'R12 Formation'!O75","v":0},{"$f":"+'R12 Formation'!P75","v":0},{"$f":"+'R12 Formation'!Q75","v":0},{"$f":"+'R12 Formation'!R75","v":0}]
[null,null,"Area HQ training",null,"ensemble de matériel",{"$f":"+SUM(K77:S77)+G77","v":2},{"$f":"+'R12 Formation'!F76","v":2},null,null,null,{"$f":"+'R12 Formation'!J76","v":0},{"$f":"+'R12 Formation'!K76","v":0},{"$f":"+'R12 Formation'!L76","v":0},{"$f":"+'R12 Formation'!M76","v":0},{"$f":"+'R12 Formation'!N76","v":0},{"$f":"+'R12 Formation'!O76","v":0},{"$f":"+'R12 Formation'!P76","v":0},{"$f":"+'R12 Formation'!Q76","v":0},{"$f":"+'R12 Formation'!R76","v":0}]
[null,null,"Formation siège de la zone",null,"ensemble de matériel",{"$f":"+'R6 Niveau group-zones et centre'!Q28+'R6 Niveau group-zones et centre'!Q29","v":0}]
[null,"Fiches de compte rendu"]
[null,null,"Fiches de suivi (PEC MAS ambulatoire et PEC MAS hospitalière)",null,"fiches",{"$f":"+SUM(K80:S80)+G80","v":150},{"$f":"+'R10 Traitement (fournitures)'!G31","v":150},null,null,null,{"$f":"+'R10 Traitement (fournitures)'!I31","v":0},{"$f":"+'R10 Traitement (fournitures)'!K31","v":0},{"$f":"+'R10 Traitement (fournitures)'!M31","v":0},{"$f":"+'R10 Traitement (fournitures)'!O31","v":0},{"$f":"+'R10 Traitement (fournitures)'!Q31","v":0},{"$f":"+'R10 Traitement (fournitures)'!S31","v":0},{"$f":"+'R10 Traitement (fournitures)'!U31","v":0},{"$f":"+'R10 Traitement (fournitures)'!W31","v":0},{"$f":"+'R10 Traitement (fournitures)'!Y31","v":0}]
[null,null,"Fiches de ration de l'ATPE ",null,"fiches",{"$f":"+SUM(K81:S81)+G81","v":150},{"$f":"+'R10 Traitement (fournitures)'!G32","v":150},null,null,null,{"$f":"+'R10 Traitement (fournitures)'!I32","v":0},{"$f":"+'R10 Traitement (fournitures)'!K32","v":0},{"$f":"+'R10 Traitement (fournitures)'!M32","v":0},{"$f":"+'R10 Traitement (fournitures)'!O32","v":0},{"$f":"+'R10 Traitement (fournitures)'!Q32","v":0},{"$f":"+'R10 Traitement (fournitures)'!S32","v":0},{"$f":"+'R10 Traitement (fournitures)'!U32","v":0},{"$f":"+'R10 Traitement (fournitures)'!W32","v":0},{"$f":"+'R10 Traitement (fournitures)'!Y32","v":0}]
[null,null,"Fiches du rapport mensuel ",null,"fiches",{"$f":"+'R6 Niveau group-zones et centre'!$Q$45","v":0}]

{"sheet":"R4 Espace","index":18,"n_rows":39,"n_cols":18,"rows_kept":39,"cut":false,"hidden":false,"merged":[[11,4,12,4],[4,2,4,8]]}
[]
["Retour au sommaire",null,"R4: Besoins annuels en espace pour la PCMA"]
[]
[null,null,"Number of Areas included ",{"$f":"+'D1 Données générales'!G31","v":1},"  (taken from Worksheet 2)"]
[null,null,"Cette Feuille de calcul montre (pour l'année choisie) le volume de l'espace nécessaire pour mettre en oeuvre la PCMA."]
[]
[null,null,null,null,null,{"$f":"+IF('D1 Données générales'!$G$31<1,0,1)","v":1},null,null,null,{"$f":"+IF('D1 Données générales'!$G$31<2,0,1)","v":0},{"$f":"+IF('D1 Données générales'!$G$31<3,0,1)","v":0},{"$f":"+IF('D1 Données générales'!$G$31<4,0,1)","v":0},{"$f":"+IF('D1 Données générales'!$G$31<5,0,1)","v":0},{"$f":"+IF('D1 Données générales'!$G$31<6,0,1)","v":0},{"$f":"+IF('D1 Données générales'!$G$31<7,0,1)","v":0},{"$f":"+IF('D1 Données générales'!$G$31<8,0,1)","v":0},{"$f":"+IF('D1 Données générales'!$G$31<9,0,1)","v":0},{"$f":"+IF('D1 Données générales'!$G$31<10,0,1)","v":0}]
[null,null,{"$f":"+IF('D1 Données générales'!$H$11=\"\",\"\",'D1 Données générales'!$H$11)","v":"Ghana"}]
[null,null,{"$f":"+'D9 Variables temps'!$I$6","v":2011}]
[]
[null,null,null,null,null,"Zone 1",null,null,null,"Zone 2","Zone 3","Zone 4","Zone 5","Zone 6","Zone 7","Zone 8","Zone 9","Zone 10"]
[null,null,null,{"$f":"'D2 Echelle'!$C$30","v":"district"},"TOTAL (Zones, Groupe-zones & Central)",{"$f":"+IF('D2 Echelle'!$C$31=\"\",\"\",'D2 Echelle'!$C$31)","v":"Ashiedu Keteke"},null,null,null,{"$f":"+IF('D2 Echelle'!$C$36=\"\",\"\",'D2 Echelle'!$C$36)","v":""},{"$f":"+IF('D2 Echelle'!$C$41=\"\",\"\",'D2 Echelle'!$C$41)","v":""},{"$f":"+IF('D2 Echelle'!$C$46=\"\",\"\",'D2 Echelle'!$C$46)","v":""},{"$f":"+IF('D2 Echelle'!$C$51=\"\",\"\",'D2 Echelle'!$C$51)","v":""},{"$f":"+IF('D2 Echelle'!$C$56=\"\",\"\",'D2 Echelle'!$C$56)","v":""},{"$f":"+IF('D2 Echelle'!$C$61=\"\",\"\",'D2 Echelle'!$C$61)","v":""},{"$f":"+IF('D2 Echelle'!$C$66=\"\",\"\",'D2 Echelle'!$C$66)","v":""},{"$f":"+IF('D2 Echelle'!$C$71=\"\",\"\",'D2 Echelle'!$C$71)","v":""},{"$f":"+IF('D2 Echelle'!$C$76=\"\",\"\",'D2 Echelle'!$C$76)","v":""}]
[null,null,null,{"$f":"+'D2 Echelle'!$D$30","v":"région"},null,{"$f":"+IF('D2 Echelle'!$D$31=\"\",\"\",'D2 Echelle'!$D$31)","v":"Greater Accra"},null,null,null,{"$f":"+IF('D2 Echelle'!$D$36=\"\",\"\",'D2 Echelle'!$D$36)","v":""},{"$f":"+IF('D2 Echelle'!$D$41=\"\",\"\",'D2 Echelle'!$D$41)","v":""},{"$f":"+IF('D2 Echelle'!$D$46=\"\",\"\",'D2 Echelle'!$D$46)","v":""},{"$f":"+IF('D2 Echelle'!$D$51=\"\",\"\",'D2 Echelle'!$D$51)","v":""},{"$f":"+IF('D2 Echelle'!$D$56=\"\",\"\",'D2 Echelle'!$D$56)","v":""},{"$f":"+IF('D2 Echelle'!$D$61=\"\",\"\",'D2 Echelle'!$D$61)","v":""},{"$f":"+IF('D2 Echelle'!$D$66=\"\",\"\",'D2 Echelle'!$D$66)","v":""},{"$f":"+IF('D2 Echelle'!$D$71=\"\",\"\",'D2 Echelle'!$D$71)","v":""},{"$f":"+IF('D2 Echelle'!$D$76=\"\",\"\",'D2 Echelle'!$D$76)","v":""}]
[]
[null,"Activité","Emplacement","Unités"]
[null,"Stockage de l'aliment thérapeutique"]
[null,null,"Siège national","m3",{"$f":"+'R6 Niveau group-zones et centre'!Q39","v":0}]
[null,null,"Siège groupe-zones (minimum)","m3",{"$f":"+'R6 Niveau group-zones et centre'!Q36","v":0}," ",null,null,null,null," "," ","  "," "," "," "," "," "]
[null,null,"Sièges zones (minimum)","m3",{"$f":"+F19*$F$7+$J$7*J19+K19*$K$7+$L$7*L19+M19*$M$7+$N$7*N19+O19*$O$7+$P$7*P19","v":0.60902354433593753},{"$f":"+'R11 Logistique approvisionnemen'!F26","v":0.60902354433593753},null,null,null,{"$f":"+'R11 Logistique approvisionnemen'!J26","v":0},{"$f":"+'R11 Logistique approvisionnemen'!K26","v":0},{"$f":"+'R11 Logistique approvisionnemen'!L26","v":0},{"$f":"+'R11 Logistique approvisionnemen'!M26","v":0},{"$f":"+'R11 Logistique approvisionnemen'!N26","v":0},{"$f":"+'R11 Logistique approvisionnemen'!O26","v":0},{"$f":"+'R11 Logistique approvisionnemen'!P26","v":0},{"$f":"+'R11 Logistique approvisionnemen'!Q26","v":0},{"$f":"+'R11 Logistique approvisionnemen'!R26","v":0}]
[null,null,"Total des sites PEC MAS ambulatoire (minimum)","m3",{"$f":"+F20*$F$7+$J$7*J20+K20*$K$7+$L$7*L20+M20*$M$7+$N$7*N20+O20*$O$7+$P$7*P20","v":0.54397131249999997},{"$f":"+'R11 Logistique approvisionnemen'!F27","v":0.54397131249999997},null,null,null,{"$f":"+'R11 Logistique approvisionnemen'!J27","v":0},{"$f":"+'R11 Logistique approvisionnemen'!K27","v":0},{"$f":"+'R11 Logistique approvisionnemen'!L27","v":0},{"$f":"+'R11 Logistique approvisionnemen'!M27","v":0},{"$f":"+'R11 Logistique approvisionnemen'!N27","v":0},{"$f":"+'R11 Logistique approvisionnemen'!O27","v":0},{"$f":"+'R11 Logistique approvisionnemen'!P27","v":0},{"$f":"+'R11 Logistique approvisionnemen'!Q27","v":0},{"$f":"+'R11 Logistique approvisionnemen'!R27","v":0}]
[null,null,"Total des sites PEC MAS hospitalière (minimum)","m3",{"$f":"+F21*$F$7+$J$7*J21+K21*$K$7+$L$7*L21+M21*$M$7+$N$7*N21+O21*$O$7+$P$7*P21","v":6.5052231835937502E-2},{"$f":"+'R11 Logistique approvisionnemen'!F28","v":6.5052231835937502E-2},null,null,null,{"$f":"+'R11 Logistique approvisionnemen'!J28","v":0},{"$f":"+'R11 Logistique approvisionnemen'!K28","v":0},{"$f":"+'R11 Logistique approvisionnemen'!L28","v":0},{"$f":"+'R11 Logistique approvisionnemen'!M28","v":0},{"$f":"+'R11 Logistique approvisionnemen'!N28","v":0},{"$f":"+'R11 Logistique approvisionnemen'!O28","v":0},{"$f":"+'R11 Logistique approvisionnemen'!P28","v":0},{"$f":"+'R11 Logistique approvisionnemen'!Q28","v":0},{"$f":"+'R11 Logistique approvisionnemen'!R28","v":0}]
[null,null,"Site moyen PEC MAS ambulatoire","m3",null,{"$f":"+'R11 Logistique approvisionnemen'!F103","v":0.27198565624999999},null,null,null,{"$f":"+'R11 Logistique approvisionnemen'!J103","v":0},{"$f":"+'R11 Logistique approvisionnemen'!K103","v":0},{"$f":"+'R11 Logistique approvisionnemen'!L103","v":0},{"$f":"+'R11 Logistique approvisionnemen'!M103","v":0},{"$f":"+'R11 Logistique approvisionnemen'!N103","v":0},{"$f":"+'R11 Logistique approvisionnemen'!O103","v":0},{"$f":"+'R11 Logistique approvisionnemen'!P103","v":0},{"$f":"+'R11 Logistique approvisionnemen'!Q103","v":0},{"$f":"+'R11 Logistique approvisionnemen'!R103","v":0}]
[null,null,"Site moyen PEC MAS hospitalière","m3",null,{"$f":"+'R11 Logistique approvisionnemen'!F104","v":6.5052231835937502E-2},null,null,null,{"$f":"+'R11 Logistique approvisionnemen'!J104","v":0},{"$f":"+'R11 Logistique approvisionnemen'!K104","v":0},{"$f":"+'R11 Logistique approvisionnemen'!L104","v":0},{"$f":"+'R11 Logistique approvisionnemen'!M104","v":0},{"$f":"+'R11 Logistique approvisionnemen'!N104","v":0},{"$f":"+'R11 Logistique approvisionnemen'!O104","v":0},{"$f":"+'R11 Logistique approvisionnemen'!P104","v":0},{"$f":"+'R11 Logistique approvisionnemen'!Q104","v":0},{"$f":"+'R11 Logistique approvisionnemen'!R104","v":0}]
[]
[null,"Formation"]
[null,null,"Au niveau national pour la formation du personnel du siège du groupe-zones","jours-salle",{"$f":"+'R6 Niveau group-zones et centre'!Q27","v":0}]
[null,null,"Au siège du groupe-zones pour la formation du personnel du siège de la zone","jours-salle",{"$f":"+'R6 Niveau group-zones et centre'!Q19","v":0}]
[null,null,"Au siège de la zone pour la formation des agents de santé des sites PEC MAS ambulatoire et hospitalière","jours-salle",{"$f":"+F28*$F$7+$J$7*J28+K28*$K$7+$L$7*L28+M28*$M$7+$N$7*N28+O28*$O$7+$P$7*P28","v":8},{"$f":"+'R12 Formation'!F69+'R12 Formation'!F70","v":8},null,null,null,{"$f":"+'R12 Formation'!J69+'R12 Formation'!J70","v":0},{"$f":"+'R12 Formation'!K69+'R12 Formation'!K70","v":0},{"$f":"+'R12 Formation'!L69+'R12 Formation'!L70","v":0},{"$f":"+'R12 Formation'!M69+'R12 Formation'!M70","v":0},{"$f":"+'R12 Formation'!N69+'R12 Formation'!N70","v":0},{"$f":"+'R12 Formation'!O69+'R12 Formation'!O70","v":0},{"$f":"+'R12 Formation'!P69+'R12 Formation'!P70","v":0},{"$f":"+'R12 Formation'!Q69+'R12 Formation'!Q70","v":0},{"$f":"+'R12 Formation'!R69+'R12 Formation'!R70","v":0}]
[null,null,"Au site PEC MAS ambulatoire pour la formation des AEC","jours-salle",{"$f":"+F29*$F$7+$J$7*J29+K29*$K$7+$L$7*L29+M29*$M$7+$N$7*N29+O29*$O$7+$P$7*P29","v":12},{"$f":"+'R12 Formation'!F68","v":12},null,null,null,{"$f":"+'R12 Formation'!J68","v":0},{"$f":"+'R12 Formation'!K68","v":0},{"$f":"+'R12 Formation'!L68","v":0},{"$f":"+'R12 Formation'!M68","v":0},{"$f":"+'R12 Formation'!N68","v":0},{"$f":"+'R12 Formation'!O68","v":0},{"$f":"+'R12 Formation'!P68","v":0},{"$f":"+'R12 Formation'!Q68","v":0},{"$f":"+'R12 Formation'!R68","v":0}]
[]
[]
[null,"Séance PEC MAS ambulatoire"]
[null,null,"A tous les sites PEC MAS ambulatoire","jours-salle",{"$f":"+F33*$F$7+$J$7*J33+K33*$K$7+$L$7*L33+M33*$M$7+$N$7*N33+O33*$O$7+$P$7*P33","v":52},{"$f":"+'R8 Traitement (main-d''oeuvres)'!F93","v":52},null,null,null,{"$f":"+'R8 Traitement (main-d''oeuvres)'!J92","v":0},{"$f":"+'R8 Traitement (main-d''oeuvres)'!K92","v":0},{"$f":"+'R8 Traitement (main-d''oeuvres)'!L92","v":0},{"$f":"+'R8 Traitement (main-d''oeuvres)'!M92","v":0},{"$f":"+'R8 Traitement (main-d''oeuvres)'!N92","v":0},{"$f":"+'R8 Traitement (main-d''oeuvres)'!O92","v":0},{"$f":"+'R8 Traitement (main-d''oeuvres)'!P92","v":0},{"$f":"+'R8 Traitement (main-d''oeuvres)'!Q92","v":0},{"$f":"+'R8 Traitement (main-d''oeuvres)'!R92","v":0}]
[null,null,null,"m2/an",{"$f":"+SUM(F34:R34)","v":4.3134615384615387},{"$f":"+'R8 Traitement (main-d''oeuvres)'!F36","v":4.3134615384615387},null,null,null,{"$f":"+'R8 Traitement (main-d''oeuvres)'!J36","v":0},{"$f":"+'R8 Traitement (main-d''oeuvres)'!K36","v":0},{"$f":"+'R8 Traitement (main-d''oeuvres)'!L36","v":0},{"$f":"+'R8 Traitement (main-d''oeuvres)'!M36","v":0},{"$f":"+'R8 Traitement (main-d''oeuvres)'!N36","v":0},{"$f":"+'R8 Traitement (main-d''oeuvres)'!O36","v":0},{"$f":"+'R8 Traitement (main-d''oeuvres)'!P36","v":0},{"$f":"+'R8 Traitement (main-d''oeuvres)'!Q36","v":0},{"$f":"+'R8 Traitement (main-d''oeuvres)'!R36","v":0}]
[null,null,"(Au site moyen PEC MAS ambulatoire)",null,null,{"$f":"+IF('R8 Traitement (main-d''oeuvres)'!F78=0,0,F33/'R8 Traitement (main-d''oeuvres)'!F78)","v":26},null,null,null,{"$f":"+IF('R8 Traitement (main-d''oeuvres)'!J78=0,0,J33/'R8 Traitement (main-d''oeuvres)'!J78)","v":0},{"$f":"+IF('R8 Traitement (main-d''oeuvres)'!K78=0,0,K33/'R8 Traitement (main-d''oeuvres)'!K78)","v":0},{"$f":"+IF('R8 Traitement (main-d''oeuvres)'!L78=0,0,L33/'R8 Traitement (main-d''oeuvres)'!L78)","v":0},{"$f":"+IF('R8 Traitement (main-d''oeuvres)'!M78=0,0,M33/'R8 Traitement (main-d''oeuvres)'!M78)","v":0},{"$f":"+IF('R8 Traitement (main-d''oeuvres)'!N78=0,0,N33/'R8 Traitement (main-d''oeuvres)'!N78)","v":0},{"$f":"+IF('R8 Traitement (main-d''oeuvres)'!O78=0,0,O33/'R8 Traitement (main-d''oeuvres)'!O78)","v":0},{"$f":"+IF('R8 Traitement (main-d''oeuvres)'!P78=0,0,P33/'R8 Traitement (main-d''oeuvres)'!P78)","v":0},{"$f":"+IF('R8 Traitement (main-d''oeuvres)'!Q78=0,0,Q33/'R8 Traitement (main-d''oeuvres)'!Q78)","v":0},{"$f":"+IF('R8 Traitement (main-d''oeuvres)'!R78=0,0,R33/'R8 Traitement (main-d''oeuvres)'!R78)","v":0}]
[]
[null,"PEC MAS hospitalière"]
[null,null,"A tous les sites PEC MAS hospitalière ","jours-lit",{"$f":"+F38*$F$7+$J$7*J38+K38*$K$7+$L$7*L38+M38*$M$7+$N$7*N38+O38*$O$7+$P$7*P38","v":652.49999999999989},{"$f":"+'R10 Traitement (fournitures)'!G42","v":652.49999999999989},null,null,null,{"$f":"+'R10 Traitement (fournitures)'!K42","v":0},{"$f":"+'R10 Traitement (fournitures)'!L42","v":0},{"$f":"+'R10 Traitement (fournitures)'!M42","v":0},{"$f":"+'R10 Traitement (fournitures)'!N42","v":0},{"$f":"+'R10 Traitement (fournitures)'!O42","v":0},{"$f":"+'R10 Traitement (fournitures)'!P42","v":0},{"$f":"+'R10 Traitement (fournitures)'!Q42","v":0},{"$f":"+'R10 Traitement (fournitures)'!R42","v":0},{"$f":"+'R10 Traitement (fournitures)'!S42","v":0}]
[null,null,null,"m2/an",{"$f":"+SUM(F39:R39)","v":19},{"$f":"+'R8 Traitement (main-d''oeuvres)'!F37","v":19},null,null,null,{"$f":"+'R8 Traitement (main-d''oeuvres)'!J37","v":0},{"$f":"+'R8 Traitement (main-d''oeuvres)'!K37","v":0},{"$f":"+'R8 Traitement (main-d''oeuvres)'!L37","v":0},{"$f":"+'R8 Traitement (main-d''oeuvres)'!M37","v":0},{"$f":"+'R8 Traitement (main-d''oeuvres)'!N37","v":0},{"$f":"+'R8 Traitement (main-d''oeuvres)'!O37","v":0},{"$f":"+'R8 Traitement (main-d''oeuvres)'!P37","v":0},{"$f":"+'R8 Traitement (main-d''oeuvres)'!Q37","v":0},{"$f":"+'R8 Traitement (main-d''oeuvres)'!R37","v":0}]

{"sheet":"R5 Récapitulatif financier","index":19,"n_rows":37,"n_cols":18,"rows_kept":37,"cut":false,"hidden":false,"merged":[[9,5,9,10],[1,2,1,4],[3,2,3,8],[8,5,8,15],[47,2,47,4],[11,2,12,2],[11,3,12,3],[13,3,13,4],[10,17,12,17],[10,16,12,16],[10,15,12,15]]}
[]
["Retour au sommaire",null,"R5: Récapitulatif financier"]
[]
[null,null,"Cette Feuille de calcul vous montre (pour l'année choisie) le coût financier de la mise en oeuvre de la PCMA. Il est réparti par zone et par types d'activités. Un lien direct est fourni pour se rendre aux feuilles qui sont la source des données."]
[]
[]
[null,null,null,"Hidden factors to prevent inclusion of non-Areas",null,{"$f":"+IF('D1 Données générales'!$G$31<1,0,1)","v":1},{"$f":"+IF('D1 Données générales'!$G$31<2,0,1)","v":0},{"$f":"+IF('D1 Données générales'!$G$31<3,0,1)","v":0},{"$f":"+IF('D1 Données générales'!$G$31<4,0,1)","v":0},{"$f":"+IF('D1 Données générales'!$G$31<5,0,1)","v":0},{"$f":"+IF('D1 Données générales'!$G$31<6,0,1)","v":0},{"$f":"+IF('D1 Données générales'!$G$31<7,0,1)","v":0},{"$f":"+IF('D1 Données générales'!$G$31<8,0,1)","v":0},{"$f":"+IF('D1 Données générales'!$G$31<9,0,1)","v":0},{"$f":"+IF('D1 Données générales'!$G$31<10,0,1)","v":0}]
[null,null,{"$f":"+IF('D1 Données générales'!$H$11=\"\",\"\",'D1 Données générales'!$H$11)","v":"Ghana"}]
[null,null,{"$f":"+'D9 Variables temps'!$I$6","v":2011},null,null,"Total coûts annuels du programme/service de la PCMA "]
[null,null,null,null,null,"Année de base pour les prix et le taux d'échange",null,null,null,null,null,null,{"$f":"+'D1 Données générales'!H14","v":2010},{"$f":"+'D1 Données générales'!H13","v":"Cedi"}]
[null,null,null,null,null,"Zone 1","Zone 2","Zone 3","Zone 4","Zone 5","Zone 6","Zone 7","Zone 8","Zone 9","Zone 10","Total Zones ","Groupe-zones & Niveau central","Zones, Groupe-Zones & Niveau central"]
[null,null,"Activités",null,{"$f":"+'R7 Gestion au siège de la zone'!E13","v":"district"},{"$f":"+IF('D2 Echelle'!$C$31=\"\",\"\",'D2 Echelle'!$C$31)","v":"Ashiedu Keteke"},{"$f":"+IF('D2 Echelle'!$C$36=\"\",\"\",'D2 Echelle'!$C$36)","v":""},{"$f":"+IF('D2 Echelle'!$C$41=\"\",\"\",'D2 Echelle'!$C$41)","v":""},{"$f":"+IF('D2 Echelle'!$C$46=\"\",\"\",'D2 Echelle'!$C$46)","v":""},{"$f":"+IF('D2 Echelle'!$C$51=\"\",\"\",'D2 Echelle'!$C$51)","v":""},{"$f":"+IF('D2 Echelle'!$C$56=\"\",\"\",'D2 Echelle'!$C$56)","v":""},{"$f":"+IF('D2 Echelle'!$C$61=\"\",\"\",'D2 Echelle'!$C$61)","v":""},{"$f":"+IF('D2 Echelle'!$C$66=\"\",\"\",'D2 Echelle'!$C$66)","v":""},{"$f":"+IF('D2 Echelle'!$C$71=\"\",\"\",'D2 Echelle'!$C$71)","v":""},{"$f":"+IF('D2 Echelle'!C76=\"\",\"\",'D2 Echelle'!$C$76)","v":""}]
[null,null,null,null,{"$f":"+'R7 Gestion au siège de la zone'!E14","v":"région"},{"$f":"+IF('D2 Echelle'!$D$31=\"\",\"\",'D2 Echelle'!$D$31)","v":"Greater Accra"},{"$f":"+IF('D2 Echelle'!$D$36=\"\",\"\",'D2 Echelle'!$D$36)","v":""},{"$f":"+IF('D2 Echelle'!$D$41=\"\",\"\",'D2 Echelle'!$D$41)","v":""},{"$f":"+IF('D2 Echelle'!$D$46=\"\",\"\",'D2 Echelle'!$D$46)","v":""},{"$f":"+IF('D2 Echelle'!$D$51=\"\",\"\",'D2 Echelle'!$D$51)","v":""},{"$f":"+IF('D2 Echelle'!$D$56=\"\",\"\",'D2 Echelle'!$D$56)","v":""},{"$f":"+IF('D2 Echelle'!$D$61=\"\",\"\",'D2 Echelle'!$D$61)","v":""},{"$f":"+IF('D2 Echelle'!$D$66=\"\",\"\",'D2 Echelle'!$D$66)","v":""},{"$f":"+IF('D2 Echelle'!$D$71=\"\",\"\",'D2 Echelle'!$D$71)","v":""},{"$f":"+IF('D2 Echelle'!$D76=\"\",\"\",'D2 Echelle'!$D$76)","v":""}]
[null,null,null,"Source (Feuille de calcul)"]
[null,null,"Activités niveau central et groupe-zones (sous-total)","R6",null,null,null,null,null,null,null,null,null,null,null,null,{"$f":"+Q16+Q17+Q18","v":8401.2000000000007},{"$f":"+Q15+P15","v":8401.2000000000007}]
[null,null,"Gestion",null,null,null,null,null,null,null,null,null,null,null,null,null,{"$f":"+'R6 Niveau group-zones et centre'!S52","v":7200},{"$f":"+Q16+P16","v":7200}]
[null,null,"Formation",null,null,null,null,null,null,null,null,null,null,null,null,null,{"$f":"+'R6 Niveau group-zones et centre'!S32","v":0},0]
[null,null,"Logistique de l'approvisionnement",null,null,null,null,null,null,null,null,null,null,null,null,null,{"$f":"+'R6 Niveau group-zones et centre'!S40","v":1201.2},1201.2]
[]
[null,null,"Gestion siège de la zone","R7",null,{"$f":"+'R7 Gestion au siège de la zone'!F23","v":2658.4615384615381},{"$f":"+'R7 Gestion au siège de la zone'!J23","v":0},{"$f":"+'R7 Gestion au siège de la zone'!K23","v":0},{"$f":"+'R7 Gestion au siège de la zone'!L23","v":0},{"$f":"+'R7 Gestion au siège de la zone'!M23","v":0},{"$f":"+'R7 Gestion au siège de la zone'!N23","v":0},{"$f":"+'R7 Gestion au siège de la zone'!O23","v":0},{"$f":"+'R7 Gestion au siège de la zone'!P23","v":0},{"$f":"+'R7 Gestion au siège de la zone'!Q23","v":0},{"$f":"+'R7 Gestion au siège de la zone'!R23","v":0},{"$f":"+F20*$F$7+$G$7*G20+H20*$H$7+$I$7*I20+J20*$J$7+$K$7*K20+L20*$L$7+$M$7*M20+N20*$N$7+$O$7*O20","v":2658.4615384615381},null,2658.4615384615381]
[]
[null,null,"Traitement (sous-total)",null,null,{"$f":"+SUM(F23:F27)","v":40711.013653846152},{"$f":"+SUM(G23:G27)","v":0},0,0,0,0,0,0,0,0,{"$f":"+F22*$F$7+$G$7*G22+H22*$H$7+$I$7*I22+J22*$J$7+$K$7*K22+L22*$L$7+$M$7*M22+N22*$N$7+$O$7*O22","v":40711.013653846152},null,40711.013653846152]
[null,null,"Main-d'oeuvre","R8",null,{"$f":"+'R8 Traitement (main-d''oeuvres)'!F22","v":25611.346153846156},{"$f":"+'R8 Traitement (main-d''oeuvres)'!J22","v":0},{"$f":"+'R8 Traitement (main-d''oeuvres)'!K22","v":0},{"$f":"+'R8 Traitement (main-d''oeuvres)'!L22","v":0},{"$f":"+'R8 Traitement (main-d''oeuvres)'!M22","v":0},{"$f":"+'R8 Traitement (main-d''oeuvres)'!N22","v":0},{"$f":"+'R8 Traitement (main-d''oeuvres)'!O22","v":0},{"$f":"+'R8 Traitement (main-d''oeuvres)'!P22","v":0},{"$f":"+'R8 Traitement (main-d''oeuvres)'!Q22","v":0},{"$f":"+'R8 Traitement (main-d''oeuvres)'!R22","v":0},25611.346153846156,null,25611.346153846156]
[null,null,"Fournitures médicales","R9",null,{"$f":"+'R9 Traitement (médicaments)'!I24","v":1312.35},{"$f":"+'R9 Traitement (médicaments)'!N24","v":0},{"$f":"+'R9 Traitement (médicaments)'!P24","v":0},{"$f":"+'R9 Traitement (médicaments)'!R24","v":0},{"$f":"+'R9 Traitement (médicaments)'!T24","v":0},{"$f":"+'R9 Traitement (médicaments)'!V24","v":0},{"$f":"+'R9 Traitement (médicaments)'!X24","v":0},{"$f":"+'R9 Traitement (médicaments)'!Z24","v":0},{"$f":"+'R9 Traitement (médicaments)'!AB24","v":0},{"$f":"+'R9 Traitement (médicaments)'!AD24","v":0},1312.35,null,1312.35]
[null,null,"Aliments thérapeutiques","R10",null,{"$f":"+'R10 Traitement (fournitures)'!G18+'R10 Traitement (fournitures)'!G19","v":12426.727499999999},{"$f":"+'R10 Traitement (fournitures)'!I18+'R10 Traitement (fournitures)'!I19","v":0},{"$f":"+'R10 Traitement (fournitures)'!K18+'R10 Traitement (fournitures)'!K19","v":0},{"$f":"+'R10 Traitement (fournitures)'!M18+'R10 Traitement (fournitures)'!M19","v":0},{"$f":"+'R10 Traitement (fournitures)'!O18+'R10 Traitement (fournitures)'!O19","v":0},{"$f":"+'R10 Traitement (fournitures)'!Q18+'R10 Traitement (fournitures)'!Q19","v":0},{"$f":"+'R10 Traitement (fournitures)'!S18+'R10 Traitement (fournitures)'!S19","v":0},{"$f":"+'R10 Traitement (fournitures)'!U18+'R10 Traitement (fournitures)'!U19","v":0},{"$f":"+'R10 Traitement (fournitures)'!W18+'R10 Traitement (fournitures)'!W19","v":0},{"$f":"+'R10 Traitement (fournitures)'!W18+'R10 Traitement (fournitures)'!W19","v":0},12426.727499999999,null,12426.727499999999]
[null,null,"Autres fournitures","R10",null,{"$f":"+'R10 Traitement (fournitures)'!G20+'R10 Traitement (fournitures)'!G21","v":1360.59},{"$f":"+'R10 Traitement (fournitures)'!I20+'R10 Traitement (fournitures)'!I21","v":0},{"$f":"+'R10 Traitement (fournitures)'!K20+'R10 Traitement (fournitures)'!K21","v":0},{"$f":"+'R10 Traitement (fournitures)'!M20+'R10 Traitement (fournitures)'!M21","v":0},{"$f":"+'R10 Traitement (fournitures)'!O20+'R10 Traitement (fournitures)'!O21","v":0},{"$f":"+'R10 Traitement (fournitures)'!Q20+'R10 Traitement (fournitures)'!Q21","v":0},{"$f":"+'R10 Traitement (fournitures)'!S20+'R10 Traitement (fournitures)'!S21","v":0},{"$f":"+'R10 Traitement (fournitures)'!U20+'R10 Traitement (fournitures)'!U21","v":0},{"$f":"+'R10 Traitement (fournitures)'!W20+'R10 Traitement (fournitures)'!W21","v":0},{"$f":"+'R10 Traitement (fournitures)'!W20+'R10 Traitement (fournitures)'!W21","v":0},1360.59,null,1360.59]
[null,null,"Espace","R8",null,{"$f":"+'R8 Traitement (main-d''oeuvres)'!F26","v":0},{"$f":"+'R8 Traitement (main-d''oeuvres)'!J26","v":0},{"$f":"+'R8 Traitement (main-d''oeuvres)'!K26","v":0},{"$f":"+'R8 Traitement (main-d''oeuvres)'!L26","v":0},{"$f":"+'R8 Traitement (main-d''oeuvres)'!M26","v":0},{"$f":"+'R8 Traitement (main-d''oeuvres)'!N26","v":0},{"$f":"+'R8 Traitement (main-d''oeuvres)'!O26","v":0},{"$f":"+'R8 Traitement (main-d''oeuvres)'!P26","v":0},{"$f":"+'R8 Traitement (main-d''oeuvres)'!Q26","v":0},{"$f":"+'R8 Traitement (main-d''oeuvres)'!R26","v":0},{"$f":"+F27*F7+G7*G27+H27*H7+I7*I27+J27*J7+K7*K27+L27*L7+M7*M27+N27*N7+O7*O27","v":0},null,0]
[]
[null,null,"Logistique de l'approvisionnement","R11",null,{"$f":"+'R11 Logistique approvisionnemen'!F21","v":5239.1653846153849},{"$f":"+'R11 Logistique approvisionnemen'!J21","v":0},{"$f":"+'R11 Logistique approvisionnemen'!K21","v":0},{"$f":"+'R11 Logistique approvisionnemen'!L21","v":0},{"$f":"+'R11 Logistique approvisionnemen'!M21","v":0},{"$f":"+'R11 Logistique approvisionnemen'!N21","v":0},{"$f":"+'R11 Logistique approvisionnemen'!O21","v":0},{"$f":"+'R11 Logistique approvisionnemen'!P21","v":0},{"$f":"+'R11 Logistique approvisionnemen'!Q21","v":0},{"$f":"+'R11 Logistique approvisionnemen'!R21","v":0},5239.1653846153849,null,5239.1653846153849]
[]
[null,null,"Formation","R12",null,{"$f":"+'R12 Formation'!F53","v":15345.23076923077},{"$f":"+'R12 Formation'!J53","v":0},{"$f":"+'R12 Formation'!K53","v":0},{"$f":"+'R12 Formation'!L53","v":0},{"$f":"+'R12 Formation'!M53","v":0},{"$f":"+'R12 Formation'!N53","v":0},{"$f":"+'R12 Formation'!O53","v":0},{"$f":"+'R12 Formation'!P53","v":0},{"$f":"+'R12 Formation'!Q53","v":0},{"$f":"+'R12 Formation'!R53","v":0},15345.23076923077,null,15345.23076923077]
[]
[null,null,"Supervision","R13",null,{"$f":"+'R13 Supervision'!F31","v":30592.846153846152},{"$f":"+'R13 Supervision'!J31","v":0},{"$f":"+'R13 Supervision'!K31","v":0},{"$f":"+'R13 Supervision'!L31","v":0},{"$f":"+'R13 Supervision'!M31","v":0},{"$f":"+'R13 Supervision'!N31","v":0},{"$f":"+'R13 Supervision'!O31","v":0},{"$f":"+'R13 Supervision'!P31","v":0},{"$f":"+'R13 Supervision'!Q31","v":0},{"$f":"+'R13 Supervision'!R31","v":0},30592.846153846152,null,30592.846153846152]
[]
[null,null,"Extension communautaire","R14",null,{"$f":"+'R14 Extension communautaire'!F25","v":30738.461538461539},{"$f":"+'R14 Extension communautaire'!J25","v":0},{"$f":"+'R14 Extension communautaire'!K25","v":0},{"$f":"+'R14 Extension communautaire'!L25","v":0},{"$f":"+'R14 Extension communautaire'!M25","v":0},{"$f":"+'R14 Extension communautaire'!N25","v":0},{"$f":"+'R14 Extension communautaire'!O25","v":0},{"$f":"+'R14 Extension communautaire'!P25","v":0},{"$f":"+'R14 Extension communautaire'!Q25","v":0},{"$f":"+'R14 Extension communautaire'!R25","v":0},30738.461538461539,null,30738.461538461539]
[]
[null,null,"TOTAL",null,null,{"$f":"+F20+F22+F29+F31+F33+F35","v":125285.17903846153},{"$f":"+G20+G22+G29+G31+G33+G35","v":0},0,0,0,0,0,0,0,0,125285.17903846153,{"$f":"+Q15","v":8401.2000000000007},133686.37903846154]

{"sheet":"R6 Niveau group-zones et centre","index":20,"n_rows":155,"n_cols":24,"rows_kept":155,"cut":false,"hidden":false,"merged":[[1,2,1,5],[3,2,3,7],[5,2,5,7],[75,17,76,17],[13,16,14,16],[13,14,14,14],[13,15,14,15],[13,17,14,17],[79,4,88,4],[13,18,14,18],[11,17,11,18],[12,17,12,18],[12,6,12,16],[13,6,13,13],[75,18,76,18],[76,14,77,14],[76,15,77,15],[75,16,76,16]]}
[]
["Retour au sommaire",null,"R6: Activités au niveau central et du groupe-zones"]
[null,null,null,null,null,null,null,null,null,null,null,null,null,null,null,null,null,null,null,null,null,"Important hidden columns DO NOT DELETE"]
[null,null,"Cette Feuille de calcul montre (pour l'année choisie) les quantités d'intrants nécessaires au niveau de la zone, du groupe-zone et au niveau central (pour la gestion, la formation, les transpors et le stockage de l'aliment thérapeutique) pour mettre en oeuvre la PCMA et les coûts connexes."]
[]
[null,null,"Voir ci-dessous pour la manière dont les chiffres sont calculés"]
[]
[null,null,null," EPT = Equivalent à plein temps "]
[]
[]
[null,null,null,{"$f":"+IF('D1 Données générales'!$H$11=\"\",\"\",'D1 Données générales'!$H$11)","v":"Ghana"}]
[null,null,null,{"$f":"+'D9 Variables temps'!$I$6","v":2011},null,null,{"$f":"+IF('D1 Données générales'!$G$33<1,0,1)","v":1},{"$f":"+IF('D1 Données générales'!$G$33<2,0,1)","v":0},{"$f":"+IF('D1 Données générales'!$G$33<3,0,1)","v":0},{"$f":"+IF('D1 Données générales'!$G$33<4,0,1)","v":0},{"$f":"+IF('D1 Données générales'!$G$33<5,0,1)","v":0},{"$f":"+IF('D1 Données générales'!$G$33<6,0,1)","v":0},{"$f":"+IF('D1 Données générales'!$G$33<7,0,1)","v":0},{"$f":"+IF('D1 Données générales'!$G$33<8,0,1)","v":0},null,null,null,"Coûts dans "]
[null,null,null,null,null,null," -------------------------------------------   Unités spécifiées dans la colonne E   -----------------------------------------",null,null,null,null,null,null,null,null,null,null,{"$f":"+IF('D1 Données générales'!H13=\"\",\"\",'D1 Données générales'!H13)","v":"Cedi"}]
[null,null,null,null,null,null,"Groupe-Zones",null,null,null,null,null,null,null,"Total groupe-zones ","Niveau central","Total du niveau central & groupe-zones","Prix (par unité de variable)","Total Coût"]
[null,null,null,"Variables","Unités","Commentaires",{"$f":"+IF('D1 Données générales'!$G$36=\"\",\"\",'D1 Données générales'!$G$36)","v":"Greater Accra"},{"$f":"+IF('D1 Données générales'!$G$37=\"\",\"\",'D1 Données générales'!$G$37)","v":""},{"$f":"+IF('D1 Données générales'!$G$38=\"\",\"\",'D1 Données générales'!$G$38)","v":""},{"$f":"+IF('D1 Données générales'!$G$39=\"\",\"\",'D1 Données générales'!$G$39)","v":""},{"$f":"+IF('D1 Données générales'!$G$40=\"\",\"\",'D1 Données générales'!$G$40)","v":""},{"$f":"+IF('D1 Données générales'!$G$41=\"\",\"\",'D1 Données générales'!$G$41)","v":""},{"$f":"+IF('D1 Données générales'!$G$42=\"\",\"\",'D1 Données générales'!$G$42)","v":""},{"$f":"+IF('D1 Données générales'!$G$43=\"\",\"\",'D1 Données générales'!$G$43)","v":""}]
[null,null,null,"Formation du personnel du siège de la zone "]
[null,null,null,"Total jours du formateur du groupe-zone (niveau intermédiaire) pour le personnel du siège de la zone","jours","Salaires",{"$f":"+G109+G108","v":0},0,0,0,0,0,0,0,{"$f":"+G17*$G$12+H17*$H$12+I17*$I$12+J17*$J$12+K17*$K$12+L17*$L$12+M17*$M$12+$N$12*N17","v":0},null,{"$f":"+P17+O17","v":0},{"$f":"+'D5 Salaires'!J25","v":36.92307692307692},{"$f":"+R17*Q17","v":0}]
[null,null,null,null,null,"Honoraires",null,null,null,null,null,null,null,null,null,null,null,{"$f":"+'D5 Salaires'!K25","v":50},{"$f":"+R18*Q17","v":0}]
[null,null,null,"Jours-salle pour la formation au siège du groupe-zone","jours-salle",null,{"$f":"+G105*G101+G106*G102","v":0},0,0,0,0,0,0,0,{"$f":"+G19*$G$12+H19*$H$12+I19*$I$12+J19*$J$12+K19*$K$12+L19*$L$12+M19*$M$12+$N$12*N19","v":0},null,{"$f":"+P19+O19","v":0},{"$f":"+'D4 Prix'!F23","v":120},{"$f":"+R19*Q19","v":0}]
[null,null,null,"Formation des formateurs (pour le site PEC MAS hospitalière) ",null,null,null,null,null,null,null,null,null,null," "]
[null,null,null,"Temps passé par du personnel choisi de la PEC MAS hospitalière pour être formé en tant que formateur","jours",null,{"$f":"+IF(G96=\"non\",0,G111*G112)","v":0},{"$f":"+IF(H96=\"non\",0,H111*H112)","v":0},0,0,0,0,0,0,{"$f":"+G21*$G$12+H21*$H$12+I21*$I$12+J21*$J$12+K21*$K$12+L21*$L$12+M21*$M$12+$N$12*N21","v":0},null,{"$f":"+O21+P21","v":0},{"$f":"+'D5 Salaires'!J36","v":83.07692307692308},{"$f":"+R21*Q21","v":0}]
[null,null,null,"Formation du personnel du siège du groupe-zone",null,null,null,null,null,null,null,null,null,null," "]
[null,null,null,"Temps des participants du groupe-zone","jours","Personnel niveau intermédiaire",{"$f":"+G119*G116+G120*G117","v":0},0,0,0,0,0,0,0,{"$f":"+G23*$G$12+H23*$H$12+I23*$I$12+J23*$J$12+K23*$K$12+L23*$L$12+M23*$M$12+$N$12*N23","v":0},null,{"$f":"+P23+O23","v":0},{"$f":"+'D5 Salaires'!J25","v":36.92307692307692},{"$f":"+R23*Q23","v":0}]
[null,null,null,"Temps du formateur de niveau intermédiaire au centre pour le personnel du groupe-zones (en supposant une journée de préparation pour chaque jour de classes)","jours","Salaires",null,null,null,null,null,null,null,null,null,{"$f":"2*($P$122*$G$116+$P$123*$G$117)","v":0},{"$f":"+P24+O24","v":0},{"$f":"+'D5 Salaires'!J22","v":55.384615384615387},{"$f":"+R24*Q24","v":0}]
[null,null,null,null,null,"Honoraires",null,null,null,null,null,null,null,null,null,null,null,{"$f":"+'D5 Salaires'!K22","v":50},{"$f":"+R25*Q24","v":0}]
[null,null,null,"Distance parcourue par le personnel du groupe-zone au niveau central","km"," ",{"$f":"2*G128*G118","v":0},{"$f":"2*H128*H118","v":0},0,0,0,0,0,0,{"$f":"+G26*$G$12+H26*$H$12+I26*$I$12+J26*$J$12+K26*$K$12+L26*$L$12+M26*$M$12+$N$12*N26","v":0},null,{"$f":"+P26+O26","v":0},{"$f":"+'D4 Prix'!F72","v":2},{"$f":"+R26*Q26","v":0}]
[null,null,null,"Jours-salle pour la formation au siège central","jours-salle",null,null,null,null,null,null,null,null,null,null,{"$f":"+$P$24/2","v":0},0,{"$f":"+'D4 Prix'!F23","v":120},0]
[null,null,null,"Ensembles de matériel pour formation complète","sets",null,null,null,null,null,null,null,null,null,null,{"$f":"+SUM($G$119:$N$119)","v":0},0,{"$f":"+'D4 Prix'!F69","v":25},0]
[null,null,null,"Ensemble de matériel pour le recyclage","sets",null,null,null,null,null,null,null,null,null,null,{"$f":"+SUM($G$120:$N$120)","v":0},0,{"$f":"+'D4 Prix'!F70","v":5},0]
[null,null,null,"Rafraîchissements pour les participants","personne-jours",null,null,null,null,null,null,null,null,null,null,{"$f":"+SUM($G$23:$N$23)","v":0},0,{"$f":"+'D4 Prix'!F26","v":12},0]
[null,null,null,"Indemnités journalières pour les participants","indemnités journalières",null,null,null,null,null,null,null,null,null,null,{"$f":"+SUM($G$23:$N$23)","v":0},0,{"$f":"+'D4 Prix'!F29","v":0},0]
[null,null,null,"Sous-total pour la formation",null,null,null,null,null,null,null,null,null,null,null,null,null,null,{"$f":"+SUM(S17:S31)","v":0}]
[null,null,null,"Logistique de l'approvisionnement"," ",null,null,null,null,null,null,null,null,null,null,null," "]
[null,null,null,"Distance parcourue par an pour distribuer l'aliment thérapeutique du siège central au siège du groupe-zone","km",null,{"$f":"+IF(G95=\"oui\",2*G128*G126,0)","v":0},{"$f":"+IF(H95=\"oui\",2*H128*H126,0)","v":0},0,0,0,0,0,0,{"$f":"+G34*$G$12+H34*$H$12+I34*$I$12+J34*$J$12+K34*$K$12+L34*$L$12+M34*$M$12+$N$12*N34","v":0},null,{"$f":"+P34+O34","v":0},{"$f":"+'D4 Prix'!F77","v":2},{"$f":"+R34*Q34","v":0}]
[null,null,null,"Temps du chauffeur pour livrer du dépôt du siège central aux magasins du groupe-zones par an","jours","Chauffeur",{"$f":"+IF(G95=\"oui\",2*G129*G126/'D3 Données épi. démo'!$F$35,0)","v":0},{"$f":"+IF(H95=\"oui\",2*H129*H126/'D3 Données épi. démo'!$F$35,0)","v":0},{"$f":"+IF(I95=\"oui\",2*I129*I126/'D3 Données épi. démo'!$F$35,0)","v":0},{"$f":"+IF(J95=\"oui\",2*J129*J126/'D3 Données épi. démo'!$F$35,0)","v":0},{"$f":"+IF(K95=\"oui\",2*K129*K126/'D3 Données épi. démo'!$F$35,0)","v":0},{"$f":"+IF(L95=\"oui\",2*L129*L126/'D3 Données épi. démo'!$F$35,0)","v":0},{"$f":"+IF(M95=\"oui\",2*M129*M126/'D3 Données épi. démo'!$F$35,0)","v":0},{"$f":"+IF(N95=\"oui\",2*N129*N126/'D3 Données épi. démo'!$F$35,0)","v":0},{"$f":"+G35*$G$12+H35*$H$12+I35*$I$12+J35*$J$12+K35*$K$12+L35*$L$12+M35*$M$12+$N$12*N35","v":0},null,0,{"$f":"+'D5 Salaires'!J40","v":6.9230769230769234},0]
[null,null,null,"Volume d'espace nécessaire pour le stockage de l'aliment thérapeutique pour le siège du groupe-zones","m3",null,{"$f":"+G127","v":0},{"$f":"+H127","v":0},0,0,0,0,0,0,{"$f":"+G36*$G$12+H36*$H$12+I36*$I$12+J36*$J$12+K36*$K$12+L36*$L$12+M36*$M$12+$N$12*N36","v":0},null,0,{"$f":"+'D4 Prix'!F27","v":0},0]
[null,null,null,"Nombre de gardiens des magasins du groupe-zones","gardiens","Un gardien par siège du groupe-zones actif plus un au niveau central",{"$f":"+IF(G95=\"oui\",1,0)","v":0},{"$f":"+IF(H95=\"oui\",1,0)","v":0},0,0,0,0,0,0,{"$f":"+G37*$G$12+H37*$H$12+I37*$I$12+J37*$J$12+K37*$K$12+L37*$L$12+M37*$M$12+$N$12*N37","v":0},{"$f":"+'D3 Données épi. démo'!F161","v":1},1,{"$f":"+'D5 Salaires'!H41","v":1200},1200]
[null,null,null,"Nombre de fiches de stock","fiches",null,{"$f":"+G37*'D3 Données épi. démo'!$F$162","v":0},{"$f":"+H37*'D3 Données épi. démo'!$F$162","v":0},{"$f":"+I37*'D3 Données épi. démo'!$F$162","v":0},{"$f":"+J37*'D3 Données épi. démo'!$F$162","v":0},{"$f":"+K37*'D3 Données épi. démo'!$F$162","v":0},{"$f":"+L37*'D3 Données épi. démo'!$F$162","v":0},{"$f":"+M37*'D3 Données épi. démo'!$F$162","v":0},{"$f":"+N37*'D3 Données épi. démo'!$F$162","v":0},{"$f":"+G38*$G$12+H38*$H$12+I38*$I$12+J38*$J$12+K38*$K$12+L38*$L$12+M38*$M$12+$N$12*N38","v":0},{"$f":"+'D3 Données épi. démo'!F162","v":12},12,{"$f":"+'D4 Prix'!F60","v":0.1},1.2000000000000002]
[null,null,null,"Volume d'espace nécessaire pour le stockage des magasins de l'aliment thérapeutique au niveau central (en supposant que le tout vient en une seule livraison annuelle).","m3",null,null,null,null,null,null,null,null,null,null,{"$f":"+SUM(G125:N125)","v":0},0,{"$f":"+'D4 Prix'!F27","v":0},0]
[null,null,null,"Sous-total de la logistique de l'approvisionnement",null,null,null,null,null,null,null,null,null,null,null,null,null,null,{"$f":"+SUM(S34:S39)","v":1201.2}]
[null,null,null,"Gestion des zones par les groupe-zones"]
[null,null,null,"Temps du personnel senior à mettre en place la PCMA dans le groupe-zones","jours","Personnel senior",{"$f":"+IF(G96=\"oui\",G133,0)","v":0},{"$f":"+IF(H96=\"oui\",H133,0)","v":0},0,0,0,0,0,0,{"$f":"+G42*$G$12+H42*$H$12+I42*$I$12+J42*$J$12+K42*$K$12+L42*$L$12+M42*$M$12+$N$12*N42","v":0},null,{"$f":"+P42+O42","v":0},{"$f":"+'D5 Salaires'!J24","v":46.153846153846153},{"$f":"+R42*Q42","v":0}]
[null,null,null,"Personnel niveau intermédiaireà mettre en place la PCMA dans le groupe-zones","jours","Personnel niveau intermédiaire",{"$f":"+IF(G96=\"oui\",G134,0)","v":0},{"$f":"+IF(H96=\"oui\",H134,0)","v":0},0,0,0,0,0,0,{"$f":"+G43*$G$12+H43*$H$12+I43*$I$12+J43*$J$12+K43*$K$12+L43*$L$12+M43*$M$12+$N$12*N43","v":0},null,{"$f":"+P43+O43","v":0},{"$f":"+'D5 Salaires'!J25","v":36.92307692307692},{"$f":"+R43*Q43","v":0}]
[null,null,null,"Personnel niveau intermédiaire à mettre en plqce la PCMA dans les zones nouvelles et établies","jours","Personnel niveau intermédiaire",{"$f":"+G93*G136+G137*G94","v":0},{"$f":"+H93*H136+H137*H94","v":0},0,0,0,0,0,0,{"$f":"+G44*$G$12+H44*$H$12+I44*$I$12+J44*$J$12+K44*$K$12+L44*$L$12+M44*$M$12+$N$12*N44","v":0},null,{"$f":"+P44+O44","v":0},{"$f":"+'D5 Salaires'!J25","v":36.92307692307692},{"$f":"+R44*Q44","v":0}]
[null,null,null,"Fiches de rapport mensuel","fiches",null,{"$f":"+IF(G93+G94=0,0,12*(G93+G94+1))","v":0},{"$f":"+IF(H93+H94=0,0,12*(H93+H94+1))","v":0},0,0,0,0,0,0,{"$f":"+G45*$G$12+H45*$H$12+I45*$I$12+J45*$J$12+K45*$K$12+L45*$L$12+M45*$M$12+$N$12*N45","v":0},null,{"$f":"+O45","v":0},{"$f":"+'D4 Prix'!F33","v":0.3},{"$f":"+R45*Q45","v":0}]
[null,null,null,"Gestion au niveau central - de routine",null,null,null,null,null,null,null,null,null,null,null,null," "]
[null,null,null,"Total temps nécessaire pour la gestion de routine","EPT","Personnel niveau intermédiaire",null,null,null,null,null,null,null,null,null,{"$f":"+P146*5/'D5 Salaires'!I20+P139","v":0.5},{"$f":"+P47+O47","v":0.5},{"$f":"+'D5 Salaires'!H22","v":14400},{"$f":"+R47*Q47","v":7200}]
[null,null,null,"Distance parcourue pour la gestion du groupe-zones","personne-km",null,{"$f":"+IF(G96=\"oui\",2*$P$145*G128,(IF(G95=\"oui\",2*$P$144*G128,0)))","v":0},{"$f":"+IF(H96=\"oui\",2*$P$145*H128,(IF(H95=\"oui\",2*$P$144*H128,0)))","v":0},0,0,0,0,0,0,{"$f":"+G48*$G$12+H48*$H$12+I48*$I$12+J48*$J$12+K48*$K$12+L48*$L$12+M48*$M$12+$N$12*N48","v":0},null,{"$f":"+P48+O48","v":0},{"$f":"+'D4 Prix'!F72","v":2},{"$f":"+R48*Q48","v":0}]
[null,null,null,"Gestion au niveau central - Mise en place de la PCMA  ",null,null,null,null,null,null,null,null,null,null,null,null," "]
[null,null,null,"Temps siège central pour mettre en place la PCMA - mettre au point des directives, aides de travail, matériels et plans de formation, outils de gestion, le système logistique, le système de suivi et de rapport, et les contacts avec les politiques et les bailleurs de fonds.","EPT","Personnel senior",null,null,null,null,null,null,null,null,null,{"$f":"+IF(P97=\"yes\",P148,0)","v":0},{"$f":"+P50+O50","v":0},{"$f":"+'D5 Salaires'!H21","v":18000},{"$f":"+R50*Q50","v":0}]
[null,null,null,null,"EPT","Personnel niveau intermédiaire ",null,null,null,null,null,null,null,null,null,{"$f":"+IF(P97=\"yes\",P149,0)","v":0},{"$f":"+P51+O51","v":0},{"$f":"+'D5 Salaires'!H22","v":14400},{"$f":"+R51*Q51","v":0}]
[null,null,null,"Sous-total pour la gestion",null,null,null,null,null,null,null,null,null,null,null,null,null,null,{"$f":"+SUM(S42:S51)","v":7200}]
[null,null,null,"Total des coûts au niveau du groupe-zones et niveau central",null,null,null,null,null,null,null,null,null,null,null,null,null,null,{"$f":"+S32+S40+S52","v":8401.2000000000007}]
[]
[]
[]
[]
[]
[]
[]
[]
[]
[]
[]
[]
[]
[]
[]
[]
[]
[]
[]
[]
[]
[]
[]
[null,null,null,null,null,null,"Groupe-Zones",null,null,null,null,null,null,null,null,"Niveau central"]
["Haut de page",null,null,"Calculs",null,null,{"$f":"+IF('D1 Données générales'!$G$36=\"\",\"\",'D1 Données générales'!$G$36)","v":"Greater Accra"},{"$f":"+IF('D1 Données générales'!$G$37=\"\",\"\",'D1 Données générales'!$G$37)","v":""},{"$f":"+IF('D1 Données générales'!$G$38=\"\",\"\",'D1 Données générales'!$G$38)","v":""},{"$f":"+IF('D1 Données générales'!$G$39=\"\",\"\",'D1 Données générales'!$G$39)","v":""},{"$f":"+IF('D1 Données générales'!$G$40=\"\",\"\",'D1 Données générales'!$G$40)","v":""},{"$f":"+IF('D1 Données générales'!$G$41=\"\",\"\",'D1 Données générales'!$G$41)","v":""},{"$f":"+IF('D1 Données générales'!$G$42=\"\",\"\",'D1 Données générales'!$G$42)","v":""},{"$f":"+IF('D1 Données générales'!$G$43=\"\",\"\",'D1 Données générales'!$G$43)","v":""}]
[null,null,null,"Variables","Unités","Commentaires",null,null,null,null,null,null,null,null,null,null,null,null,null,null,"active  areas","new areas","Distance from Area to Group-Area","Areas"]
[null,null,null,null,"zones",{"$f":"+'D2 Echelle'!C31","v":"Ashiedu Keteke"},{"$f":"+IF('D2 Echelle'!$D$31=G79,1,0)","v":0},{"$f":"+IF('D2 Echelle'!$D$31=H79,1,0)","v":0},{"$f":"+IF('D2 Echelle'!$D$31=I79,1,0)","v":0},{"$f":"+IF('D2 Echelle'!$D$31=J79,1,0)","v":0},{"$f":"+IF('D2 Echelle'!$D$31=K79,1,0)","v":0},{"$f":"+IF('D2 Echelle'!$D$31=L79,1,0)","v":0},{"$f":"+IF('D2 Echelle'!$D$31=M79,1,0)","v":0},{"$f":"+IF('D2 Echelle'!$D$31=N79,1,0)","v":0},null,null,null,null,null,null,{"$f":"+'D9 Variables temps'!$F$45","v":1},{"$f":"+'D9 Variables temps'!$F$47","v":0},{"$f":"+'D3 Données épi. démo'!$F$127","v":1},1]
[null,null,null,null,null,{"$f":"+'D2 Echelle'!C36","v":0},{"$f":"+IF('D2 Echelle'!$D$36=G79,1,0)","v":1},{"$f":"+IF('D2 Echelle'!$D$36=H79,1,0)","v":1},{"$f":"+IF('D2 Echelle'!$D$36=I79,1,0)","v":1},{"$f":"+IF('D2 Echelle'!$D$36=J79,1,0)","v":1},{"$f":"+IF('D2 Echelle'!$D$36=K79,1,0)","v":1},{"$f":"+IF('D2 Echelle'!$D$36=L79,1,0)","v":1},{"$f":"+IF('D2 Echelle'!$D$36=M79,1,0)","v":1},{"$f":"+IF('D2 Echelle'!$D$36=N79,1,0)","v":1},null,null,null,null,null,null,{"$f":"+'D9 Variables temps'!$J$45","v":0},{"$f":"+'D9 Variables temps'!$J$47","v":0},{"$f":"+'D3 Données épi. démo'!$J$127","v":0},2]
[null,null,null,null,null,{"$f":"+'D2 Echelle'!C41","v":0},{"$f":"+IF('D2 Echelle'!$D$41=G79,1,0)","v":1},{"$f":"+IF('D2 Echelle'!$D$41=H79,1,0)","v":1},{"$f":"+IF('D2 Echelle'!$D$41=I79,1,0)","v":1},{"$f":"+IF('D2 Echelle'!$D$41=J79,1,0)","v":1},{"$f":"+IF('D2 Echelle'!$D$41=K79,1,0)","v":1},{"$f":"+IF('D2 Echelle'!$D$41=L79,1,0)","v":1},{"$f":"+IF('D2 Echelle'!$D$41=M79,1,0)","v":1},{"$f":"+IF('D2 Echelle'!$D$41=N79,1,0)","v":1},null,null,null,null,null,null,{"$f":"+'D9 Variables temps'!$K$45","v":0},{"$f":"+'D9 Variables temps'!$K$47","v":0},{"$f":"+'D3 Données épi. démo'!$K$127","v":0},3]
[null,null,null,null,null,{"$f":"+'D2 Echelle'!C46","v":0},{"$f":"+IF('D2 Echelle'!$D$46=G79,1,0)","v":1},{"$f":"+IF('D2 Echelle'!$D$46=H79,1,0)","v":1},{"$f":"+IF('D2 Echelle'!$D$46=I79,1,0)","v":1},{"$f":"+IF('D2 Echelle'!$D$46=J79,1,0)","v":1},{"$f":"+IF('D2 Echelle'!$D$46=K79,1,0)","v":1},{"$f":"+IF('D2 Echelle'!$D$46=L79,1,0)","v":1},{"$f":"+IF('D2 Echelle'!$D$46=M79,1,0)","v":1},{"$f":"+IF('D2 Echelle'!$D$46=N79,1,0)","v":1},null,null,null,null,null,null,{"$f":"+'D9 Variables temps'!$L$45","v":0},{"$f":"+'D9 Variables temps'!$L$47","v":0},{"$f":"+'D3 Données épi. démo'!$L$127","v":0},4]
[null,null,null,null,null,{"$f":"+'D2 Echelle'!C51","v":0},{"$f":"+IF('D2 Echelle'!$D$51=G79,1,0)","v":1},{"$f":"+IF('D2 Echelle'!$D$51=H79,1,0)","v":1},{"$f":"+IF('D2 Echelle'!$D$51=I79,1,0)","v":1},{"$f":"+IF('D2 Echelle'!$D$51=J79,1,0)","v":1},{"$f":"+IF('D2 Echelle'!$D$51=K79,1,0)","v":1},{"$f":"+IF('D2 Echelle'!$D$51=L79,1,0)","v":1},{"$f":"+IF('D2 Echelle'!$D$51=M79,1,0)","v":1},{"$f":"+IF('D2 Echelle'!$D$51=N79,1,0)","v":1},null,null,null,null,null,null,{"$f":"+'D9 Variables temps'!$M$45","v":0},{"$f":"+'D9 Variables temps'!$M$47","v":0},{"$f":"+'D3 Données épi. démo'!$M$127","v":0},5]
[null,null,null,null,null,{"$f":"+'D2 Echelle'!C56","v":0},{"$f":"+IF('D2 Echelle'!$D$56=G79,1,0)","v":1},{"$f":"+IF('D2 Echelle'!$D$56=H79,1,0)","v":1},{"$f":"+IF('D2 Echelle'!$D$56=I79,1,0)","v":1},{"$f":"+IF('D2 Echelle'!$D$56=J79,1,0)","v":1},{"$f":"+IF('D2 Echelle'!$D$56=K79,1,0)","v":1},{"$f":"+IF('D2 Echelle'!$D$56=L79,1,0)","v":1},{"$f":"+IF('D2 Echelle'!$D$56=M79,1,0)","v":1},{"$f":"+IF('D2 Echelle'!$D$56=N79,1,0)","v":1},null,null,null,null,null,null,{"$f":"+'D9 Variables temps'!$N$45","v":0},{"$f":"+'D9 Variables temps'!$N$47","v":0},{"$f":"+'D3 Données épi. démo'!$N$127","v":0},6]
[null,null,null,null,null,{"$f":"+'D2 Echelle'!C61","v":0},{"$f":"+IF('D2 Echelle'!$D$61=G79,1,0)","v":1},{"$f":"+IF('D2 Echelle'!$D$61=H79,1,0)","v":1},{"$f":"+IF('D2 Echelle'!$D$61=I79,1,0)","v":1},{"$f":"+IF('D2 Echelle'!$D$61=J79,1,0)","v":1},{"$f":"+IF('D2 Echelle'!$D$61=K79,1,0)","v":1},{"$f":"+IF('D2 Echelle'!$D$61=L79,1,0)","v":1},{"$f":"+IF('D2 Echelle'!$D$61=M79,1,0)","v":1},{"$f":"+IF('D2 Echelle'!$D$61=N79,1,0)","v":1},null,null,null,null,null,null,{"$f":"+'D9 Variables temps'!$O$45","v":0},{"$f":"+'D9 Variables temps'!$O$47","v":0},{"$f":"+'D3 Données épi. démo'!$O$127","v":0},7]
[null,null,null,null,null,{"$f":"+'D2 Echelle'!C66","v":0},{"$f":"+IF('D2 Echelle'!$D$66=G79,1,0)","v":1},{"$f":"+IF('D2 Echelle'!$D$66=H79,1,0)","v":1},{"$f":"+IF('D2 Echelle'!$D$66=I79,1,0)","v":1},{"$f":"+IF('D2 Echelle'!$D$66=J79,1,0)","v":1},{"$f":"+IF('D2 Echelle'!$D$66=K79,1,0)","v":1},{"$f":"+IF('D2 Echelle'!$D$66=L79,1,0)","v":1},{"$f":"+IF('D2 Echelle'!$D$66=M79,1,0)","v":1},{"$f":"+IF('D2 Echelle'!$D$66=N79,1,0)","v":1},null,null,null,null,null,null,{"$f":"+'D9 Variables temps'!$P$45","v":0},{"$f":"+'D9 Variables temps'!$P$47","v":0},{"$f":"+'D3 Données épi. démo'!$P$127","v":0},8]
[null,null,null,null,null,{"$f":"+'D2 Echelle'!C71","v":0},{"$f":"+IF('D2 Echelle'!$D$71=G79,1,0)","v":1},{"$f":"+IF('D2 Echelle'!$D$71=H79,1,0)","v":1},{"$f":"+IF('D2 Echelle'!$D$71=I79,1,0)","v":1},{"$f":"+IF('D2 Echelle'!$D$71=J79,1,0)","v":1},{"$f":"+IF('D2 Echelle'!$D$71=K79,1,0)","v":1},{"$f":"+IF('D2 Echelle'!$D$71=L79,1,0)","v":1},{"$f":"+IF('D2 Echelle'!$D$71=M79,1,0)","v":1},{"$f":"+IF('D2 Echelle'!$D$71=N79,1,0)","v":1},null,null,null,null,null,null,{"$f":"+'D9 Variables temps'!$Q$45","v":0},{"$f":"+'D9 Variables temps'!$Q$47","v":0},{"$f":"+'D3 Données épi. démo'!$Q$127","v":0},9]
[null,null,null,null,null,{"$f":"+'D2 Echelle'!C76","v":0},{"$f":"+IF('D2 Echelle'!$D$76=G79,1,0)","v":1},{"$f":"+IF('D2 Echelle'!$D$76=H79,1,0)","v":1},{"$f":"+IF('D2 Echelle'!$D$76=I79,1,0)","v":1},{"$f":"+IF('D2 Echelle'!$D$76=J79,1,0)","v":1},{"$f":"+IF('D2 Echelle'!$D$76=K79,1,0)","v":1},{"$f":"+IF('D2 Echelle'!$D$76=L79,1,0)","v":1},{"$f":"+IF('D2 Echelle'!$D$76=M79,1,0)","v":1},{"$f":"+IF('D2 Echelle'!$D$76=N79,1,0)","v":1},null,null,null,null,null,null,{"$f":"+'D9 Variables temps'!$R$45","v":0},{"$f":"+'D9 Variables temps'!$R$47","v":0},{"$f":"+'D3 Données épi. démo'!$R$127","v":0},10]
[null,null,null,"Distance du siège aux zones actives du groupe-zones","km",null,{"$f":"+G80*$U$80*$W$80+G81*$U$81*$W$81+G82*$U$82*$W$82+G83*$U$83*$W$83+G84*$U$84*$W$84+G85*$U$85*$W$85+G86*$U$86*$W$86+G87*$U$87*$W$87+G88*$U$88*$W$88*+$W$89*$U$89*G89","v":0},{"$f":"+H80*$U$80*$W$80+H81*$U$81*$W$81+H82*$U$82*$W$82+H83*$U$83*$W$83+H84*$U$84*$W$84+H85*$U$85*$W$85+H86*$U$86*$W$86+H87*$U$87*$W$87+H88*$U$88*$W$88*+$W$89*$U$89*H89","v":0},0,0,0,0,0,0]
[null,null,null,"Distance du siège aux nouvelles zones du groupe-zones","km",null,{"$f":"+G80*$V$80*$W$80+G81*$V$81*$W$81+G82*$V$82*$W$82+G83*$V$83*$W$83+G84*$V$84*$W$84+G85*$V$85*$W$85+G86*$V$86*$W$86+G87*$V$87*$W$87+G88*$V$88*$W$88+G89*$V$89*$W$89","v":0},{"$f":"+H80*$V$80*$W$80+H81*$V$81*$W$81+H82*$V$82*$W$82+H83*$V$83*$W$83+H84*$V$84*$W$84+H85*$V$85*$W$85+H86*$V$86*$W$86+H87*$V$87*$W$87+H88*$V$88*$W$88+H89*$V$89*$W$89","v":0},0,0,0,0,0,0]
[null,null,null,"Distance aux zones établies dans le groupe-zones","km",null,{"$f":"+G90-G91","v":0},{"$f":"+H90-H91","v":0},0,0,0,0,0,0]
[null,null,null,"Nombre de nouvelles zones dans le groupe-zones","zones",null,{"$f":"+$G$80*$V$80+$G$81*$V$81+$G$82*$V$82+$G$83*$V$83+$G$84*$V$84+$G$85*$V$85+$G$86*$V$86+$G$87*$V$87+$G$88*$V$88+$G$89*$V$89","v":0},{"$f":"+H80*$V$80+H81*$V$81+H82*$V$82+H83*$V$83+H84*$V$84+H85*$V$85+H86*$V$86+H87*$V$87+H88*$V$88+H89*$V$89","v":0},0,0,0,0,0,0]
[null,null,null,"Nombre de zones établies dans le groupe-zones","zones",null,{"$f":"+G80*($U$80-$V$80)+G81*($U$81-$V$81)+G$82*($U$82-$V$82)+G$83*($U$83-$V$83)+G$84*($U$84-$V$84)+G$85*($U$85-$V$85)+G$86*($U$86-$V$86)+G$87*($U$87-$V$87)+G$88*($U$88-$V$88)+G$89*($U$89-$V$89)","v":0},{"$f":"+H80*($U$80-$V$80)+H81*($U$81-$V$81)+H$82*($U$82-$V$82)+H$83*($U$83-$V$83)+H$84*($U$84-$V$84)+H$85*($U$85-$V$85)+H$86*($U$86-$V$86)+H$87*($U$87-$V$87)+H$88*($U$88-$V$88)+H$89*($U$89-$V$89)","v":0},{"$f":"+I80*($U$80-$V$80)+I81*($U$81-$V$81)+I$82*($U$82-$V$82)+I$83*($U$83-$V$83)+I$84*($U$84-$V$84)+I$85*($U$85-$V$85)+I$86*($U$86-$V$86)+I$87*($U$87-$V$87)+I$88*($U$88-$V$88)+I$89*($U$89-$V$89)","v":0},0,0,0,0,0]
[null,null,null,"Le groupe-zones est-il actif dans la PCMA ?",null,null,{"$f":"+IF(G93+G94>0,\"oui\",\"non\")","v":"non"},{"$f":"+IF(H93+H94>0,\"oui\",\"non\")","v":"non"},"non","non","non","non","non","non","non"]
[null,null,null,"La PCMA est-elle nouvelle dans le groupe-zones ?",null,null,{"$f":"IF(AND(G93>0,G94=0),\"oui\",\"non\")","v":"non"},{"$f":"+IF(AND(H93>0,H94=0),\"oui\",\"non\")","v":"non"},{"$f":"+IF(AND(I93>0,I94=0),\"oui\",\"non\")","v":"non"},"non","non","non","non","non","non"]
[null,null,null,"Est-ce la première année de la PCMA ?",null,null,{"$f":"+'D1 Données générales'!G45","v":"oui"},null,null,null,null,null,null,null,null,{"$f":"+IF(AND('D1 Données générales'!$G$45=\"no\",'D9 Variables temps'!$I$10=1),\"yes\",\"no\")","v":"no"}]
[null,null,null,"Taille maximum du groupe en formation au siège de la zone","participants",null,{"$f":"+'D3 Données épi. démo'!$F$168","v":20},{"$f":"+'D3 Données épi. démo'!$F$168","v":20},{"$f":"+'D3 Données épi. démo'!$F$168","v":20},{"$f":"+'D3 Données épi. démo'!$F$168","v":20},{"$f":"+'D3 Données épi. démo'!$F$168","v":20},{"$f":"+'D3 Données épi. démo'!$F$168","v":20},{"$f":"+'D3 Données épi. démo'!$F$168","v":20},{"$f":"+'D3 Données épi. démo'!$F$168","v":20}]
[null,null,null,"Nombre de personnel à former des nouvelles zones par nouvelle zone","personnel",null,{"$f":"+'D3 Données épi. démo'!$F$164","v":4},{"$f":"+'D3 Données épi. démo'!$F$164","v":4},{"$f":"+'D3 Données épi. démo'!$F$164","v":4},{"$f":"+'D3 Données épi. démo'!$F$164","v":4},{"$f":"+'D3 Données épi. démo'!$F$164","v":4},{"$f":"+'D3 Données épi. démo'!$F$164","v":4},{"$f":"+'D3 Données épi. démo'!$F$164","v":4},{"$f":"+'D3 Données épi. démo'!$F$164","v":4}]
[null,null,null,"Nombre  de personnel à former dans les zones établies par zone établie","personnel",null,{"$f":"+'D3 Données épi. démo'!$F$165","v":2},{"$f":"+'D3 Données épi. démo'!$F$165","v":2},{"$f":"+'D3 Données épi. démo'!$F$165","v":2},{"$f":"+'D3 Données épi. démo'!$F$165","v":2},{"$f":"+'D3 Données épi. démo'!$F$165","v":2},{"$f":"+'D3 Données épi. démo'!$F$165","v":2},{"$f":"+'D3 Données épi. démo'!$F$165","v":2},{"$f":"+'D3 Données épi. démo'!$F$165","v":2}]
[null,null,null,"Durée de la formation du personnel du siège des nouvelles zones","jours",null,{"$f":"+'D3 Données épi. démo'!$F$166","v":5},{"$f":"+'D3 Données épi. démo'!$F$166","v":5},{"$f":"+'D3 Données épi. démo'!$F$166","v":5},{"$f":"+'D3 Données épi. démo'!$F$166","v":5},{"$f":"+'D3 Données épi. démo'!$F$166","v":5},{"$f":"+'D3 Données épi. démo'!$F$166","v":5},{"$f":"+'D3 Données épi. démo'!$F$166","v":5},{"$f":"+'D3 Données épi. démo'!$F$166","v":5}]
[null,null,null,"Durée de la formation du personnel du siège des zones établies","jours",null,{"$f":"+'D3 Données épi. démo'!$F$167","v":1},{"$f":"+'D3 Données épi. démo'!$F$167","v":1},{"$f":"+'D3 Données épi. démo'!$F$167","v":1},{"$f":"+'D3 Données épi. démo'!$F$167","v":1},{"$f":"+'D3 Données épi. démo'!$F$167","v":1},{"$f":"+'D3 Données épi. démo'!$F$167","v":1},{"$f":"+'D3 Données épi. démo'!$F$167","v":1},{"$f":"+'D3 Données épi. démo'!$F$167","v":1}]
[null,null,null,"Nombre du personnel du siège de la zone dans ce groupe-zones qui a besoin d'une formation complète (à savoir, personnel des nouvelles zones).","personnel",null,{"$f":"+G93*G99","v":0},0,0,0,0,0,0,0]
[null,null,null,"Nombre de personnel du siège de la zone dans ce groupe-zones qui a besoin d'un recyclage (à savoir, personnel des zones établies).","personnel",null,0,0,0,0,0,0,0,0]
[null,null,null,"Nombre de groupes du siège de la zone ayant besoin d' une formation complète","groupes",null,{"$f":"+ROUNDUP(G103/G98,0)","v":0},0,0,0,0,0,0,0]
[null,null,null,"Nombre de groupes du siège de la zone ayant besoin d' un recyclage","groupes",null,{"$f":"+ROUNDUP(G104/G98,0)","v":0},0,0,0,0,0,0,0]
[null,null,null,"Formation du personnel du siège de la zone (voir R12 pour les autres coûts)"]
[null,null,null,"Jours du formateur du groupe-zones pour le personnel du siège de la zone, pour une formation complète","jours","Deux fois la durée de la formation pour laisser le temps à la préparation.",{"$f":"2*(G101*G105)","v":0},0,0,0,0,0,0,0]
[null,null,null,"Jours du formateur du groupe-zones pour le personnel du siège de la zone, pour une formation de recyclage","jours","Deux fois la durée de la formation pour laisser le temps à la préparation.",{"$f":"2*G106*G102","v":0},0,0,0,0,0,0,0]
[null,null,null,"Formation des formateurs "]
[null,null,null,"Nombre du personnel de la PCMA formé dans chaque nouveau groupe-zones pour être des formateurs (à savoir, des formateurs d'autres membres du personnel de la PCMA)","personnel",null,{"$f":"+'D8 Statistiques'!G31","v":8},{"$f":"+'D8 Statistiques'!H31","v":0},{"$f":"+'D8 Statistiques'!I31","v":0},{"$f":"+'D8 Statistiques'!J31","v":0},{"$f":"+'D8 Statistiques'!K31","v":0},{"$f":"+'D8 Statistiques'!L31","v":0},{"$f":"+'D8 Statistiques'!M31","v":0},{"$f":"+'D8 Statistiques'!N31","v":0}]
[null,null,null,"Nombre de jours de la formation des formateurs","jours",null,{"$f":"+'D8 Statistiques'!G32","v":4},{"$f":"+'D8 Statistiques'!H32","v":0},{"$f":"+'D8 Statistiques'!I32","v":0},{"$f":"+'D8 Statistiques'!J32","v":0},{"$f":"+'D8 Statistiques'!K32","v":0},{"$f":"+'D8 Statistiques'!L32","v":0},{"$f":"+'D8 Statistiques'!M32","v":0},{"$f":"+'D8 Statistiques'!N32","v":0}]
[null,null,null,"Formation du personnel du siège du groupe-zones"]
[null,null,null,"Nombre de personnel à former de chaque nouveau groupe-zones","personnel","Personnel niveau intermédiaire",{"$f":"+'D8 Statistiques'!G24","v":2},{"$f":"+'D8 Statistiques'!H24","v":0},{"$f":"+'D8 Statistiques'!I24","v":0},{"$f":"+'D8 Statistiques'!J24","v":0},{"$f":"+'D8 Statistiques'!K24","v":0},{"$f":"+'D8 Statistiques'!L24","v":0},{"$f":"+'D8 Statistiques'!M24","v":0},{"$f":"+'D8 Statistiques'!N24","v":0}]
[null,null,null,"Nombre de personnel à recycler de chaque groupe-zones établi","personnel","Personnel niveau intermédiaire",{"$f":"+'D8 Statistiques'!G25","v":2},{"$f":"+'D8 Statistiques'!H25","v":0},{"$f":"+'D8 Statistiques'!I25","v":0},{"$f":"+'D8 Statistiques'!J25","v":0},{"$f":"+'D8 Statistiques'!K25","v":0},{"$f":"+'D8 Statistiques'!L25","v":0},{"$f":"+'D8 Statistiques'!M25","v":0},{"$f":"+'D8 Statistiques'!N25","v":0}]
[null,null,null,"Durée de la formation du personnel du nouveau groupe-zones  (formation des formateurs)","jours"," ",{"$f":"+'D8 Statistiques'!G26","v":10},{"$f":"+'D8 Statistiques'!H26","v":0},{"$f":"+'D8 Statistiques'!I26","v":0},{"$f":"+'D8 Statistiques'!J26","v":0},{"$f":"+'D8 Statistiques'!K26","v":0},{"$f":"+'D8 Statistiques'!L26","v":0},{"$f":"+'D8 Statistiques'!M26","v":0},{"$f":"+'D8 Statistiques'!N26","v":0}]
[null,null,null,"Durée de la formation du personnel du groupe-zones établi","jours"," ",{"$f":"+'D8 Statistiques'!G27","v":2},{"$f":"+'D8 Statistiques'!H27","v":0},{"$f":"+'D8 Statistiques'!I27","v":0},{"$f":"+'D8 Statistiques'!J27","v":0},{"$f":"+'D8 Statistiques'!K27","v":0},{"$f":"+'D8 Statistiques'!L27","v":0},{"$f":"+'D8 Statistiques'!M27","v":0},{"$f":"+'D8 Statistiques'!N27","v":0}]
[null,null,null,"Nombre de voyages retour par les participants à la formation au siège central et retour au siège du groupe-zones","km","Si les participants restent pendant la nuit, nombre de voyages de retour  =nombre de participants ; Si non = participants complets * jours complets + participants recyclage *jours de recyclage.",{"$f":"+IF('D8 Statistiques'!F29=\"restent la nuit\",G119+G120,G119*G116+G120*G117)","v":0},{"$f":"+IF('D8 Statistiques'!G29=\"restent la nuit\",H119+H120,H119*H116+H120*H117)","v":0},{"$f":"+IF('D8 Statistiques'!H29=\"restent la nuit\",I119+I120,I119*I116+I120*I117)","v":0},{"$f":"+IF('D8 Statistiques'!I29=\"restent la nuit\",J119+J120,J119*J116+J120*J117)","v":0},{"$f":"+IF('D8 Statistiques'!J29=\"restent la nuit\",K119+K120,K119*K116+K120*K117)","v":0},{"$f":"+IF('D8 Statistiques'!K29=\"restent la nuit\",L119+L120,L119*L116+L120*L117)","v":0},{"$f":"+IF('D8 Statistiques'!L29=\"restent la nuit\",M119+M120,M119*M116+M120*M117)","v":0},{"$f":"+IF('D8 Statistiques'!M29=\"restent la nuit\",N119+N120,N119*N116+N120*N117)","v":0},{"$f":"+IF('D8 Statistiques'!N29=\"restent la nuit\",O119+O120,O119*O116+O120*O117)","v":0}]
[null,null,null,"Nombre de participants pour la formation complète du groupe-zones","participants",null,{"$f":"+IF(G96=\"oui\",G114,0)","v":0},{"$f":"+IF(H96=\"oui\",H114,0)","v":0},0,0,0,0,0,0,0]
[null,null,null,"Nombre de participants pour le recyclage du groupe-zones","participants",null,{"$f":"+IF(AND(G95=\"oui\",G96=\"non\"),G115,0)","v":0},{"$f":"+IF(AND(H95=\"oui\",H96=\"non\"),H115,0)","v":0},0,0,0,0,0,0,0]
[null,null,null,"Taille maximum des classes de participants pour le personnel du groupe-zones","participants",null,{"$f":"+'D8 Statistiques'!G28","v":20},{"$f":"+'D8 Statistiques'!H28","v":0},{"$f":"+'D8 Statistiques'!I28","v":0},{"$f":"+'D8 Statistiques'!J28","v":0},{"$f":"+'D8 Statistiques'!K28","v":0},{"$f":"+'D8 Statistiques'!L28","v":0},{"$f":"+'D8 Statistiques'!M28","v":0},{"$f":"+'D8 Statistiques'!N28","v":0}]
[null,null,null,"Nombre de classes du personnel du groupe-zones nécessitant une formation complète","classes",null,null,null,null,null,null,null,null,null,null,{"$f":"+ROUNDUP(($G$119+$H$119+$I$119+$J$119+$K$119+$L$119+$M$119+$N$119)/$G$121,0)","v":0}]
[null,null,null,"Nombre de classes du personnel du groupe-zones nécessitant un recyclage","classes",null,null,null,null,null,null,null,null,null,null,{"$f":"+ROUNDUP(($G$120+$H$120+$I$120+$J$120+$K$120+$L$120+$M$120+$N$120)/$G$121,0)","v":0}]
[null,null,null,"Logistique de l'approvisionnement"]
[null,null,null,"Espace occupé par les besoins annuels en aliment thérapeutique du groupe-zones","m3","La somme des zones occupées par l'aliment thérapeutique dans les zones actives.",{"$f":"+G80*'R11 Logistique approvisionnemen'!$F$99+G81*'R11 Logistique approvisionnemen'!$J$99+G82*'R11 Logistique approvisionnemen'!$K$99+G83*'R11 Logistique approvisionnemen'!$L$99+G84*'R11 Logistique approvisionnemen'!$M$99+G85*'R11 Logistique approvisionnemen'!$N$99+G86*'R11 Logistique approvisionnemen'!$O$99+G87*'R11 Logistique approvisionnemen'!$P$99+G88*'R11 Logistique approvisionnemen'!$Q$99+G89*'R11 Logistique approvisionnemen'!$R$99","v":0},{"$f":"+H80*'R11 Logistique approvisionnemen'!$F$99+H81*'R11 Logistique approvisionnemen'!$J$99+H82*'R11 Logistique approvisionnemen'!$K$99+H83*'R11 Logistique approvisionnemen'!$L$99+H84*'R11 Logistique approvisionnemen'!$M$99+H85*'R11 Logistique approvisionnemen'!$N$99+H86*'R11 Logistique approvisionnemen'!$O$99+H87*'R11 Logistique approvisionnemen'!$P$99+H88*'R11 Logistique approvisionnemen'!$Q$99+H89*'R11 Logistique approvisionnemen'!$R$99","v":0},{"$f":"+I80*'R11 Logistique approvisionnemen'!$F$99+I81*'R11 Logistique approvisionnemen'!$J$99+I82*'R11 Logistique approvisionnemen'!$K$99+I83*'R11 Logistique approvisionnemen'!$L$99+I84*'R11 Logistique approvisionnemen'!$M$99+I85*'R11 Logistique approvisionnemen'!$N$99+I86*'R11 Logistique approvisionnemen'!$O$99+I87*'R11 Logistique approvisionnemen'!$P$99+I88*'R11 Logistique approvisionnemen'!$Q$99+I89*'R11 Logistique approvisionnemen'!$R$99","v":0},{"$f":"+J80*'R11 Logistique approvisionnemen'!$F$99+J81*'R11 Logistique approvisionnemen'!$J$99+J82*'R11 Logistique approvisionnemen'!$K$99+J83*'R11 Logistique approvisionnemen'!$L$99+J84*'R11 Logistique approvisionnemen'!$M$99+J85*'R11 Logistique approvisionnemen'!$N$99+J86*'R11 Logistique approvisionnemen'!$O$99+J87*'R11 Logistique approvisionnemen'!$P$99+J88*'R11 Logistique approvisionnemen'!$Q$99+J89*'R11 Logistique approvisionnemen'!$R$99","v":0},{"$f":"+K80*'R11 Logistique approvisionnemen'!$F$99+K81*'R11 Logistique approvisionnemen'!$J$99+K82*'R11 Logistique approvisionnemen'!$K$99+K83*'R11 Logistique approvisionnemen'!$L$99+K84*'R11 Logistique approvisionnemen'!$M$99+K85*'R11 Logistique approvisionnemen'!$N$99+K86*'R11 Logistique approvisionnemen'!$O$99+K87*'R11 Logistique approvisionnemen'!$P$99+K88*'R11 Logistique approvisionnemen'!$Q$99+K89*'R11 Logistique approvisionnemen'!$R$99","v":0},{"$f":"+L80*'R11 Logistique approvisionnemen'!$F$99+L81*'R11 Logistique approvisionnemen'!$J$99+L82*'R11 Logistique approvisionnemen'!$K$99+L83*'R11 Logistique approvisionnemen'!$L$99+L84*'R11 Logistique approvisionnemen'!$M$99+L85*'R11 Logistique approvisionnemen'!$N$99+L86*'R11 Logistique approvisionnemen'!$O$99+L87*'R11 Logistique approvisionnemen'!$P$99+L88*'R11 Logistique approvisionnemen'!$Q$99+L89*'R11 Logistique approvisionnemen'!$R$99","v":0},{"$f":"+M80*'R11 Logistique approvisionnemen'!$F$99+M81*'R11 Logistique approvisionnemen'!$J$99+M82*'R11 Logistique approvisionnemen'!$K$99+M83*'R11 Logistique approvisionnemen'!$L$99+M84*'R11 Logistique approvisionnemen'!$M$99+M85*'R11 Logistique approvisionnemen'!$N$99+M86*'R11 Logistique approvisionnemen'!$O$99+M87*'R11 Logistique approvisionnemen'!$P$99+M88*'R11 Logistique approvisionnemen'!$Q$99+M89*'R11 Logistique approvisionnemen'!$R$99","v":0},{"$f":"+N80*'R11 Logistique approvisionnemen'!$F$99+N81*'R11 Logistique approvisionnemen'!$J$99+N82*'R11 Logistique approvisionnemen'!$K$99+N83*'R11 Logistique approvisionnemen'!$L$99+N84*'R11 Logistique approvisionnemen'!$M$99+N85*'R11 Logistique approvisionnemen'!$N$99+N86*'R11 Logistique approvisionnemen'!$O$99+N87*'R11 Logistique approvisionnemen'!$P$99+N88*'R11 Logistique approvisionnemen'!$Q$99+N89*'R11 Logistique approvisionnemen'!$R$99","v":0}]
[null,null,null,"Nombre de livraisons par an au groupe-zones","deliveries",null,{"$f":"+'D9 Variables temps'!F50","v":4},{"$f":"+'D9 Variables temps'!F51","v":0},{"$f":"+'D9 Variables temps'!F52","v":0},{"$f":"+'D9 Variables temps'!F53","v":0},{"$f":"+'D9 Variables temps'!F54","v":0},{"$f":"+'D9 Variables temps'!F55","v":0},{"$f":"+'D9 Variables temps'!F56","v":0},{"$f":"+'D9 Variables temps'!F57","v":0}]
[null,null,null,"Espace occupé par la livraison moyenne de l'aliment thérapeutique au groupe-zones.","m3",null,{"$f":"+IF(G126=0,0,G125/G126)","v":0},{"$f":"+IF(H126=0,0,H125/H126)","v":0},0,0,0,0,0,0]
[null,null,null,"Distance du siège du groupe-zones au siège central","km",null,{"$f":"+'D8 Statistiques'!G34","v":5},{"$f":"+'D8 Statistiques'!H34","v":0},{"$f":"+'D8 Statistiques'!I34","v":0},{"$f":"+'D8 Statistiques'!J34","v":0},{"$f":"+'D8 Statistiques'!K34","v":0},{"$f":"+'D8 Statistiques'!L34","v":0},{"$f":"+'D8 Statistiques'!M34","v":0},{"$f":"+'D8 Statistiques'!N34","v":0}]
[null,null,null,"Temps pour conduire du siège central au siège du groupe-zones","hours",null,{"$f":"+'D8 Statistiques'!G35","v":0.25},{"$f":"+'D8 Statistiques'!H35","v":0},{"$f":"+'D8 Statistiques'!I35","v":0},{"$f":"+'D8 Statistiques'!J35","v":0},{"$f":"+'D8 Statistiques'!K35","v":0},{"$f":"+'D8 Statistiques'!L35","v":0},{"$f":"+'D8 Statistiques'!M35","v":0},{"$f":"+'D8 Statistiques'!N35","v":0}]
[null,null,null,"Taille du véhicule transportant l'aliment thérapeutique du siège central aux magasins du groupe-zones","m3",null,{"$f":"+'D8 Statistiques'!G36","v":15},{"$f":"+'D8 Statistiques'!H36","v":0},{"$f":"+'D8 Statistiques'!I36","v":0},{"$f":"+'D8 Statistiques'!J36","v":0},{"$f":"+'D8 Statistiques'!K36","v":0},{"$f":"+'D8 Statistiques'!L36","v":0},{"$f":"+'D8 Statistiques'!M36","v":0},{"$f":"+'D8 Statistiques'!N36","v":0}]
[null,null,null,"Taille de l'espace pour stocker l'aliment thérapeutique dans le magasin du groupe-zones.","m3",null,{"$f":"+'D8 Statistiques'!G37","v":50},{"$f":"+'D8 Statistiques'!H37","v":0},{"$f":"+'D8 Statistiques'!I37","v":0},{"$f":"+'D8 Statistiques'!J37","v":0},{"$f":"+'D8 Statistiques'!K37","v":0},{"$f":"+'D8 Statistiques'!L37","v":0},{"$f":"+'D8 Statistiques'!M37","v":0},{"$f":"+'D8 Statistiques'!N37","v":0}]
[null,null,null,"Gestion des zones par le groupe-zones"]
[null,null,null,"Temps nécessaire au siège du groupe-zones pour mettre en place la PCMA dans un groupe-zones où la PCMA est nouvelle (plaidoyer, planification, mise au point de systèmes, budgétisation) par an.","jours","Personnel senior",{"$f":"+'D8 Statistiques'!G39","v":20},{"$f":"+'D8 Statistiques'!H39","v":0},{"$f":"+'D8 Statistiques'!I39","v":0},{"$f":"+'D8 Statistiques'!J39","v":0},{"$f":"+'D8 Statistiques'!K39","v":0},{"$f":"+'D8 Statistiques'!L39","v":0},{"$f":"+'D8 Statistiques'!M39","v":0},{"$f":"+'D8 Statistiques'!N39","v":0}]
[null,null,null,"Temps nécessaire au siège du groupe-zones pour mettre en place la PCMA dans un groupe-zones où la PCMA est nouvelle (plaidoyer, planification, mise au point de systèmes, budgétisation) par an.","jours","Personnel niveau intermédiaire",{"$f":"+'D8 Statistiques'!G40","v":20},{"$f":"+'D8 Statistiques'!H40","v":0},{"$f":"+'D8 Statistiques'!I40","v":0},{"$f":"+'D8 Statistiques'!J40","v":0},{"$f":"+'D8 Statistiques'!K40","v":0},{"$f":"+'D8 Statistiques'!L40","v":0},{"$f":"+'D8 Statistiques'!M40","v":0},{"$f":"+'D8 Statistiques'!N40","v":0}]
[null,null,null,"Temps nécessaire au siège du groupe-zones pour la gestion de routine (des zones nouvelles ou établies) (logistique, résolution de problèmes, suivi et de rapport). "]
[null,null,null,"Pour chaque nouvelle zone (par an)","jours","Personnel niveau intermédiaire",{"$f":"+'D8 Statistiques'!G42","v":20},{"$f":"+'D8 Statistiques'!H42","v":0},{"$f":"+'D8 Statistiques'!I42","v":0},{"$f":"+'D8 Statistiques'!J42","v":0},{"$f":"+'D8 Statistiques'!K42","v":0},{"$f":"+'D8 Statistiques'!L42","v":0},{"$f":"+'D8 Statistiques'!M42","v":0},{"$f":"+'D8 Statistiques'!N42","v":0}]
[null,null,null,"Pour chaque zone établie (par an)","jours","Personnel niveau intermédiaire",{"$f":"+'D8 Statistiques'!G43","v":5},{"$f":"+'D8 Statistiques'!H43","v":0},{"$f":"+'D8 Statistiques'!I43","v":0},{"$f":"+'D8 Statistiques'!J43","v":0},{"$f":"+'D8 Statistiques'!K43","v":0},{"$f":"+'D8 Statistiques'!L43","v":0},{"$f":"+'D8 Statistiques'!M43","v":0},{"$f":"+'D8 Statistiques'!N43","v":0}]
[null,null,null,"Niveau central - Gestion de routine"]
[null,null,null,"Temps nécessaire pour les activités de gestion centrale (plaidoyer, planification, et obtention du financement nécessaire) qui sont largement indépendantes du nombre/de la taille/et du caractère nouveau du groupe-zones participant.","EPT","Personnel niveau intermédiaire"," ",null,null,null,null,null,null,null,null,{"$f":"+'D8 Statistiques'!F45","v":0.5}]
[null,null,null,"Temps nécessaire pour les activités de gestion centrales (la logistique, résolution de problèmes, suivi et rapport) qui augmentent avec la taille/le nombre/caractère nouveau du groupe-zones participant.  "]
[null,null,null,"Pour chaque groupe-zones établi par an","jours","Personnel niveau intermédiaire"," ",null,null,null,null,null,null,null,null,{"$f":"+'D8 Statistiques'!F47","v":5}]
[null,null,null,"Pour chaque nouveau groupe-zones par an","jours","Personnel niveau intermédiaire"," ",null,null,null,null,null,null,null,null,{"$f":"+'D8 Statistiques'!F48","v":20}]
[null,null,null,"Déplacement dans les zones "]
[null,null,null,"Pour chaque groupe-zones établi par an","visits","Personnel niveau intermédiaire",null,null,null,null,null,null,null,null,null,{"$f":"+'D8 Statistiques'!F50","v":1}]
[null,null,null,"Pour chaque nouveau groupe-zones par an","visits","Personnel niveau intermédiaire",null,null,null,null,null,null,null,null,null,{"$f":"+'D8 Statistiques'!F51","v":4}]
[null,null,null,"Temps nécessaire pour la gesion de ce groupe-zones","weeks",null,{"$f":"+IF(G96=\"oui\",$P$142,IF(G95=\"oui\",$P$141,0))","v":0},{"$f":"+IF(H96=\"oui\",$P$142,IF(H95=\"oui\",$P$141,0))","v":0},0,0,0,0,0,0,0,{"$f":"+SUM(G146:N146)","v":0}]
[null,null,null,"Niveau central - Etablir la PCMA"]
[null,null,null,"Pour la première année uniquement de la PCMA dans le pays, le temps nécessaire au niveau central pour mettre au point des directives, aides de travail, matériels et plans de formation, outils de gestion, le système logistique, le système de suivi et de rapport, et les contacts avec les politiques et les bailleurs de fonds.","EPT","Personnel senior",null,null,null,null,null,null,null,null,null,{"$f":"+'D8 Statistiques'!F53","v":1}]
[null,null,null,null,"EPT","Personnel niveau intermédiaire ",null,null,null,null,null,null,null,null,null,{"$f":"+'D8 Statistiques'!F54","v":1}]
[]
[]
[]
[]
["Hidden row below"]
["Do not delete this row - to be hidden",null,null,null,null,null,{"$f":"+IF(G127>G130,\"!!\",IF(G127>G131,\"**\",\"\"))","v":""},{"$f":"+IF(H127>H130,\"!!\",IF(H127>H131,\"**\",\"\"))","v":""},"","","","","",""]

{"sheet":"R7 Gestion au siège de la zone","index":21,"n_rows":82,"n_cols":18,"rows_kept":82,"cut":false,"hidden":false,"merged":[[64,2,64,5],[24,0,31,0],[1,2,1,4],[5,2,5,7],[7,2,7,7],[16,0,22,0],[57,2,57,5],[15,4,15,5],[25,4,25,5],[50,4,50,5]]}
[]
["Retour au sommaire",null,"R7:  Gestion de la PCMA au siège de la zone"]
[]
[]
[null,null,"Number of Areas included ",{"$f":"+'D1 Données générales'!G31","v":1},"  (taken from Feuille de calcul W2)",null,null,null,"hide"]
[null,null,"Cette Feuille de calcul montre (pour l'année choisie) les quantités d'intrants (surtout la main-d'oeuvre) nécessaires pour gérer le programme/service de la PCMA au siège de la zone ainsi que les coûts qui y sont liés. "]
[]
[null,null,"Voir ci-dessous pour la manière dont ont été calculés les chiffres."]
[]
[]
[null,null,{"$f":"+IF('D1 Données générales'!$H$11=\"\",\"\",'D1 Données générales'!$H$11)","v":"Ghana"}]
[null,null,{"$f":"+'D9 Variables temps'!$I$6","v":2011},null,null,"Zone 1",null,null,null,"Zone 2","Zone 3","Zone 4","Zone 5","Zone 6","Zone 7","Zone 8","Zone 9","Zone 10"]
[null,null,null,null,{"$f":"'D2 Echelle'!C30","v":"district"},{"$f":"+IF('D2 Echelle'!$C$31=\"\",\"\",'D2 Echelle'!$C$31)","v":"Ashiedu Keteke"},null,null,null,{"$f":"+IF('D2 Echelle'!$C$36=\"\",\"\",'D2 Echelle'!$C$36)","v":""},{"$f":"+IF('D2 Echelle'!$C$41=\"\",\"\",'D2 Echelle'!$C$41)","v":""},{"$f":"+IF('D2 Echelle'!$C$46=\"\",\"\",'D2 Echelle'!$C$46)","v":""},{"$f":"+IF('D2 Echelle'!$C$51=\"\",\"\",'D2 Echelle'!$C$51)","v":""},{"$f":"+IF('D2 Echelle'!$C$56=\"\",\"\",'D2 Echelle'!$C$56)","v":""},{"$f":"+IF('D2 Echelle'!$C$61=\"\",\"\",'D2 Echelle'!$C$61)","v":""},{"$f":"+IF('D2 Echelle'!$C$66=\"\",\"\",'D2 Echelle'!$C$66)","v":""},{"$f":"+IF('D2 Echelle'!$C$71=\"\",\"\",'D2 Echelle'!$C$71)","v":""},{"$f":"+IF('D2 Echelle'!$C$76=\"\",\"\",'D2 Echelle'!$C$76)","v":""}]
[null,null,null,null,{"$f":"+'D2 Echelle'!D30","v":"région"},{"$f":"+IF('D2 Echelle'!$D$31=\"\",\"\",'D2 Echelle'!$D$31)","v":"Greater Accra"},null,null,null,{"$f":"+IF('D2 Echelle'!$D$36=\"\",\"\",'D2 Echelle'!$D$36)","v":""},{"$f":"+IF('D2 Echelle'!$D$41=\"\",\"\",'D2 Echelle'!$D$41)","v":""},{"$f":"+IF('D2 Echelle'!$D$46=\"\",\"\",'D2 Echelle'!$D$46)","v":""},{"$f":"+IF('D2 Echelle'!$D$51=\"\",\"\",'D2 Echelle'!$D$51)","v":""},{"$f":"+IF('D2 Echelle'!$D$56=\"\",\"\",'D2 Echelle'!$D$56)","v":""},{"$f":"+IF('D2 Echelle'!$D$61=\"\",\"\",'D2 Echelle'!$D$61)","v":""},{"$f":"+IF('D2 Echelle'!$D$66=\"\",\"\",'D2 Echelle'!$D$66)","v":""},{"$f":"+IF('D2 Echelle'!$D$71=\"\",\"\",'D2 Echelle'!$D$71)","v":""},{"$f":"+IF('D2 Echelle'!$D$76=\"\",\"\",'D2 Echelle'!$D$76)","v":""}]
[null,null,"Coûts annuels de cette activité"]
[null,null,"Variables","Unités","Commentaires"]
[null,null,"Personnel du siège de la zone"]
[null,null,"Personnel senior du siège de la zone",{"$f":"+IF('D1 Données générales'!$H$13=\"\",\"\",'D1 Données générales'!$H$13)","v":"Cedi"},null,{"$f":"+F28*F79","v":443.07692307692304},null,null,null,{"$f":"+J28*J79","v":0},0,0,0,0,0,0,0,0]
[null,null,"Personnel de niveau intermédiaire du siège de la zone",{"$f":"+IF('D1 Données générales'!$H$13=\"\",\"\",'D1 Données générales'!$H$13)","v":"Cedi"},null,{"$f":"+F29*F80","v":775.38461538461536},null,null,null,{"$f":"+J29*J80","v":0},0,0,0,0,0,0,0,0]
[null,null,"Personnel junior du siège de la zone",{"$f":"+IF('D1 Données générales'!$H$13=\"\",\"\",'D1 Données générales'!$H$13)","v":"Cedi"},null,{"$f":"+F30*F81","v":1439.9999999999998},null,null,null,{"$f":"+J30*J81","v":0},0,0,0,0,0,0,0,0]
[null,null,"Transport associé à la gestion",{"$f":"+IF('D1 Données générales'!$H$13=\"\",\"\",'D1 Données générales'!$H$13)","v":"Cedi"},null,{"$f":"+F31*F82","v":0},null,null,null,{"$f":"+J31*J82","v":0},0,0,0,0,0,0,0,0]
[]
[null,null,"Total des coûts",{"$f":"+IF('D1 Données générales'!$H$13=\"\",\"\",'D1 Données générales'!$H$13)","v":"Cedi"},null,{"$f":"+SUM(F18:F21)","v":2658.4615384615381},null,null,null,{"$f":"+SUM(J18:J21)","v":0},0,0,0,0,0,0,0,0]
[]
[null,null,"Quantités d'intrants nécessaires pour cette activité"]
[null,null,"Variables","Unités","Commentaires"]
[null,null,"Temps de personnel du siège de la zone",null,null," ",null,null,null," "," "," "," "," "," "," "," "," "]
[null,null,"Personnel senior du siège de la zone","jours",null,{"$f":"+F53","v":12},null,null,null,{"$f":"+J53","v":0},0,0,0,0,0,0,0,0]
[null,null,"Personnel de niveau intermédiaire du siège de la zone","jours",null,{"$f":"+F54","v":42},null,null,null,{"$f":"+J54","v":0},0,0,0,0,0,0,0,0]
[null,null,"Personnel junior du siège de la zone","jours",null,{"$f":"+F55","v":78},null,null,null,{"$f":"+J55","v":0},0,0,0,0,0,0,0,0]
[null,null,"Distances parcourues par le personnel du siège","km",null,{"$f":"+F56","v":0},null,null,null,{"$f":"+J56","v":0},0,0,0,0,0,0,0,0]
[]
[]
[]
[]
[]
[]
[]
[]
[]
[]
[]
[]
[]
[]
[]
[]
[]
["Haut de page",null,"CALCULS",null,null,"Zone 1",{"$f":"+IF(D43>1,message10,\"\")","v":""},null,null,"Zone 2","Zone 3","Zone 4","Zone 5","Zone 6","Zone 7","Zone 8","Zone 9","Zone 10"]
[null,null,null,null,null,{"$f":"+IF('D2 Echelle'!$C$31=\"\",\"\",'D2 Echelle'!$C$31)","v":"Ashiedu Keteke"},null,null,null,{"$f":"+IF('D2 Echelle'!$C$36=\"\",\"\",'D2 Echelle'!$C$36)","v":""},{"$f":"+IF('D2 Echelle'!$C$41=\"\",\"\",'D2 Echelle'!$C$41)","v":""},{"$f":"+IF('D2 Echelle'!$C$46=\"\",\"\",'D2 Echelle'!$C$46)","v":""},{"$f":"+IF('D2 Echelle'!$C$51=\"\",\"\",'D2 Echelle'!$C$51)","v":""},{"$f":"+IF('D2 Echelle'!$C$56=\"\",\"\",'D2 Echelle'!$C$56)","v":""},{"$f":"+IF('D2 Echelle'!$C$61=\"\",\"\",'D2 Echelle'!$C$61)","v":""},{"$f":"+IF('D2 Echelle'!$C$66=\"\",\"\",'D2 Echelle'!$C$66)","v":""},{"$f":"+IF('D2 Echelle'!$C$71=\"\",\"\",'D2 Echelle'!$C$71)","v":""},{"$f":"+IF('D2 Echelle'!$C$76=\"\",\"\",'D2 Echelle'!$C$76)","v":""}]
[null,null,"Variables","Unités","Commentaires",null,null,null,null,{"$f":"+IF('D2 Echelle'!$D$36=\"\",\"\",'D2 Echelle'!$D$36)","v":""},{"$f":"+IF('D2 Echelle'!$D$41=\"\",\"\",'D2 Echelle'!$D$41)","v":""},{"$f":"+IF('D2 Echelle'!$D$46=\"\",\"\",'D2 Echelle'!$D$46)","v":""},{"$f":"+IF('D2 Echelle'!$D$51=\"\",\"\",'D2 Echelle'!$D$51)","v":""},{"$f":"+IF('D2 Echelle'!$D$56=\"\",\"\",'D2 Echelle'!$D$56)","v":""},{"$f":"+IF('D2 Echelle'!$D$61=\"\",\"\",'D2 Echelle'!$D$61)","v":""},{"$f":"+IF('D2 Echelle'!$D$66=\"\",\"\",'D2 Echelle'!$D$66)","v":""},{"$f":"+IF('D2 Echelle'!$D$71=\"\",\"\",'D2 Echelle'!$D$71)","v":""},{"$f":"+IF('D2 Echelle'!$D$76=\"\",\"\",'D2 Echelle'!$D$76)","v":""}]
[null,null,"Calculs"]
[null,null,"Jours de personnel senior du siège de la zone","jours",null,{"$f":"+IF(F71=\"établie\",F66+F62*(F72+F73),IF(F71=\"nouvelle\",F59+F62*(F72+F73)+F66,0))","v":12},null,null,null,{"$f":"+IF(J71=\"établie\",J66+J62*(J72+J73),IF(J71=\"nouvelle\",J59+J62*(J72+J73)+J66,0))","v":0},0,0,0,0,0,0,0,0]
[null,null,"Jours de personnel niveau intermédiaire du siège de la zone","jours",null,{"$f":"+IF(F71=\"établie\",F67+F69*(F72+F73+F74+F75)+F63*(F72+F73),IF(F71=\"nouvelle\",F63*(F72+F73)+F67+F69*(F72+F73+F74+F75)+F60,0))","v":42},null,null,null,{"$f":"+IF(J71=\"établie\",J67+J69*(J72+J73+J74+J75)+J63*(J72+J73),IF(J71=\"nouvelle\",J63*(J72+J73)+J67+J69*(J72+J73+J74+J75)+J60,0))","v":0},0,0,0,0,0,0,0,0]
[null,null,"Jours de personnel junior du siège de la zone","jours",null,{"$f":"+IF(F71=\"établie\",F68+F70*(F72+F73+F74+F75),IF(F71=\"nouvelle\",F68+F70*(F72+F73+F74+F75),0))","v":78},null,null,null,{"$f":"+IF(J71=\"établie\",J68+J70*(J72+J73+J74+J75),IF(J71=\"nouvelle\",J68+J70*(J72+J73+J74+J75),0))","v":0},0,0,0,0,0,0,0,0]
[null,null," Distance parcourue par les personnes","km",null,{"$f":"+F64*2*(F72*F76+F73*F77)","v":0},null,null,null,{"$f":"+J64*2*(J72*J76+J73*J77)","v":0},0,0,0,0,0,0,0,0]
[null,null,"Drivers de base, données brutes"]
[null,null,"Pour la planification et la mise en place de systèmes logistiques, outils de gestion, systèmes de suivie de de rapport, extension communautaire dans une nouvelle zone"]
[null,null,"Journées de personnel senior du siège de la zone par nouvelle zone","jours","Feuille de calcul D3",{"$f":"+'D3 Données épi. démo'!F201","v":20},null,null,null,{"$f":"+'D3 Données épi. démo'!J201","v":20},{"$f":"+'D3 Données épi. démo'!K201","v":20},{"$f":"+'D3 Données épi. démo'!L201","v":20},{"$f":"+'D3 Données épi. démo'!M201","v":20},{"$f":"+'D3 Données épi. démo'!N201","v":20},{"$f":"+'D3 Données épi. démo'!O201","v":20},{"$f":"+'D3 Données épi. démo'!P201","v":20},{"$f":"+'D3 Données épi. démo'!Q201","v":20},{"$f":"+'D3 Données épi. démo'!R201","v":20}]
[null,null,"Journées de personnel de niveau intermédiaire du siège de la zone par nouvelle zone","jours","Feuille de calcul D3",{"$f":"+'D3 Données épi. démo'!F202","v":20},null,null,null,{"$f":"+'D3 Données épi. démo'!J202","v":20},{"$f":"+'D3 Données épi. démo'!K202","v":20},{"$f":"+'D3 Données épi. démo'!L202","v":20},{"$f":"+'D3 Données épi. démo'!M202","v":20},{"$f":"+'D3 Données épi. démo'!N202","v":20},{"$f":"+'D3 Données épi. démo'!O202","v":20},{"$f":"+'D3 Données épi. démo'!P202","v":20},{"$f":"+'D3 Données épi. démo'!Q202","v":20},{"$f":"+'D3 Données épi. démo'!R202","v":20}]
[null,null,"Mise en place et fonctionnement d'un nouveau site PEC MAS ambulatoire ou hospitalière  ",null,null," ",null,null,null," "," "," "," "," "," "," "," "," "]
[null,null,"Journées de personnel senior du siège de la zone par nouveau site PEC MAS ambulatoire ou hospitalière","jours","Feuille de calcul D3",{"$f":"+'D3 Données épi. démo'!F204","v":5},null,null,null,{"$f":"+'D3 Données épi. démo'!J204","v":5},{"$f":"+'D3 Données épi. démo'!K204","v":5},{"$f":"+'D3 Données épi. démo'!L204","v":5},{"$f":"+'D3 Données épi. démo'!M204","v":5},{"$f":"+'D3 Données épi. démo'!N204","v":5},{"$f":"+'D3 Données épi. démo'!O204","v":5},{"$f":"+'D3 Données épi. démo'!P204","v":5},{"$f":"+'D3 Données épi. démo'!Q204","v":5},{"$f":"+'D3 Données épi. démo'!R204","v":5}]
[null,null,"Journées de personnel niveau intermédiaire du siège de la zone par nouveau site PEC MAS ambulatoire ou hospitalière","jours","Feuille de calcul D3",{"$f":"+'D3 Données épi. démo'!F205","v":5},null,null,null,{"$f":"+'D3 Données épi. démo'!J205","v":5},{"$f":"+'D3 Données épi. démo'!K205","v":5},{"$f":"+'D3 Données épi. démo'!L205","v":5},{"$f":"+'D3 Données épi. démo'!M205","v":5},{"$f":"+'D3 Données épi. démo'!N205","v":5},{"$f":"+'D3 Données épi. démo'!O205","v":5},{"$f":"+'D3 Données épi. démo'!P205","v":5},{"$f":"+'D3 Données épi. démo'!Q205","v":5},{"$f":"+'D3 Données épi. démo'!R205","v":5}]
[null,null,"(Personne) voyages au niveau site PEC MAS ambulatoire ou hospitalière","voyages","Feuille de calcul D3",{"$f":"+'D3 Données épi. démo'!F206","v":5},null,null,null,{"$f":"+'D3 Données épi. démo'!J206","v":5},{"$f":"+'D3 Données épi. démo'!K206","v":5},{"$f":"+'D3 Données épi. démo'!L206","v":5},{"$f":"+'D3 Données épi. démo'!M206","v":5},{"$f":"+'D3 Données épi. démo'!N206","v":5},{"$f":"+'D3 Données épi. démo'!O206","v":5},{"$f":"+'D3 Données épi. démo'!P206","v":5},{"$f":"+'D3 Données épi. démo'!Q206","v":5},{"$f":"+'D3 Données épi. démo'!R206","v":5}]
[null,null,"Gestion continue de la PCMA dans la zone (suppervision, suivi et rapport, gestion de personnel et financière)"]
[null,null,"Journées de personnel senior du siège de la zone par zone par an","jours","Feuille de calcul D3",{"$f":"+'D3 Données épi. démo'!F208","v":12},null,null,null,{"$f":"+'D3 Données épi. démo'!J208","v":12},{"$f":"+'D3 Données épi. démo'!K208","v":12},{"$f":"+'D3 Données épi. démo'!L208","v":12},{"$f":"+'D3 Données épi. démo'!M208","v":12},{"$f":"+'D3 Données épi. démo'!N208","v":12},{"$f":"+'D3 Données épi. démo'!O208","v":12},{"$f":"+'D3 Données épi. démo'!P208","v":12},{"$f":"+'D3 Données épi. démo'!Q208","v":12},{"$f":"+'D3 Données épi. démo'!R208","v":12}]
[null,null,"Journées de personnel niveau intermédiaire du siège de la zone par zone par an","jours","Feuille de calcul D3",{"$f":"+'D3 Données épi. démo'!F209","v":24},null,null,null,{"$f":"+'D3 Données épi. démo'!J209","v":24},{"$f":"+'D3 Données épi. démo'!K209","v":24},{"$f":"+'D3 Données épi. démo'!L209","v":24},{"$f":"+'D3 Données épi. démo'!M209","v":24},{"$f":"+'D3 Données épi. démo'!N209","v":24},{"$f":"+'D3 Données épi. démo'!O209","v":24},{"$f":"+'D3 Données épi. démo'!P209","v":24},{"$f":"+'D3 Données épi. démo'!Q209","v":24},{"$f":"+'D3 Données épi. démo'!R209","v":24}]
[null,null,"Journées de personnel junior du siège de la zone par zone par an","jours","Feuille de calcul D3",{"$f":"+'D3 Données épi. démo'!F210","v":60},null,null,null,{"$f":"+'D3 Données épi. démo'!J210","v":60},{"$f":"+'D3 Données épi. démo'!K210","v":60},{"$f":"+'D3 Données épi. démo'!L210","v":60},{"$f":"+'D3 Données épi. démo'!M210","v":60},{"$f":"+'D3 Données épi. démo'!N210","v":60},{"$f":"+'D3 Données épi. démo'!O210","v":60},{"$f":"+'D3 Données épi. démo'!P210","v":60},{"$f":"+'D3 Données épi. démo'!Q210","v":60},{"$f":"+'D3 Données épi. démo'!R210","v":60}]
[null,null,"Journées de personnel de niveau intermédiaire du siège de la zone par site PEC MAS ambulatoire ou hospitalière par an ","jours","Feuille de calcul D3",{"$f":"+'D3 Données épi. démo'!F211","v":6},null,null,null,{"$f":"+'D3 Données épi. démo'!J211","v":6},{"$f":"+'D3 Données épi. démo'!K211","v":6},{"$f":"+'D3 Données épi. démo'!L211","v":6},{"$f":"+'D3 Données épi. démo'!M211","v":6},{"$f":"+'D3 Données épi. démo'!N211","v":6},{"$f":"+'D3 Données épi. démo'!O211","v":6},{"$f":"+'D3 Données épi. démo'!P211","v":6},{"$f":"+'D3 Données épi. démo'!Q211","v":6},{"$f":"+'D3 Données épi. démo'!R211","v":6}]
[null,null,"Journées de personnel junior du siège de la zone par site PEC MAS ambulatoire ou hospitalière par an","jours","Feuille de calcul D3",{"$f":"+'D3 Données épi. démo'!F212","v":6},null,null,null,{"$f":"+'D3 Données épi. démo'!J212","v":6},{"$f":"+'D3 Données épi. démo'!K212","v":6},{"$f":"+'D3 Données épi. démo'!L212","v":6},{"$f":"+'D3 Données épi. démo'!M212","v":6},{"$f":"+'D3 Données épi. démo'!N212","v":6},{"$f":"+'D3 Données épi. démo'!O212","v":6},{"$f":"+'D3 Données épi. démo'!P212","v":6},{"$f":"+'D3 Données épi. démo'!Q212","v":6},{"$f":"+'D3 Données épi. démo'!R212","v":6}]
[null,null,"Cette zone est-la PCMA nouvelle, établie ou inactive ? ",null,"Feuille de calcul D9",{"$f":"+'D9 Variables temps'!F46","v":"établie"},null,null,null,{"$f":"+'D9 Variables temps'!J46","v":"inactive"},{"$f":"+'D9 Variables temps'!K46","v":"inactive"},{"$f":"+'D9 Variables temps'!L46","v":"inactive"},{"$f":"+'D9 Variables temps'!M46","v":"inactive"},{"$f":"+'D9 Variables temps'!N46","v":"inactive"},{"$f":"+'D9 Variables temps'!O46","v":"inactive"},{"$f":"+'D9 Variables temps'!P46","v":"inactive"},{"$f":"+'D9 Variables temps'!Q46","v":"inactive"},{"$f":"+'D9 Variables temps'!R46","v":"inactive"}]
[null,null,"Nombre de nouveaux sites PEC MAS ambulatoire","sites","Feuille de calcul D9",{"$f":"+'D9 Variables temps'!F30","v":0},null,null,null,{"$f":"+'D9 Variables temps'!J30","v":0},{"$f":"+'D9 Variables temps'!K30","v":0},{"$f":"+'D9 Variables temps'!L30","v":0},{"$f":"+'D9 Variables temps'!M30","v":0},{"$f":"+'D9 Variables temps'!N30","v":0},{"$f":"+'D9 Variables temps'!O30","v":0},{"$f":"+'D9 Variables temps'!P30","v":0},{"$f":"+'D9 Variables temps'!Q30","v":0},{"$f":"+'D9 Variables temps'!R30","v":0}]
[null,null,"Nombre de nouveaux sites PEC MAS hospitalière","sites","Feuille de calcul D9",{"$f":"+'D9 Variables temps'!F33","v":0},null,null,null,{"$f":"+'D9 Variables temps'!J33","v":0},{"$f":"+'D9 Variables temps'!K33","v":0},{"$f":"+'D9 Variables temps'!L33","v":0},{"$f":"+'D9 Variables temps'!M33","v":0},{"$f":"+'D9 Variables temps'!N33","v":0},{"$f":"+'D9 Variables temps'!O33","v":0},{"$f":"+'D9 Variables temps'!P33","v":0},{"$f":"+'D9 Variables temps'!Q33","v":0},{"$f":"+'D9 Variables temps'!R33","v":0}]
[null,null,"Nombre de sites PEC MAS ambulatoire établis","sites","Feuille de calcul D9",{"$f":"+'D9 Variables temps'!F31","v":2},null,null,null,{"$f":"+'D9 Variables temps'!J31","v":0},{"$f":"+'D9 Variables temps'!K31","v":0},{"$f":"+'D9 Variables temps'!L31","v":0},{"$f":"+'D9 Variables temps'!M31","v":0},{"$f":"+'D9 Variables temps'!N31","v":0},{"$f":"+'D9 Variables temps'!O31","v":0},{"$f":"+'D9 Variables temps'!P31","v":0},{"$f":"+'D9 Variables temps'!Q31","v":0},{"$f":"+'D9 Variables temps'!R31","v":0}]
[null,null,"Nombre de sites PEC MAS hospitalière établis","sites","Feuille de calcul D9",{"$f":"+'D9 Variables temps'!F34","v":1},null,null,null,{"$f":"+'D9 Variables temps'!J34","v":0},{"$f":"+'D9 Variables temps'!K34","v":0},{"$f":"+'D9 Variables temps'!L34","v":0},{"$f":"+'D9 Variables temps'!M34","v":0},{"$f":"+'D9 Variables temps'!N34","v":0},{"$f":"+'D9 Variables temps'!O34","v":0},{"$f":"+'D9 Variables temps'!P34","v":0},{"$f":"+'D9 Variables temps'!Q34","v":0},{"$f":"+'D9 Variables temps'!R34","v":0}]
[null,null,"Distance moyenne aux  sites PEC MAS ambulatoire à partir du siège de la zone","km","Feuille de calcul D3",{"$f":"+'D3 Données épi. démo'!F123","v":5},null,null,null,{"$f":"+'D3 Données épi. démo'!J123","v":0},{"$f":"+'D3 Données épi. démo'!K123","v":0},{"$f":"+'D3 Données épi. démo'!L123","v":0},{"$f":"+'D3 Données épi. démo'!M123","v":0},{"$f":"+'D3 Données épi. démo'!N123","v":0},{"$f":"+'D3 Données épi. démo'!O123","v":0},{"$f":"+'D3 Données épi. démo'!P123","v":0},{"$f":"+'D3 Données épi. démo'!Q123","v":0},{"$f":"+'D3 Données épi. démo'!R123","v":0}]
[null,null,"Distance moyenne aux sites PEC MAS hospitalière à partir du siège de la zone","km","Feuille de calcul D3",{"$f":"+'D3 Données épi. démo'!F125","v":5},null,null,null,{"$f":"+'D3 Données épi. démo'!J125","v":0},{"$f":"+'D3 Données épi. démo'!K125","v":0},{"$f":"+'D3 Données épi. démo'!L125","v":0},{"$f":"+'D3 Données épi. démo'!M125","v":0},{"$f":"+'D3 Données épi. démo'!N125","v":0},{"$f":"+'D3 Données épi. démo'!O125","v":0},{"$f":"+'D3 Données épi. démo'!P125","v":0},{"$f":"+'D3 Données épi. démo'!Q125","v":0},{"$f":"+'D3 Données épi. démo'!R125","v":0}]
[null,null,"Prix"]
[null,null,"Coût par jour du personnel senior du siège de la zone",{"$f":"+IF('D1 Données générales'!$H$13=\"\",\"\",'D1 Données générales'!$H$13)","v":"Cedi"},"Feuille de calcul D5",{"$f":"+'D5 Salaires'!J28","v":36.92307692307692},null,null,null,{"$f":"+$F$79*'D4 Prix'!J81","v":0},{"$f":"+$F$79*'D4 Prix'!K81","v":0},{"$f":"+$F$79*'D4 Prix'!L81","v":0},{"$f":"+$F$79*'D4 Prix'!M81","v":0},{"$f":"+$F$79*'D4 Prix'!N81","v":0},{"$f":"+$F$79*'D4 Prix'!O81","v":0},{"$f":"+$F$79*'D4 Prix'!P81","v":0},{"$f":"+$F$79*'D4 Prix'!Q81","v":0},{"$f":"+$F$79*'D4 Prix'!R81","v":0}]
[null,null,"Coût par jour du personnel de niveau intermédiaire du siège de la zone",{"$f":"+IF('D1 Données générales'!$H$13=\"\",\"\",'D1 Données générales'!$H$13)","v":"Cedi"},"Feuille de calcul D5",{"$f":"+'D5 Salaires'!J29","v":18.46153846153846},null,null,null,{"$f":"+$F$80*'D4 Prix'!J81","v":0},{"$f":"+$F$80*'D4 Prix'!K81","v":0},{"$f":"+$F$80*'D4 Prix'!L81","v":0},{"$f":"+$F$80*'D4 Prix'!M81","v":0},{"$f":"+$F$80*'D4 Prix'!N81","v":0},{"$f":"+$F$80*'D4 Prix'!O81","v":0},{"$f":"+$F$80*'D4 Prix'!P81","v":0},{"$f":"+$F$80*'D4 Prix'!Q81","v":0},{"$f":"+$F$80*'D4 Prix'!R81","v":0}]
[null,null,"Coût par jour du personnel junior du siège de la zone",{"$f":"+IF('D1 Données générales'!$H$13=\"\",\"\",'D1 Données générales'!$H$13)","v":"Cedi"},"Feuille de calcul D5",{"$f":"+'D5 Salaires'!J30","v":18.46153846153846},null,null,null,{"$f":"+$F$81*'D4 Prix'!J81","v":0},{"$f":"+$F$81*'D4 Prix'!K81","v":0},{"$f":"+$F$81*'D4 Prix'!L81","v":0},{"$f":"+$F$81*'D4 Prix'!M81","v":0},{"$f":"+$F$81*'D4 Prix'!N81","v":0},{"$f":"+$F$81*'D4 Prix'!O81","v":0},{"$f":"+$F$81*'D4 Prix'!P81","v":0},{"$f":"+$F$81*'D4 Prix'!Q81","v":0},{"$f":"+$F$81*'D4 Prix'!R81","v":0}]
[null,null,"Coût par km entre le siège de la zone et les sites PEC MAS ambulatoire ou hospitalière",{"$f":"+IF('D1 Données générales'!$H$13=\"\",\"\",'D1 Données générales'!$H$13)","v":"Cedi"},"Feuille de calcul D4",{"$f":"+'D4 Prix'!F74","v":2},null,null,null,{"$f":"+'D4 Prix'!J74","v":2},{"$f":"+'D4 Prix'!K74","v":2},{"$f":"+'D4 Prix'!L74","v":2},{"$f":"+'D4 Prix'!M74","v":2},{"$f":"+'D4 Prix'!N74","v":2},{"$f":"+'D4 Prix'!O74","v":2},{"$f":"+'D4 Prix'!P74","v":2},{"$f":"+'D4 Prix'!Q74","v":2},{"$f":"+'D4 Prix'!R74","v":2}]

{"sheet":"R8 Traitement (main-d'oeuvres)","index":22,"n_rows":135,"n_cols":18,"rows_kept":135,"cut":false,"hidden":false,"merged":[[15,4,15,5],[30,4,30,5],[16,0,27,0],[1,2,1,4],[29,0,36,0],[4,2,4,5]]}
[]
["Retour au sommaire",null,"R8:  Traitement (main-d'oeuvre et espace)"]
[]
[null,null,"Number of Areas included ",{"$f":"+'D1 Données générales'!G31","v":1},"  (taken from Feuille de travail W2)"]
[null,null,"Cette Feuille de calcul montre (pour l'année choisie) les quantités de main-d'oeuvre nécessaires pour le traitement de la PCMA et les coûts qui y sont liés. "]
[]
[null,null,"Voir ci-dessous pour la manière dont ont été calculés les chiffres."]
[]
[]
[]
[null,null,{"$f":"+IF('D1 Données générales'!$H$11=\"\",\"\",'D1 Données générales'!$H$11)","v":"Ghana"}]
[null,null,{"$f":"+'D9 Variables temps'!$I$6","v":2011},null,null,"Zone 1",null,null,null,"Zone 2","Zone 3","Zone 4","Zone 5","Zone 6","Zone 7","Zone 8","Zone 9","Zone 10"]
[null,null,null,null,{"$f":"'D2 Echelle'!$C$30","v":"district"},{"$f":"+IF('D2 Echelle'!$C$31=\"\",\"\",'D2 Echelle'!$C$31)","v":"Ashiedu Keteke"},null,null,null,{"$f":"+IF('D2 Echelle'!$C$36=\"\",\"\",'D2 Echelle'!$C$36)","v":""},{"$f":"+IF('D2 Echelle'!$C$41=\"\",\"\",'D2 Echelle'!$C$41)","v":""},{"$f":"+IF('D2 Echelle'!$C$46=\"\",\"\",'D2 Echelle'!$C$46)","v":""},{"$f":"+IF('D2 Echelle'!$C$51=\"\",\"\",'D2 Echelle'!$C$51)","v":""},{"$f":"+IF('D2 Echelle'!$C$56=\"\",\"\",'D2 Echelle'!$C$56)","v":""},{"$f":"+IF('D2 Echelle'!$C$61=\"\",\"\",'D2 Echelle'!$C$61)","v":""},{"$f":"+IF('D2 Echelle'!$C$66=\"\",\"\",'D2 Echelle'!$C$66)","v":""},{"$f":"+IF('D2 Echelle'!$C$71=\"\",\"\",'D2 Echelle'!$C$71)","v":""},{"$f":"+IF('D2 Echelle'!$C$76=\"\",\"\",'D2 Echelle'!$C$76)","v":""}]
[null,null,null,null,{"$f":"+'D2 Echelle'!$D$30","v":"région"},{"$f":"+IF('D2 Echelle'!$D$31=\"\",\"\",'D2 Echelle'!$D$31)","v":"Greater Accra"},null,null,null,{"$f":"+IF('D2 Echelle'!$D$36=\"\",\"\",'D2 Echelle'!$D$36)","v":""},{"$f":"+IF('D2 Echelle'!$D$41=\"\",\"\",'D2 Echelle'!$D$41)","v":""},{"$f":"+IF('D2 Echelle'!$D$46=\"\",\"\",'D2 Echelle'!$D$46)","v":""},{"$f":"+IF('D2 Echelle'!$D$51=\"\",\"\",'D2 Echelle'!$D$51)","v":""},{"$f":"+IF('D2 Echelle'!$D$56=\"\",\"\",'D2 Echelle'!$D$56)","v":""},{"$f":"+IF('D2 Echelle'!$D$61=\"\",\"\",'D2 Echelle'!$D$61)","v":""},{"$f":"+IF('D2 Echelle'!$D$66=\"\",\"\",'D2 Echelle'!$D$66)","v":""},{"$f":"+IF('D2 Echelle'!$D$71=\"\",\"\",'D2 Echelle'!$D$71)","v":""},{"$f":"+IF('D2 Echelle'!$D$76=\"\",\"\",'D2 Echelle'!$D$76)","v":""}]
[null,null,"Coûts annuels de cette activité"]
[null,null,"Variables","Unités","Commentaires"]
[null,null,"Coût de la main-d'oeuvre participant au traitement de la MAS "]
[null,null," Personnel senior de la PEC MAS ambulatoire",{"$f":"+IF('D1 Données générales'!$H$13=\"\",\"\",'D1 Données générales'!$H$13)","v":"Cedi"},null,{"$f":"+F100*F95","v":2814.8076923076924},null,null,null,{"$f":"+J100*J95","v":0},0,0,0,0,0,0,0,0]
[null,null,"Personnel junior de la PEC MAS ambulatoire",{"$f":"+IF('D1 Données générales'!$H$13=\"\",\"\",'D1 Données générales'!$H$13)","v":"Cedi"},null,{"$f":"+F101*F96","v":1324.6153846153845},null,null,null,{"$f":"+J101*J96","v":0},0,0,0,0,0,0,0,0]
[null,null,"Personnel senior de la PEC MAS hospitalière",{"$f":"+IF('D1 Données générales'!$H$13=\"\",\"\",'D1 Données générales'!$H$13)","v":"Cedi"}," ",{"$f":"+F34*F133","v":8837.3076923076933},null,null,null,{"$f":"+J34*J133","v":0},0,0,0,0,0,0,0,0]
[null,null,"Personnel junior de la PEC MAS hospitalière",{"$f":"+IF('D1 Données générales'!$H$13=\"\",\"\",'D1 Données générales'!$H$13)","v":"Cedi"},null,{"$f":"+F35*F134","v":12634.615384615385},null,null,null,{"$f":"+J35*J134","v":0},0,0,0,0,0,0,0,0]
[null,null,"Sous-total ",{"$f":"+IF('D1 Données générales'!$H$13=\"\",\"\",'D1 Données générales'!$H$13)","v":"Cedi"},null,{"$f":"+SUM(F18:F21)","v":25611.346153846156},null,null,null,{"$f":"+SUM(J18:J21)","v":0},0,0,0,0,0,0,0,0]
[null,null,"Total des coûts"]
[null,null,"PEC MAS ambulatoire",{"$f":"+IF('D1 Données générales'!$H$13=\"\",\"\",'D1 Données générales'!$H$13)","v":"Cedi"},null,{"$f":"+F36*F102","v":0},null,null,null,{"$f":"+J36*J102","v":0},0,0,0,0,0,0,0,0]
[null,null,"PEC MAS hospitalière",{"$f":"+IF('D1 Données générales'!$H$13=\"\",\"\",'D1 Données générales'!$H$13)","v":"Cedi"},null,{"$f":"+F37*F135","v":0},null,null,null,{"$f":"+J37*J135","v":0},0,0,0,0,0,0,0,0]
[null,null,"Sous-total ",null,null,{"$f":"+SUM(F24:F25)","v":0},null,null,null,{"$f":"+SUM(J24:J25)","v":0},0,0,0,0,0,0,0,0]
[]
[null,null,"Coût annuel total de la main-d'oeuvre et de l'espace pour le traitement dans cette zone",null,null,{"$f":"+F22+F26","v":25611.346153846156},null,null,null,{"$f":"+J22+J26","v":0},0,0,0,0,0,0,0,0]
[]
[null,null,"Quantités d'intrants nécessaires à cette activité"]
[null,null,"Variables","Unités","Commentaires"]
[null,null,"Temps de personnel senior de la PEC MAS ambulatoire ","jours",null,{"$f":"+IF('D9 Variables temps'!F29>0,F95,0)","v":71.75},null,null,null,{"$f":"+IF('D9 Variables temps'!J29>0,J95,0)","v":0},{"$f":"+IF('D9 Variables temps'!K29>0,K95,0)","v":0},{"$f":"+IF('D9 Variables temps'!L29>0,L95,0)","v":0},{"$f":"+IF('D9 Variables temps'!M29>0,M95,0)","v":0},{"$f":"+IF('D9 Variables temps'!N29>0,N95,0)","v":0},{"$f":"+IF('D9 Variables temps'!O29>0,O95,0)","v":0},{"$f":"+IF('D9 Variables temps'!P29>0,P95,0)","v":0},{"$f":"+IF('D9 Variables temps'!Q29>0,Q95,0)","v":0},{"$f":"+IF('D9 Variables temps'!R29>0,R95,0)","v":0}]
[null,null,"Temps de personnel junior de la PEC MAS ambulatoire ","jours",null,{"$f":"+IF('D9 Variables temps'!F29>0,F96,0)","v":71.75},null,null,null,{"$f":"+IF('D9 Variables temps'!J29>0,J96,0)","v":0},{"$f":"+IF('D9 Variables temps'!K29>0,K96,0)","v":0},{"$f":"+IF('D9 Variables temps'!L29>0,L96,0)","v":0},{"$f":"+IF('D9 Variables temps'!M29>0,M96,0)","v":0},{"$f":"+IF('D9 Variables temps'!N29>0,N96,0)","v":0},{"$f":"+IF('D9 Variables temps'!O29>0,O96,0)","v":0},{"$f":"+IF('D9 Variables temps'!P29>0,P96,0)","v":0},{"$f":"+IF('D9 Variables temps'!Q29>0,Q96,0)","v":0},{"$f":"+IF('D9 Variables temps'!R29>0,R96,0)","v":0}]
[null,null,"Temps de personnel senior de la PEC MAS hospitalière ","jours",null,{"$f":"+IF('D9 Variables temps'!F32>0,'R8 Traitement (main-d''oeuvres)'!F109/F83,0)","v":106.375},null,null,null,{"$f":"+IF('D9 Variables temps'!J32>0,'R8 Traitement (main-d''oeuvres)'!J109/J83,0)","v":0},{"$f":"+IF('D9 Variables temps'!K32>0,'R8 Traitement (main-d''oeuvres)'!K109/K83,0)","v":0},{"$f":"+IF('D9 Variables temps'!L32>0,'R8 Traitement (main-d''oeuvres)'!L109/L83,0)","v":0},{"$f":"+IF('D9 Variables temps'!M32>0,'R8 Traitement (main-d''oeuvres)'!M109/M83,0)","v":0},{"$f":"+IF('D9 Variables temps'!N32>0,'R8 Traitement (main-d''oeuvres)'!N109/N83,0)","v":0},{"$f":"+IF('D9 Variables temps'!O32>0,'R8 Traitement (main-d''oeuvres)'!O109/O83,0)","v":0},{"$f":"+IF('D9 Variables temps'!P32>0,'R8 Traitement (main-d''oeuvres)'!P109/P83,0)","v":0},{"$f":"+IF('D9 Variables temps'!Q32>0,'R8 Traitement (main-d''oeuvres)'!Q109/Q83,0)","v":0},{"$f":"+IF('D9 Variables temps'!R32>0,'R8 Traitement (main-d''oeuvres)'!R109/R83,0)","v":0}]
[null,null,"Temps de personnel junior de la PEC MAS hospitalière ","jours",null,{"$f":"+IF('D9 Variables temps'!F32>0,'R8 Traitement (main-d''oeuvres)'!F110/F83,0)","v":1095},null,null,null,{"$f":"+IF('D9 Variables temps'!J32>0,'R8 Traitement (main-d''oeuvres)'!J110/J83,0)","v":0},{"$f":"+IF('D9 Variables temps'!K32>0,'R8 Traitement (main-d''oeuvres)'!K110/K83,0)","v":0},{"$f":"+IF('D9 Variables temps'!L32>0,'R8 Traitement (main-d''oeuvres)'!L110/L83,0)","v":0},{"$f":"+IF('D9 Variables temps'!M32>0,'R8 Traitement (main-d''oeuvres)'!M110/M83,0)","v":0},{"$f":"+IF('D9 Variables temps'!N32>0,'R8 Traitement (main-d''oeuvres)'!N110/N83,0)","v":0},{"$f":"+IF('D9 Variables temps'!O32>0,'R8 Traitement (main-d''oeuvres)'!O110/O83,0)","v":0},{"$f":"+IF('D9 Variables temps'!P32>0,'R8 Traitement (main-d''oeuvres)'!P110/P83,0)","v":0},{"$f":"+IF('D9 Variables temps'!Q32>0,'R8 Traitement (main-d''oeuvres)'!Q110/Q83,0)","v":0},{"$f":"+IF('D9 Variables temps'!R32>0,'R8 Traitement (main-d''oeuvres)'!R110/R83,0)","v":0}]
[null,null,"Espace nécessaire pour la PEC MAS ambulatoire","m2/an",null,{"$f":"+F98","v":4.3134615384615387},null,null,null,{"$f":"+J98","v":0},0,0,0,0,0,0,0,0]
[null,null,"Espace nécessaire pour la PEC MAS hospitalière","m2/an",null,{"$f":"+F111","v":19},null,null,null,{"$f":"+J111","v":0},0,0,0,0,0,0,0,0]
[]
[]
[]
[]
[]
[]
[]
[]
[]
[]
[]
[]
[]
[]
[]
[]
[]
[]
[]
[]
[]
[]
[]
[]
[]
[]
[]
[]
[]
[null,null,null,null,null,"Zone 1",{"$f":"+IF(D61>1,message10,\"\")","v":""},null,null,"Zone 2","Zone 3","Zone 4","Zone 5","Zone 6","Zone 7","Zone 8","Zone 9","Zone 10"]
["Haut de page",null,"CALCULS",null,null,{"$f":"+IF('D2 Echelle'!$C$31=\"\",\"\",'D2 Echelle'!$C$31)","v":"Ashiedu Keteke"},null,null,null,{"$f":"+IF('D2 Echelle'!$C$36=\"\",\"\",'D2 Echelle'!$C$36)","v":""},{"$f":"+IF('D2 Echelle'!$C$41=\"\",\"\",'D2 Echelle'!$C$41)","v":""},{"$f":"+IF('D2 Echelle'!$C$46=\"\",\"\",'D2 Echelle'!$C$46)","v":""},{"$f":"+IF('D2 Echelle'!$C$51=\"\",\"\",'D2 Echelle'!$C$51)","v":""},{"$f":"+IF('D2 Echelle'!$C$56=\"\",\"\",'D2 Echelle'!$C$56)","v":""},{"$f":"+IF('D2 Echelle'!$C$61=\"\",\"\",'D2 Echelle'!$C$61)","v":""},{"$f":"+IF('D2 Echelle'!$C$66=\"\",\"\",'D2 Echelle'!$C$66)","v":""},{"$f":"+IF('D2 Echelle'!$C$71=\"\",\"\",'D2 Echelle'!$C$71)","v":""},{"$f":"+IF('D2 Echelle'!$C$76=\"\",\"\",'D2 Echelle'!$C$76)","v":""}]
[null,null,"Variables","Unités","Commentaires",{"$f":"+IF('D2 Echelle'!$D$31=\"\",\"\",'D2 Echelle'!$D$31)","v":"Greater Accra"},null,null,null,{"$f":"+IF('D2 Echelle'!$D$36=\"\",\"\",'D2 Echelle'!$D$36)","v":""},{"$f":"+IF('D2 Echelle'!$D$41=\"\",\"\",'D2 Echelle'!$D$41)","v":""},{"$f":"+IF('D2 Echelle'!$D$46=\"\",\"\",'D2 Echelle'!$D$46)","v":""},{"$f":"+IF('D2 Echelle'!$D$51=\"\",\"\",'D2 Echelle'!$D$51)","v":""},{"$f":"+IF('D2 Echelle'!$D$56=\"\",\"\",'D2 Echelle'!$D$56)","v":""},{"$f":"+IF('D2 Echelle'!$D$61=\"\",\"\",'D2 Echelle'!$D$61)","v":""},{"$f":"+IF('D2 Echelle'!$D$66=\"\",\"\",'D2 Echelle'!$D$66)","v":""},{"$f":"+IF('D2 Echelle'!$D$71=\"\",\"\",'D2 Echelle'!$D$71)","v":""},{"$f":"+IF('D2 Echelle'!$D$76=\"\",\"\",'D2 Echelle'!$D$76)","v":""}]
[null,null,"Sites PEC MAS ambulatoire"]
[null,null,"Drivers de base, données brutes"]
[null,null,"Heures agent senior par visite par enfant avec MAS","heures","Feuille de calcul  D3",{"$f":"+'D3 Données épi. démo'!F39","v":0.25},null,null,null,{"$f":"+'D3 Données épi. démo'!J39","v":0.25},{"$f":"+'D3 Données épi. démo'!K39","v":0.25},{"$f":"+'D3 Données épi. démo'!L39","v":0.25},{"$f":"+'D3 Données épi. démo'!M39","v":0.25},{"$f":"+'D3 Données épi. démo'!N39","v":0.25},{"$f":"+'D3 Données épi. démo'!O39","v":0.25},{"$f":"+'D3 Données épi. démo'!P39","v":0.25},{"$f":"+'D3 Données épi. démo'!Q39","v":0.25},{"$f":"+'D3 Données épi. démo'!R39","v":0.25}]
[null,null,"Heures agent senior par séance","heures","Feuille de calcul D3",{"$f":"+'D3 Données épi. démo'!F40","v":2},null,null,null,{"$f":"+'D3 Données épi. démo'!J40","v":2},{"$f":"+'D3 Données épi. démo'!K40","v":2},{"$f":"+'D3 Données épi. démo'!L40","v":2},{"$f":"+'D3 Données épi. démo'!M40","v":2},{"$f":"+'D3 Données épi. démo'!N40","v":2},{"$f":"+'D3 Données épi. démo'!O40","v":2},{"$f":"+'D3 Données épi. démo'!P40","v":2},{"$f":"+'D3 Données épi. démo'!Q40","v":2},{"$f":"+'D3 Données épi. démo'!R40","v":2}]
[null,null,"Heures agent senior par mois par site","heures","Feuille de calcul D3",{"$f":"+'D3 Données épi. démo'!F41","v":4},null,null,null,{"$f":"+'D3 Données épi. démo'!J41","v":4},{"$f":"+'D3 Données épi. démo'!K41","v":4},{"$f":"+'D3 Données épi. démo'!L41","v":4},{"$f":"+'D3 Données épi. démo'!M41","v":4},{"$f":"+'D3 Données épi. démo'!N41","v":4},{"$f":"+'D3 Données épi. démo'!O41","v":4},{"$f":"+'D3 Données épi. démo'!P41","v":4},{"$f":"+'D3 Données épi. démo'!Q41","v":4},{"$f":"+'D3 Données épi. démo'!R41","v":4}]
[null,null,"Heures personnel junior par visite par enfant avec MAS  ","heures","Feuille de calcul D3",{"$f":"+'D3 Données épi. démo'!F42","v":0.25},null,null,null,{"$f":"+'D3 Données épi. démo'!J42","v":0.25},{"$f":"+'D3 Données épi. démo'!K42","v":0.25},{"$f":"+'D3 Données épi. démo'!L42","v":0.25},{"$f":"+'D3 Données épi. démo'!M42","v":0.25},{"$f":"+'D3 Données épi. démo'!N42","v":0.25},{"$f":"+'D3 Données épi. démo'!O42","v":0.25},{"$f":"+'D3 Données épi. démo'!P42","v":0.25},{"$f":"+'D3 Données épi. démo'!Q42","v":0.25},{"$f":"+'D3 Données épi. démo'!R42","v":0.25}]
[null,null,"Heures personnel junior par séance","heures","Feuille de calcul D3",{"$f":"+'D3 Données épi. démo'!F43","v":2},null,null,null,{"$f":"+'D3 Données épi. démo'!J43","v":2},{"$f":"+'D3 Données épi. démo'!K43","v":2},{"$f":"+'D3 Données épi. démo'!L43","v":2},{"$f":"+'D3 Données épi. démo'!M43","v":2},{"$f":"+'D3 Données épi. démo'!N43","v":2},{"$f":"+'D3 Données épi. démo'!O43","v":2},{"$f":"+'D3 Données épi. démo'!P43","v":2},{"$f":"+'D3 Données épi. démo'!Q43","v":2},{"$f":"+'D3 Données épi. démo'!R43","v":2}]
[null,null,"Heures personnel junior par mois et par site","heures","Feuille de calcul D3",{"$f":"+'D3 Données épi. démo'!F44","v":4},null,null,null,{"$f":"+'D3 Données épi. démo'!J44","v":4},{"$f":"+'D3 Données épi. démo'!K44","v":4},{"$f":"+'D3 Données épi. démo'!L44","v":4},{"$f":"+'D3 Données épi. démo'!M44","v":4},{"$f":"+'D3 Données épi. démo'!N44","v":4},{"$f":"+'D3 Données épi. démo'!O44","v":4},{"$f":"+'D3 Données épi. démo'!P44","v":4},{"$f":"+'D3 Données épi. démo'!Q44","v":4},{"$f":"+'D3 Données épi. démo'!R44","v":4}]
[null,null,"Nombre de sites de PEC MAS ambulatoire","sites","Feuille de calcul  D9",{"$f":"+'D9 Variables temps'!F29","v":2},null,null,null,{"$f":"+'D9 Variables temps'!J29","v":0},{"$f":"+'D9 Variables temps'!K29","v":0},{"$f":"+'D9 Variables temps'!L29","v":0},{"$f":"+'D9 Variables temps'!M29","v":0},{"$f":"+'D9 Variables temps'!N29","v":0},{"$f":"+'D9 Variables temps'!O29","v":0},{"$f":"+'D9 Variables temps'!P29","v":0},{"$f":"+'D9 Variables temps'!Q29","v":0},{"$f":"+'D9 Variables temps'!R29","v":0}]
[null,null,"Nombre de visites par enfant avec MAS ","visites","Feuille de calcul  D3",{"$f":"+'D3 Données épi. démo'!F33","v":8},null,null,null,{"$f":"+'D3 Données épi. démo'!J33","v":8},{"$f":"+'D3 Données épi. démo'!K33","v":8},{"$f":"+'D3 Données épi. démo'!L33","v":8},{"$f":"+'D3 Données épi. démo'!M33","v":8},{"$f":"+'D3 Données épi. démo'!N33","v":8},{"$f":"+'D3 Données épi. démo'!O33","v":8},{"$f":"+'D3 Données épi. démo'!P33","v":8},{"$f":"+'D3 Données épi. démo'!Q33","v":8},{"$f":"+'D3 Données épi. démo'!R33","v":8}]
[null,null,"Nombre de cas de MAS par an assistant aux séances de la PEC MAS ambulatoire","cas","Feuille de calcul  D9",{"$f":"+'D9 Variables temps'!F40","v":135},null,null,null,{"$f":"+'D9 Variables temps'!J40","v":0},{"$f":"+'D9 Variables temps'!K40","v":0},{"$f":"+'D9 Variables temps'!L40","v":0},{"$f":"+'D9 Variables temps'!M40","v":0},{"$f":"+'D9 Variables temps'!N40","v":0},{"$f":"+'D9 Variables temps'!O40","v":0},{"$f":"+'D9 Variables temps'!P40","v":0},{"$f":"+'D9 Variables temps'!Q40","v":0},{"$f":"+'D9 Variables temps'!R40","v":0}]
[null,null,"Durée des soins (longueur du séjour)","semaines","Feuille de calcul  D3",{"$f":"+'D3 Données épi. démo'!F32","v":8},null,null,null,{"$f":"+'D3 Données épi. démo'!J32","v":8},{"$f":"+'D3 Données épi. démo'!K32","v":8},{"$f":"+'D3 Données épi. démo'!L32","v":8},{"$f":"+'D3 Données épi. démo'!M32","v":8},{"$f":"+'D3 Données épi. démo'!N32","v":8},{"$f":"+'D3 Données épi. démo'!O32","v":8},{"$f":"+'D3 Données épi. démo'!P32","v":8},{"$f":"+'D3 Données épi. démo'!Q32","v":8},{"$f":"+'D3 Données épi. démo'!R32","v":8}]
[null,null,"Nombre maximum d'enfants participant à une session PEC MAS ambulatoire",null,"Feuille de calcul D3",{"$f":"+'D3 Données épi. démo'!F34","v":15},null,null,null,{"$f":"+'D3 Données épi. démo'!J34","v":15},{"$f":"+'D3 Données épi. démo'!K34","v":15},{"$f":"+'D3 Données épi. démo'!L34","v":15},{"$f":"+'D3 Données épi. démo'!M34","v":15},{"$f":"+'D3 Données épi. démo'!N34","v":15},{"$f":"+'D3 Données épi. démo'!O34","v":15},{"$f":"+'D3 Données épi. démo'!P34","v":15},{"$f":"+'D3 Données épi. démo'!Q34","v":15},{"$f":"+'D3 Données épi. démo'!R34","v":15}]
[null,null,"Heures dans une journée de travail","heures","Feuille de calcul  D3",{"$f":"+'D3 Données épi. démo'!F35","v":8},null,null,null,{"$f":"+'D3 Données épi. démo'!J35","v":8},{"$f":"+'D3 Données épi. démo'!K35","v":8},{"$f":"+'D3 Données épi. démo'!L35","v":8},{"$f":"+'D3 Données épi. démo'!M35","v":8},{"$f":"+'D3 Données épi. démo'!N35","v":8},{"$f":"+'D3 Données épi. démo'!O35","v":8},{"$f":"+'D3 Données épi. démo'!P35","v":8},{"$f":"+'D3 Données épi. démo'!Q35","v":8},{"$f":"+'D3 Données épi. démo'!R35","v":8}]
[null,null,"Espace occupé par l'accompagnant et l'enfant par séance (par enfant avec MAS)","m2","Feuille de calcul  D3",{"$f":"+'D3 Données épi. démo'!F58","v":1},null,null,null,{"$f":"+'D3 Données épi. démo'!J58","v":1},{"$f":"+'D3 Données épi. démo'!K58","v":1},{"$f":"+'D3 Données épi. démo'!L58","v":1},{"$f":"+'D3 Données épi. démo'!M58","v":1},{"$f":"+'D3 Données épi. démo'!N58","v":1},{"$f":"+'D3 Données épi. démo'!O58","v":1},{"$f":"+'D3 Données épi. démo'!P58","v":1},{"$f":"+'D3 Données épi. démo'!Q58","v":1},{"$f":"+'D3 Données épi. démo'!R58","v":1}]
[null,null,"Durée de la séance (temps que l'accompagnant et l'enfant passent au site par visite) ","heures","Feuille de calcul  D3",{"$f":"+'D3 Données épi. démo'!F59","v":4},null,null,null,{"$f":"+'D3 Données épi. démo'!J59","v":4},{"$f":"+'D3 Données épi. démo'!K59","v":4},{"$f":"+'D3 Données épi. démo'!L59","v":4},{"$f":"+'D3 Données épi. démo'!M59","v":4},{"$f":"+'D3 Données épi. démo'!N59","v":4},{"$f":"+'D3 Données épi. démo'!O59","v":4},{"$f":"+'D3 Données épi. démo'!P59","v":4},{"$f":"+'D3 Données épi. démo'!Q59","v":4},{"$f":"+'D3 Données épi. démo'!R59","v":4}]
[null,null,"Espace occupé par le personnel soignant les enfants avec MAS au site (par membre de personnel actif dans la PEC MAS ambulatoire pour la MAS).","m2","Feuille de calcul D3",{"$f":"+'D3 Données épi. démo'!F60","v":4},null,null,null,{"$f":"+'D3 Données épi. démo'!J60","v":4},{"$f":"+'D3 Données épi. démo'!K60","v":4},{"$f":"+'D3 Données épi. démo'!L60","v":4},{"$f":"+'D3 Données épi. démo'!M60","v":4},{"$f":"+'D3 Données épi. démo'!N60","v":4},{"$f":"+'D3 Données épi. démo'!O60","v":4},{"$f":"+'D3 Données épi. démo'!P60","v":4},{"$f":"+'D3 Données épi. démo'!Q60","v":4},{"$f":"+'D3 Données épi. démo'!R60","v":4}]
[null,null,"Calculs"]
[null,null,"Nombre d'enfants < 6 mois avec MAS qui ont besoin de PEC MAS hospitalière",null,null,{"$f":"+F123*F127/100","v":15},null,null,null,{"$f":"+J123*J127/100","v":0},0,0,0,0,0,0,0,0]
[null,null,"Nombre moyen d'enfants avec MAS participant à n'importe quel moment à chaque site","cas","No. d'enfants avec MAS par session * durée de soins (en semaines) + no. d'enfants < 6 mois (qui auront une seule visite) / 52 / no. de sites",{"$f":"+IF(F78=0,0,((F80*F81+F88)/52)/F78)","v":10.528846153846153},null,null,null,{"$f":"+IF(J78=0,0,((J80*J81+J88)/52)/J78)","v":0},0,0,0,0,0,0,0,0]
[null,null,"Nombre de groupes dans la zone","groupes","ARRONDIR (cas MAS par site/ maximum par group) * no. de sites",{"$f":"+ROUNDUP(F89/F82,0)*F78","v":2},null,null,null,{"$f":"+ROUNDUP(J89/J82,0)*J78","v":0},0,0,0,0,0,0,0,0]
[null,null,"Fréquence des séances (par semaine)","réunions","No. de visites/cas/durée des soins (semaines)",{"$f":"+F79/F81","v":1},null,null,null,{"$f":"+J79/J81","v":1},1,1,1,1,1,1,1,1]
[null,null,"Nombre de séances de groupes par an dans la zone","sessions","No. de groupes dans la zone * réunions par semaine * 52",{"$f":"+F90*F91*52","v":104},null,null,null,{"$f":"+J90*J91*52","v":0},0,0,0,0,0,0,0,0]
[null,null,"Nombre de session-jours",null,"Nombre de séances * heures dans une séance / heures dans une journée de travail",{"$f":"+F92*F85/F83","v":52},null,null,null,{"$f":"+J92*J85/J83","v":0},0,0,0,0,0,0,0,0]
[null,null,"Nombre de visites MAS pour tous les cas par an dans la zone","visites","No. de cas de MAS * no. de visites sur le site par cas de MAS",{"$f":"+F80*F79","v":1080},null,null,null,{"$f":"+J80*J79","v":0},0,0,0,0,0,0,0,0]
[null,null,"Temps total de personnel senior par an dans cette zone","jours","(Heures par visite * no. de visites par an + heures par session * no. de sessions par an + heures par site par mois * 12 * no. de sites) / heures dans une journée de travail ",{"$f":"+(F72*F94+F73*F92+F74*12*F78)/F83","v":71.75},null,null,null,{"$f":"+(J72*J94+J73*J92+J74*12*J78)/J83","v":0},0,0,0,0,0,0,0,0]
[null,null,"Temps total de personnel junior par an dans cette zone","jours","(heures par visite * no. de visites par an + heures par séance * no. de séances par an + heures par site par mois * 12 * no. de sites) / heures dans une journée de travail ",{"$f":"+(F75*F94+F76*F92+F77*F78*12)/F83","v":71.75},null,null,null,{"$f":"+(J75*J94+J76*J92+J77*J78*12)/J83","v":0},0,0,0,0,0,0,0,0]
[null,null,"Espace nécessaire par séance","m2","Espace par enfant * no. d'enfants par séance + no. d'heures du personnel par séance / durée de la séance * espace par membre du pesonnel",{"$f":"+IF(F92=0,0,F84*F89+(F95+F96)*F83/F92/F85*F86)","v":21.567307692307693},null,null,null,{"$f":"+IF(J92=0,0,J84*J89+(J95+J96)*J83/J92/J85*J86)","v":0},0,0,0,0,0,0,0,0]
[null,null,"Espace total nécessaire pour toutes les séances de la MAS par an  ","m2/year","Espace total pout toutes les session * jours par session / jours de travail par an",{"$f":"+F97*F92*F85/F83/(52*5)","v":4.3134615384615387},null,null,null,{"$f":"+J97*J92*J85/J83/(52*5)","v":0},0,0,0,0,0,0,0,0]
[null,null,"Prix"]
[null,null,"Coût par jour du personnel senior participant au traitement de la MAS  ",null,"Feuille de calcul D5",{"$f":"+'D5 Salaires'!J32","v":39.230769230769234},null,null,null,{"$f":"+$F$100*'D4 Prix'!J81","v":0},{"$f":"+$F$100*'D4 Prix'!K81","v":0},{"$f":"+$F$100*'D4 Prix'!L81","v":0},{"$f":"+$F$100*'D4 Prix'!M81","v":0},{"$f":"+$F$100*'D4 Prix'!N81","v":0},{"$f":"+$F$100*'D4 Prix'!O81","v":0},{"$f":"+$F$100*'D4 Prix'!P81","v":0},{"$f":"+$F$100*'D4 Prix'!Q81","v":0},{"$f":"+$F$100*'D4 Prix'!R81","v":0}]
[null,null,"Coût par jour du personnel junior du site PEC MAS ambulatoire participant au traitement de la MAS ",null,"Feuille de calcul D5",{"$f":"+'D5 Salaires'!J33","v":18.46153846153846},null,null,null,{"$f":"+$F$101*'D4 Prix'!J81","v":0},{"$f":"+$F$101*'D4 Prix'!K81","v":0},{"$f":"+$F$101*'D4 Prix'!L81","v":0},{"$f":"+$F$101*'D4 Prix'!M81","v":0},{"$f":"+$F$101*'D4 Prix'!N81","v":0},{"$f":"+$F$101*'D4 Prix'!O81","v":0},{"$f":"+$F$101*'D4 Prix'!P81","v":0},{"$f":"+$F$101*'D4 Prix'!Q81","v":0},{"$f":"+$F$101*'D4 Prix'!R81","v":0}]
[null,null,"Coût par  m2 par an pour l'espace de la PEC MAS ambulatoire",null,"Feuille de calcul D4",{"$f":"+'D4 Prix'!F24","v":0},null,null,null,{"$f":"+'D4 Prix'!J24","v":0},{"$f":"+'D4 Prix'!K24","v":0},{"$f":"+'D4 Prix'!L24","v":0},{"$f":"+'D4 Prix'!M24","v":0},{"$f":"+'D4 Prix'!N24","v":0},{"$f":"+'D4 Prix'!O24","v":0},{"$f":"+'D4 Prix'!P24","v":0},{"$f":"+'D4 Prix'!Q24","v":0},{"$f":"+'D4 Prix'!R24","v":0}]
[null,null,"Sites PEC MAS hospitalière"]
[null,null,"Calculs"]
[null,null,"% de  jours pendant l'année où les sites de la PEC MAS hospitalière auront probablement au moins un enfant avec MAS ","%","Suppose que les cas sont distribués également dans le temps et entre les sites PEC MAS hospitalière (No.cas * Durée du séjour * 100 / (365 * no. de sites)",{"$f":"+IF((F107*F126+F108*F125)>365*F124,100,(F107*F126+F108*F125)*100/365*F124)","v":100},null,null,null,{"$f":"+IF((J107*J126+J108*J125)>365*J124,100,(J107*J126+J108*J125)*100/365*J124)","v":0},0,0,0,0,0,0,0,0]
[null,null,"Heures minimum pendant lesquelles les sites PEC MAS hospitalière doivent avoir du personnel","heures","assuming  that  24 hour care (and given 365 * 24 heures in a year) even if only one child hospitalised",{"$f":"+F105/100*365*24*F124","v":8760},null,null,null,{"$f":"+J105/100*365*24*J124","v":0},0,0,0,0,0,0,0,0]
[null,null,"Nombre d'enfants < 6 mois avec MAS qui ont besoin de PEC MAS hospitalière",null,null,{"$f":"+F123*F127/100","v":15},null,null,null,{"$f":"+J123*J127/100","v":0},0,0,0,0,0,0,0,0]
[null,null,"Nombre d'enfants de 6-59 mois qui ont des complications et qui ont besoin de PEC MAS hospitalière",null,null,{"$f":"+F123*(1-F127/100)*F128","v":20.25},null,null,null,{"$f":"+J123*(1-J127/100)*J128","v":0},0,0,0,0,0,0,0,0]
[null,null,"Temps total de personnel senior par an dans cette zone ","heures","(heures par cas de MAS * no. de cas + heures par jour * no.jours avec des patients) / no. d' heures dans une journée de travail",{"$f":"+(F123*F114+F107*F117*(F126-2)+F108*F117*(F125-2)+F122*F105/100*52*F124)","v":851},null,null,null,{"$f":"+(J123*J114+J107*J117*(J126-2)+J108*J117*(J125-2)+J122*J105/100*52*J124)","v":0},0,0,0,0,0,0,0,0]
[null,null,"Temps total de personnel junior par an dans cette zone","heures","Somme du temps nécessaire pour les activités. Si cette valeur est moins que les heures minimum (F66), le minimum est noté ici.",{"$f":"+IF((F107+F108)*(F115+F120*3)+F107*(F118*(F126-2)+F121*(F126-3))>F106,(F107+F108)*(F115+F120*3)+F107*(F118*(F126-2)+F121*(F126-3)),F106)","v":8760},null,null,null,{"$f":"+IF((J107+J108)*(J115+J120*3)+J107*(J118*(J126-2)+J121*(J126-3))>J106,(J107+J108)*(J115+J120*3)+J107*(J118*(J126-2)+J121*(J126-3)),J106)","v":0},0,0,0,0,0,0,0,0]
[null,null,"Volume d'espace nécessaire pour les patients hospitalisés","m2","No. de cas de MAS dans la PEC MAS hospitalière à n'importe quel moment du temps  * espace occupé par cas de MAS  + espace pour le personnel. ",{"$f":"+F129*F131+F130","v":19},null,null,null,{"$f":"+J129*J131+J130","v":0},0,0,0,0,0,0,0,0]
[null,null,"Drivers de base, données brutes"]
[null,null,"Bilan clinique (heures par enfant)"]
[null,null,"Personnel senior (infirmier, médecin, diététicien)","heures","Feuille de calcul  D3",{"$f":"+'D3 Données épi. démo'!F47","v":2},null,null,null,{"$f":"+'D3 Données épi. démo'!J47","v":2},{"$f":"+'D3 Données épi. démo'!K47","v":2},{"$f":"+'D3 Données épi. démo'!L47","v":2},{"$f":"+'D3 Données épi. démo'!M47","v":2},{"$f":"+'D3 Données épi. démo'!N47","v":2},{"$f":"+'D3 Données épi. démo'!O47","v":2},{"$f":"+'D3 Données épi. démo'!P47","v":2},{"$f":"+'D3 Données épi. démo'!Q47","v":2},{"$f":"+'D3 Données épi. démo'!R47","v":2}]
[null,null,"Personnel junior  (infirmier)","heures","Feuille de calcul D3",{"$f":"+'D3 Données épi. démo'!F48","v":2},null,null,null,{"$f":"+'D3 Données épi. démo'!J48","v":2},{"$f":"+'D3 Données épi. démo'!K48","v":2},{"$f":"+'D3 Données épi. démo'!L48","v":2},{"$f":"+'D3 Données épi. démo'!M48","v":2},{"$f":"+'D3 Données épi. démo'!N48","v":2},{"$f":"+'D3 Données épi. démo'!O48","v":2},{"$f":"+'D3 Données épi. démo'!P48","v":2},{"$f":"+'D3 Données épi. démo'!Q48","v":2},{"$f":"+'D3 Données épi. démo'!R48","v":2}]
[null,null,"Bilan clinique (par jour d'hospitalisation par enfant)",null,null,{"$f":"+'D3 Données épi. démo'!F49","v":0},null,null,null,{"$f":"+'D3 Données épi. démo'!J49","v":0},{"$f":"+'D3 Données épi. démo'!K49","v":0},{"$f":"+'D3 Données épi. démo'!L49","v":0},{"$f":"+'D3 Données épi. démo'!M49","v":0},{"$f":"+'D3 Données épi. démo'!N49","v":0},{"$f":"+'D3 Données épi. démo'!O49","v":0},{"$f":"+'D3 Données épi. démo'!P49","v":0},{"$f":"+'D3 Données épi. démo'!Q49","v":0},{"$f":"+'D3 Données épi. démo'!R49","v":0}]
[null,null,"Personnel senior (infirmier, médecin, diététicien)","heures","Feuille de calcul  D3",{"$f":"+'D3 Données épi. démo'!F50","v":0.5},null,null,null,{"$f":"+'D3 Données épi. démo'!J50","v":0.5},{"$f":"+'D3 Données épi. démo'!K50","v":0.5},{"$f":"+'D3 Données épi. démo'!L50","v":0.5},{"$f":"+'D3 Données épi. démo'!M50","v":0.5},{"$f":"+'D3 Données épi. démo'!N50","v":0.5},{"$f":"+'D3 Données épi. démo'!O50","v":0.5},{"$f":"+'D3 Données épi. démo'!P50","v":0.5},{"$f":"+'D3 Données épi. démo'!Q50","v":0.5},{"$f":"+'D3 Données épi. démo'!R50","v":0.5}]
[null,null,"Personnel junior  (infirmier)","heures","Feuille de calcul D3",{"$f":"+'D3 Données épi. démo'!F51","v":0.5},null,null,null,{"$f":"+'D3 Données épi. démo'!J51","v":0.5},{"$f":"+'D3 Données épi. démo'!K51","v":0.5},{"$f":"+'D3 Données épi. démo'!L51","v":0.5},{"$f":"+'D3 Données épi. démo'!M51","v":0.5},{"$f":"+'D3 Données épi. démo'!N51","v":0.5},{"$f":"+'D3 Données épi. démo'!O51","v":0.5},{"$f":"+'D3 Données épi. démo'!P51","v":0.5},{"$f":"+'D3 Données épi. démo'!Q51","v":0.5},{"$f":"+'D3 Données épi. démo'!R51","v":0.5}]
[null,null,"Préparation de la nourriture  - personnel junior (heures par jour par site)","heures","Feuille de calcul  D3",{"$f":"+'D3 Données épi. démo'!F52","v":3},null,null,null,{"$f":"+'D3 Données épi. démo'!J52","v":3},{"$f":"+'D3 Données épi. démo'!K52","v":3},{"$f":"+'D3 Données épi. démo'!L52","v":3},{"$f":"+'D3 Données épi. démo'!M52","v":3},{"$f":"+'D3 Données épi. démo'!N52","v":3},{"$f":"+'D3 Données épi. démo'!O52","v":3},{"$f":"+'D3 Données épi. démo'!P52","v":3},{"$f":"+'D3 Données épi. démo'!Q52","v":3},{"$f":"+'D3 Données épi. démo'!R52","v":3}]
[null,null,"Supervision de l'alimentation les trois premiers jours- personnel junior (heures/enfant/jour)","heures","Feuille de calcul  D3",{"$f":"+'D3 Données épi. démo'!F53","v":2},null,null,null,{"$f":"+'D3 Données épi. démo'!J53","v":2},{"$f":"+'D3 Données épi. démo'!K53","v":2},{"$f":"+'D3 Données épi. démo'!L53","v":2},{"$f":"+'D3 Données épi. démo'!M53","v":2},{"$f":"+'D3 Données épi. démo'!N53","v":2},{"$f":"+'D3 Données épi. démo'!O53","v":2},{"$f":"+'D3 Données épi. démo'!P53","v":2},{"$f":"+'D3 Données épi. démo'!Q53","v":2},{"$f":"+'D3 Données épi. démo'!R53","v":2}]
[null,null,"Supervision de l'alimentation après les trois premiers jours-personnel junior  (heures par jour par site)","heures","Feuille de calcul D3",{"$f":"+'D3 Données épi. démo'!F54","v":1},null,null,null,{"$f":"+'D3 Données épi. démo'!J54","v":1},{"$f":"+'D3 Données épi. démo'!K54","v":1},{"$f":"+'D3 Données épi. démo'!L54","v":1},{"$f":"+'D3 Données épi. démo'!M54","v":1},{"$f":"+'D3 Données épi. démo'!N54","v":1},{"$f":"+'D3 Données épi. démo'!O54","v":1},{"$f":"+'D3 Données épi. démo'!P54","v":1},{"$f":"+'D3 Données épi. démo'!Q54","v":1},{"$f":"+'D3 Données épi. démo'!R54","v":1}]
[null,null,"Tenue des rapports  - personnel senior  (heures par jour par site)","heures","Feuille de calcul D3",{"$f":"+'D3 Données épi. démo'!F55","v":5},null,null,null,{"$f":"+'D3 Données épi. démo'!J55","v":5},{"$f":"+'D3 Données épi. démo'!K55","v":5},{"$f":"+'D3 Données épi. démo'!L55","v":5},{"$f":"+'D3 Données épi. démo'!M55","v":5},{"$f":"+'D3 Données épi. démo'!N55","v":5},{"$f":"+'D3 Données épi. démo'!O55","v":5},{"$f":"+'D3 Données épi. démo'!P55","v":5},{"$f":"+'D3 Données épi. démo'!Q55","v":5},{"$f":"+'D3 Données épi. démo'!R55","v":5}]
[null,null,"Nombre de cas de MAS par an ","cas","Feuille de calcul D9",{"$f":"+'D9 Variables temps'!F39","v":150},null,null,null,{"$f":"+'D9 Variables temps'!J39","v":0},{"$f":"+'D9 Variables temps'!K39","v":0},{"$f":"+'D9 Variables temps'!L39","v":0},{"$f":"+'D9 Variables temps'!M39","v":0},{"$f":"+'D9 Variables temps'!N39","v":0},{"$f":"+'D9 Variables temps'!O39","v":0},{"$f":"+'D9 Variables temps'!P39","v":0},{"$f":"+'D9 Variables temps'!Q39","v":0},{"$f":"+'D9 Variables temps'!R39","v":0}]
[null,null,"Nombre de sites de la PEC MAS hospitalière","sites","Feuille de calcul D9",{"$f":"+'D9 Variables temps'!F32","v":1},null,null,null,{"$f":"+'D9 Variables temps'!J32","v":0},{"$f":"+'D9 Variables temps'!K32","v":0},{"$f":"+'D9 Variables temps'!L32","v":0},{"$f":"+'D9 Variables temps'!M32","v":0},{"$f":"+'D9 Variables temps'!N32","v":0},{"$f":"+'D9 Variables temps'!O32","v":0},{"$f":"+'D9 Variables temps'!P32","v":0},{"$f":"+'D9 Variables temps'!Q32","v":0},{"$f":"+'D9 Variables temps'!R32","v":0}]
[null,null,"Nombre de jours de la PEC MAS hospitalière pour les cas de MAS de 6-59 mois avec complications médicales","jours","Feuille de calcul D3",{"$f":"+'D3 Données épi. démo'!F29","v":10},null,null,null,{"$f":"+'D3 Données épi. démo'!J29","v":10},{"$f":"+'D3 Données épi. démo'!K29","v":10},{"$f":"+'D3 Données épi. démo'!L29","v":10},{"$f":"+'D3 Données épi. démo'!M29","v":10},{"$f":"+'D3 Données épi. démo'!N29","v":10},{"$f":"+'D3 Données épi. démo'!O29","v":10},{"$f":"+'D3 Données épi. démo'!P29","v":10},{"$f":"+'D3 Données épi. démo'!Q29","v":10},{"$f":"+'D3 Données épi. démo'!R29","v":10}]
[null,null,"Nombre de  jours dans la PEC MAS hospitalière pour les cas de MAS <6 mois","jours","Feuille de calcul  D3",{"$f":"+'D3 Données épi. démo'!F30","v":30},null,null,null,{"$f":"+'D3 Données épi. démo'!J30","v":30},{"$f":"+'D3 Données épi. démo'!K30","v":30},{"$f":"+'D3 Données épi. démo'!L30","v":30},{"$f":"+'D3 Données épi. démo'!M30","v":30},{"$f":"+'D3 Données épi. démo'!N30","v":30},{"$f":"+'D3 Données épi. démo'!O30","v":30},{"$f":"+'D3 Données épi. démo'!P30","v":30},{"$f":"+'D3 Données épi. démo'!Q30","v":30},{"$f":"+'D3 Données épi. démo'!R30","v":30}]
[null,null," % de tous les cas de MAS de  0-59 mois âgés < 6 mois","%","Feuille de calcul D3",{"$f":"+'D3 Données épi. démo'!F22","v":10},null,null,null,{"$f":"+'D3 Données épi. démo'!J22","v":0},{"$f":"+'D3 Données épi. démo'!K22","v":0},{"$f":"+'D3 Données épi. démo'!L22","v":0},{"$f":"+'D3 Données épi. démo'!M22","v":0},{"$f":"+'D3 Données épi. démo'!N22","v":0},{"$f":"+'D3 Données épi. démo'!O22","v":0},{"$f":"+'D3 Données épi. démo'!P22","v":0},{"$f":"+'D3 Données épi. démo'!Q22","v":0},{"$f":"+'D3 Données épi. démo'!R22","v":0}]
[null,null,"Proportion de cas de MAS âgés de 6 à 59 mois qui ont des complications et qui ont besoin de la PEC MAS hospitalière","proportion","Feuille de calcul D3",{"$f":"+'D3 Données épi. démo'!F27","v":0.15},null,null,null,{"$f":"+'D3 Données épi. démo'!J27","v":0.15},{"$f":"+'D3 Données épi. démo'!K27","v":0.15},{"$f":"+'D3 Données épi. démo'!L27","v":0.15},{"$f":"+'D3 Données épi. démo'!M27","v":0.15},{"$f":"+'D3 Données épi. démo'!N27","v":0.15},{"$f":"+'D3 Données épi. démo'!O27","v":0.15},{"$f":"+'D3 Données épi. démo'!P27","v":0.15},{"$f":"+'D3 Données épi. démo'!Q27","v":0.15},{"$f":"+'D3 Données épi. démo'!R27","v":0.15}]
[null,null,"Espace occupé par les patients hospitalisés (un lit d'hôpital avec de la place suffisante autour pour que l'accompagnant et le personnel puissent se déplacer)","m2","Feuille de calcul D3",{"$f":"+'D3 Données épi. démo'!F62","v":7},null,null,null,{"$f":"+'D3 Données épi. démo'!J62","v":7},{"$f":"+'D3 Données épi. démo'!K62","v":7},{"$f":"+'D3 Données épi. démo'!L62","v":7},{"$f":"+'D3 Données épi. démo'!M62","v":7},{"$f":"+'D3 Données épi. démo'!N62","v":7},{"$f":"+'D3 Données épi. démo'!O62","v":7},{"$f":"+'D3 Données épi. démo'!P62","v":7},{"$f":"+'D3 Données épi. démo'!Q62","v":7},{"$f":"+'D3 Données épi. démo'!R62","v":7}]
[null,null,"Espace occupé par le personnel soignant les patients hospitalisés","m2","Feuille de calcul D3",{"$f":"+'D3 Données épi. démo'!F63*F124","v":5},null,null,null,{"$f":"+'D3 Données épi. démo'!J63*J124","v":0},{"$f":"+'D3 Données épi. démo'!K63*K124","v":0},{"$f":"+'D3 Données épi. démo'!L63*L124","v":0},{"$f":"+'D3 Données épi. démo'!M63*M124","v":0},{"$f":"+'D3 Données épi. démo'!N63*N124","v":0},{"$f":"+'D3 Données épi. démo'!O63*O124","v":0},{"$f":"+'D3 Données épi. démo'!P63*P124","v":0},{"$f":"+'D3 Données épi. démo'!Q63*Q124","v":0},{"$f":"+'D3 Données épi. démo'!R63*R124","v":0}]
[null,null,"Nombre de cas de MAS dans la PEC MAS hospitalière à n'importe quel moment (arrondi)",null,"Feuille de calcul D9",{"$f":"+'D9 Variables temps'!F43","v":2},null,null,null,{"$f":"+'D9 Variables temps'!J43","v":0},{"$f":"+'D9 Variables temps'!K43","v":0},{"$f":"+'D9 Variables temps'!L43","v":0},{"$f":"+'D9 Variables temps'!M43","v":0},{"$f":"+'D9 Variables temps'!N43","v":0},{"$f":"+'D9 Variables temps'!O43","v":0},{"$f":"+'D9 Variables temps'!P43","v":0},{"$f":"+'D9 Variables temps'!Q43","v":0},{"$f":"+'D9 Variables temps'!R43","v":0}]
[null,null,"Prix"]
[null,null,"Coût par jour du personnel senior participant au traitement de la MAS ",{"$f":"+'D1 Données générales'!$H$13","v":"Cedi"},"Feuille de calcul D5",{"$f":"+'D5 Salaires'!J36","v":83.07692307692308},null,null,null,{"$f":"+$F$133*'D4 Prix'!J81","v":0},{"$f":"+$F$133*'D4 Prix'!K81","v":0},{"$f":"+$F$133*'D4 Prix'!L81","v":0},{"$f":"+$F$133*'D4 Prix'!M81","v":0},{"$f":"+$F$133*'D4 Prix'!N81","v":0},{"$f":"+$F$133*'D4 Prix'!O81","v":0},{"$f":"+$F$133*'D4 Prix'!P81","v":0},{"$f":"+$F$133*'D4 Prix'!Q81","v":0},{"$f":"+$F$133*'D4 Prix'!R81","v":0}]
[null,null,"Coût par jour du personnel junior participant au traitement de la MAS ",{"$f":"+'D1 Données générales'!$H$13","v":"Cedi"},"Feuille de calcul D5",{"$f":"+'D5 Salaires'!J38","v":11.538461538461538},null,null,null,{"$f":"+$F$134*'D4 Prix'!J81","v":0},{"$f":"+$F$134*'D4 Prix'!K81","v":0},{"$f":"+$F$134*'D4 Prix'!L81","v":0},{"$f":"+$F$134*'D4 Prix'!M81","v":0},{"$f":"+$F$134*'D4 Prix'!N81","v":0},{"$f":"+$F$134*'D4 Prix'!O81","v":0},{"$f":"+$F$134*'D4 Prix'!P81","v":0},{"$f":"+$F$134*'D4 Prix'!Q81","v":0},{"$f":"+$F$134*'D4 Prix'!R81","v":0}]
[null,null,"Coût par  m2 par an pour l'espace de la PEC MAS hospitalière",{"$f":"+'D1 Données générales'!$H$13","v":"Cedi"},"Feuille de calcul D4",{"$f":"+'D4 Prix'!F25","v":0},null,null,null,{"$f":"+'D4 Prix'!J25","v":0},{"$f":"+'D4 Prix'!K25","v":0},{"$f":"+'D4 Prix'!L25","v":0},{"$f":"+'D4 Prix'!M25","v":0},{"$f":"+'D4 Prix'!N25","v":0},{"$f":"+'D4 Prix'!O25","v":0},{"$f":"+'D4 Prix'!P25","v":0},{"$f":"+'D4 Prix'!Q25","v":0},{"$f":"+'D4 Prix'!R25","v":0}]

{"sheet":"R9 Traitement (médicaments)","index":23,"n_rows":91,"n_cols":30,"rows_kept":91,"cut":false,"hidden":false,"merged":[[71,2,72,2],[13,0,23,0],[63,2,63,3],[62,2,62,3],[58,2,59,2],[25,0,39,0],[58,1,59,1],[71,1,72,1],[11,9,12,9],[69,1,70,1],[26,6,26,7],[55,7,55,8],[67,5,68,5],[64,2,64,3],[67,2,68,2],[67,1,68,1],[69,2,70,2],[4,2,4,8],[3,1,3,2],[23,2,23,4],[14,6,14,7],[9,2,9,3],[10,2,10,3],[114,4,114,5],[113,4,113,5],[81,4,81,6],[82,4,82,6],[89,4,89,6],[90,4,90,6],[86,4,86,6],[88,4,88,6],[73,1,74,1],[73,2,74,2],[87,4,87,6],[85,4,85,6],[80,4,80,6],[79,4,79,6],[84,4,84,6],[83,4,83,6],[55,28,55,29],[55,24,55,25],[55,12,55,13],[55,20,55,21],[55,22,55,23],[55,26,55,27],[55,16,55,17],[55,14,55,15],[55,18,55,19]]}
[]
["Retour au sommaire",null,"R9: Traitement (fournitures médicales)"]
[]
[null,"Number of Areas included ",null,{"$f":"+'D2 Echelle'!I8","v":1},"  (taken from Worksheet 2)"]
[null,null,"Cette feuille de calcul montre (pour l'année choisie) les quantités de fournitures médicales nécessaires pour la prise en charge des cas (traitement) et les coûts de ces intrants. "]
[]
[null,null,"Voir ci-dessous pour la manière dont sont calculés les chiffres"]
[]
[]
[null,null,{"$f":"+IF('D1 Données générales'!$H$11=\"\",\"\",'D1 Données générales'!$H$11)","v":"Ghana"}]
[null,null,{"$f":"+'D9 Variables temps'!I6","v":2011},null,null,null,null,null,"Zone 1",null,null,null,null,"Zone 2",null,"Zone 3",null,"Zone 4",null,"Zone 5",null,"Zone 6",null,"Zone 7",null,"Zone 8",null,"Zone 9",null,"Zone 10"]
[null,null,null,null,null,null,{"$f":"'D2 Echelle'!$C$30","v":"district"},null,{"$f":"+IF('D2 Echelle'!$C$31=\"\",\"\",'D2 Echelle'!$C$31)","v":"Ashiedu Keteke"},null,null,null,null,{"$f":"+IF('D2 Echelle'!$C$36=\"\",\"\",'D2 Echelle'!$C$36)","v":""},null,{"$f":"+IF('D2 Echelle'!$C$41=\"\",\"\",'D2 Echelle'!$C$41)","v":""},null,{"$f":"+IF('D2 Echelle'!$C$46=\"\",\"\",'D2 Echelle'!$C$46)","v":""},null,{"$f":"+IF('D2 Echelle'!$C$51=\"\",\"\",'D2 Echelle'!$C$51)","v":""},null,{"$f":"+IF('D2 Echelle'!$C$56=\"\",\"\",'D2 Echelle'!$C$56)","v":""},null,{"$f":"+IF('D2 Echelle'!$C$61=\"\",\"\",'D2 Echelle'!$C$61)","v":""},null,{"$f":"+IF('D2 Echelle'!$C$66=\"\",\"\",'D2 Echelle'!$C$66)","v":""},null,{"$f":"+IF('D2 Echelle'!$C$71=\"\",\"\",'D2 Echelle'!$C$71)","v":""},null,{"$f":"+IF('D2 Echelle'!$C$76=\"\",\"\",'D2 Echelle'!$C$76)","v":""}]
[null,null,null,null,null,null,{"$f":"+'D2 Echelle'!$D$30","v":"région"},null,{"$f":"+IF('D2 Echelle'!$D$31=\"\",\"\",'D2 Echelle'!$D$31)","v":"Greater Accra"},null,null,null,null,{"$f":"+IF('D2 Echelle'!$D$36=\"\",\"\",'D2 Echelle'!$D$36)","v":""},null,{"$f":"+IF('D2 Echelle'!$D$41=\"\",\"\",'D2 Echelle'!$D$41)","v":""},null,{"$f":"+IF('D2 Echelle'!$D$46=\"\",\"\",'D2 Echelle'!$D$46)","v":""},null,{"$f":"+IF('D2 Echelle'!$D$51=\"\",\"\",'D2 Echelle'!$D$51)","v":""},null,{"$f":"+IF('D2 Echelle'!$D$56=\"\",\"\",'D2 Echelle'!$D$56)","v":""},null,{"$f":"+IF('D2 Echelle'!$D$61=\"\",\"\",'D2 Echelle'!$D$61)","v":""},null,{"$f":"+IF('D2 Echelle'!$D$66=\"\",\"\",'D2 Echelle'!$D$66)","v":""},null,{"$f":"+IF('D2 Echelle'!$D$71=\"\",\"\",'D2 Echelle'!$D$71)","v":""},null,{"$f":"+IF('D2 Echelle'!$D$76=\"\",\"\",'D2 Echelle'!$D$76)","v":""}]
[null,null,"Coûts annuels de cette activité "]
[null,null,"Variables",null,null,"Unités","Commentaires"]
[null,null,"Traitement des infections",null,"  ",{"$f":"+IF('D1 Données générales'!$H$13=\"\",\"\",'D1 Données générales'!$H$13)","v":"Cedi"},null,null,{"$f":"+I58*$G$58","v":450},null,null,null,null,{"$f":"+N58*$G$58","v":0},null,{"$f":"+P58*$G$58","v":0},null,{"$f":"+R58*$G$58","v":0},null,{"$f":"+T58*$G$58","v":0},null,{"$f":"+V58*$G$58","v":0},null,{"$f":"+X58*$G$58","v":0},null,{"$f":"+Z58*$G$58","v":0},null,{"$f":"+AB58*$G$58","v":0},null,{"$f":"+AD58*$G$58","v":0}]
[null,null,"Traitement et prévention de la diarrhée",null," ",{"$f":"+IF('D1 Données générales'!$H$13=\"\",\"\",'D1 Données générales'!$H$13)","v":"Cedi"},null,null,{"$f":"+I61*$G$61+I62*$G$62","v":17.737499999999997},null,null,null,null,{"$f":"+N61*$G$61+N62*$G$62","v":0},null,{"$f":"+P61*$G$61+P62*$G$62","v":0},null,{"$f":"+R61*$G$61+R62*$G$62","v":0},null,{"$f":"+T61*$G$61+T62*$G$62","v":0}," ",0," ",0," ",0," ",0," ",0]
[null,null,"Traitement du paludisme",null," ",{"$f":"+IF('D1 Données générales'!$H$13=\"\",\"\",'D1 Données générales'!$H$13)","v":"Cedi"},null,null,{"$f":"+I63*$G$63+I64*$G$64","v":450},null,null,null,null,{"$f":"+N63*$G$63+N64*$G$64","v":0},null,0,null,0,null,0,"  ",0," ",0," ",0," ",0," ",0]
[null,null,"Ensemble de tests pour les patients hospitalisés (non compris le paludisme)",null,null,null,null,null,{"$f":"+I34*$G$65","v":176.25},null,null,null,null,{"$f":"+N34*$G$65","v":0},null,0,null,0,null,0,null,0,null,0,null,0,null,0,null,0]
[null,null,"Kit IV et sonde naso-gastrique",null,null,null,null,null,{"$f":"+I35*$G$66+$G$67*I36","v":12.3375},null,null,null,null,{"$f":"+N35*$G$66+$G$67*N36","v":0},null,0,null,0,null,0,null,0,null,0,null,0,null,0,null,0]
[null,null,"Traitement vermifuge",null," ",{"$f":"+IF('D1 Données générales'!$H$13=\"\",\"\",'D1 Données générales'!$H$13)","v":"Cedi"},null,null,{"$f":"+$G$68*I68+$G$69*I69","v":11.61},null,null,null,null,{"$f":"+$G$68*N68+$G$69*N69","v":0},null,{"$f":"+$G$68*P68+$G$69*P69","v":0},null,{"$f":"+$G$68*R68+$G$69*R69","v":0},null,{"$f":"+$G$68*T68+$G$69*T69","v":0},null,{"$f":"+$G$68*V68+$G$69*V69","v":0},null,{"$f":"+$G$68*X68+$G$69*X69","v":0},null,{"$f":"+$G$68*Z68+$G$69*Z69","v":0},null,{"$f":"+$G$68*AB68+$G$69*AB69","v":0},null,{"$f":"+$G$68*AD68+$G$69*AD69","v":0}]
[null,null,"Fourniture de vitamine A",null," ",{"$f":"+IF('D1 Données générales'!$H$13=\"\",\"\",'D1 Données générales'!$H$13)","v":"Cedi"},null,null,{"$f":"+I59*$G$59+I60*$G$60","v":5.01},null,null,null,null,{"$f":"+N59*$G$59+N60*$G$60","v":0},null,{"$f":"+P59*$G$59+P60*$G$60","v":0},null,{"$f":"+R59*$G$59+R60*$G$60","v":0},null,{"$f":"+T59*$G$59+T60*$G$60","v":0},null,{"$f":"+V59*$G$59+V60*$G$60","v":0},null,{"$f":"+X59*$G$59+X60*$G$60","v":0},null,{"$f":"+Z59*$G$59+Z60*$G$60","v":0},null,{"$f":"+AB59*$G$59+AB60*$G$60","v":0},null,{"$f":"+AD59*$G$59+AD60*$G$60","v":0}]
[null,null,"Vaccination contre la rougeole",null," ",{"$f":"+IF('D1 Données générales'!$H$13=\"\",\"\",'D1 Données générales'!$H$13)","v":"Cedi"},null,null,{"$f":"+$G$70*I70+$G$72*I72+$G$74*I74+I71*$G$71+I73*$G$73+I75*$G$75","v":189.40499999999997},null,null,null,null,{"$f":"+$G$70*N70+$G$72*N72+$G$74*N74+N71*$G$71+N73*$G$73+N75*$G$75","v":0},null,0,null,0,null,0,null,0,null,0,null,0,null,0,null,0]
[null,null,"Coût annuel des médicaments",null,null,{"$f":"+IF('D1 Données générales'!$H$13=\"\",\"\",'D1 Données générales'!$H$13)","v":"Cedi"},null,null,{"$f":"+SUM(I16:I23)","v":1312.35},null,null,null,null,{"$f":"+SUM(N16:N23)","v":0},null,0,null,0,null,0,null,0," ",0," ",0," ",0," ",{"$f":"+SUM(AD17:AD23)","v":0}]
[]
[null,null,"Quantités d'intrants nécessaires pour cette activité"]
[null,null,"Variables",null,null,"Unités","Commentaires"]
[null,null,"Amoxicilline",null,null,"grammes",null,null,{"$f":"+I58","v":450},null,null,null,null,{"$f":"+N58","v":0},null,{"$f":"+P58","v":0},null,{"$f":"+R58","v":0},null,{"$f":"+T58","v":0},null,{"$f":"+V58","v":0},null,{"$f":"+X58","v":0},null,{"$f":"+Z58","v":0},null,{"$f":"+AB58","v":0},null,{"$f":"+AD58","v":0}]
[null,null,"Vitamine A",null,null,"Gélules 100 000 UI",null,null,{"$f":"+I59+I60","v":250.5},null,null,null,null,{"$f":"+N59+N60","v":0},null,{"$f":"+P59+P60","v":0},null,{"$f":"+R59+R60","v":0},null,{"$f":"+T59+T60","v":0},null,{"$f":"+V59+V60","v":0},null,{"$f":"+X59+X60","v":0},null,{"$f":"+Z59+Z60","v":0},null,{"$f":"+AB59+AB60","v":0},null,{"$f":"+AD59+AD60","v":0}]
[null,null,"Eau sucrée",null,null,"litres",null,null,{"$f":"+I61","v":108},null,null,null,null,{"$f":"+N61","v":0},null,{"$f":"+P61","v":0},null,{"$f":"+R61","v":0},null,{"$f":"+T61","v":0},null,{"$f":"+V61","v":0},null,{"$f":"+X61","v":0},null,{"$f":"+Z61","v":0},null,{"$f":"+AB61","v":0},null,{"$f":"+AD61","v":0}]
[null,null,"ReSoMal",null,null,"sachets",null,null,24.674999999999997,null,null,null,null,{"$f":"+N62","v":0},null,0,null,0,null,0,null,0,null,0,null,0,null,0]
[null,null,"Antipaludiques",null,null,"Traitement complet",null,null,150," "," "," "," ",0,null,0,null,0,null,0,null,0," ",0," ",0," ",0," ",{"$f":"+AD63","v":0}]
[null,null,"Test diagnostique du paludisme",null,null,"tests",null,null,0,null,null,null,null,{"$f":"+N64","v":0},null,{"$f":"+P64","v":0},null,{"$f":"+R64","v":0},null,{"$f":"+T64","v":0},null,{"$f":"+V64","v":0}," ",{"$f":"+X64","v":0}," ",{"$f":"+Z64","v":0}," ",{"$f":"+AB64","v":0}," ",{"$f":"+AD64","v":0}]
[null,null,"Ensemble de tests pour les patients hospitalisés ",null,null,"tests",null,null,35.25,null,null,null,null,{"$f":"+N65","v":0},null,0,null,0,null,0,null,0,null,0,null,0,null,0,null,0]
[null,null,"Kit IV ",null,null,"kits",null,null,3.5250000000000004,null,null,null,null,{"$f":"+N66","v":0},null,0,null,0,null,0,null,0,null,0,null,0,null,0,null,0]
[null,null,"Sonde naso-gastrique",null,null,"tubes",null,null,8.8125,null,null,null,null,{"$f":"+N67","v":0},null,0,null,0,null,0,null,0,null,0,null,0,null,0,null,0]
[null,null,"Albendazole",null,null,"Comprimés de 100 mg ",null,null,{"$f":"+I68+I69","v":387},null,null,null,null,{"$f":"+N68+N69","v":0},null,{"$f":"+P68+P69","v":0},null,{"$f":"+R68+R69","v":0},null,{"$f":"+T68+T69","v":0},null,{"$f":"+V68+V69","v":0},null,{"$f":"+X68+X69","v":0},null,{"$f":"+Z68+Z69","v":0},null,{"$f":"+AB68+AB69","v":0},null,{"$f":"+AD68+AD69","v":0}]
[null,null,"Vaccin contre la rougeole",null,null,"doses",null,null,{"$f":"+I70+I71","v":155.25},null,null,null,null,{"$f":"+N70+N71","v":0},null,{"$f":"+P70+P71","v":0},null,{"$f":"+R70+R71","v":0},null,{"$f":"+T70+T71","v":0},null,{"$f":"+V70+V71","v":0},null,{"$f":"+X70+X71","v":0},null,{"$f":"+Z70+Z71","v":0},null,{"$f":"+AB70+AB71","v":0},null,{"$f":"+AD70+AD71","v":0}]
[null,null,"Seringue autodestructible contre la rougeole",null,null,"seringues",null,null,{"$f":"+I72+I73","v":155.25},null,null,null,null,{"$f":"+N72+N73","v":0},null,{"$f":"+P72+P73","v":0},null,{"$f":"+R72+R73","v":0},null,{"$f":"+T72+T73","v":0},null,{"$f":"+V72+V73","v":0},null,{"$f":"+X72+X73","v":0},null,{"$f":"+Z72+Z73","v":0},null,{"$f":"+AB72+AB73","v":0},null,{"$f":"+AD72+AD73","v":0}]
[null,null,"Seringue de mélange",null,null,"seringues",null,null,{"$f":"+I74+I75","v":15.525000000000002},null,null,null,null,{"$f":"+N74+N75","v":0},null,{"$f":"+P74+P75","v":0},null,{"$f":"+R74+R75","v":0},null,{"$f":"+T74+T75","v":0},null,{"$f":"+V74+V75","v":0},null,{"$f":"+X74+X75","v":0},null,{"$f":"+Z74+Z75","v":0},null,{"$f":"+AB74+AB75","v":0},null,{"$f":"+AD74+AD75","v":0}]
[]
[]
[]
[]
[]
[]
[]
[]
[]
[]
[]
[]
[]
[]
["Haut de page",null,"Calculs",null,null,null,null,null,"Zone 1",null,null,null,null,"Zone 2"," ","Zone 3"," ","Zone 4",null,"Zone 5",null,"Zone 6",null,"Zone 7",null,"Zone 8",null,"Zone 9",null,"Zone 10"]
[null,"Articles","Qui en a besoin ? ","Cible","Dose/ cible","Unité de doses","Prix par unité",{"$f":"+IF('D2 Echelle'!$C$31=\"\",\"\",'D2 Echelle'!$C$31)","v":"Ashiedu Keteke"},{"$f":"+IF('D2 Echelle'!$C$31=\"\",\"\",'D2 Echelle'!$C$31)","v":"Ashiedu Keteke"},null,null,null,{"$f":"+IF('D2 Echelle'!$C$36=\"\",\"\",'D2 Echelle'!$C$36)","v":""},{"$f":"+IF('D2 Echelle'!$C$36=\"\",\"\",'D2 Echelle'!$C$36)","v":""},{"$f":"+IF('D2 Echelle'!$C$41=\"\",\"\",'D2 Echelle'!$C$41)","v":""},{"$f":"+IF('D2 Echelle'!$C$41=\"\",\"\",'D2 Echelle'!$C$41)","v":""},{"$f":"+IF('D2 Echelle'!$C$46=\"\",\"\",'D2 Echelle'!$C$46)","v":""},{"$f":"+IF('D2 Echelle'!$C$46=\"\",\"\",'D2 Echelle'!$C$46)","v":""},{"$f":"+IF('D2 Echelle'!$C$51=\"\",\"\",'D2 Echelle'!$C$51)","v":""},{"$f":"+IF('D2 Echelle'!$C$51=\"\",\"\",'D2 Echelle'!$C$51)","v":""},{"$f":"+IF('D2 Echelle'!$C$56=\"\",\"\",'D2 Echelle'!$C$56)","v":""},{"$f":"+IF('D2 Echelle'!$C$56=\"\",\"\",'D2 Echelle'!$C$56)","v":""},{"$f":"+IF('D2 Echelle'!$C$61=\"\",\"\",'D2 Echelle'!$C$61)","v":""},{"$f":"+IF('D2 Echelle'!$C$61=\"\",\"\",'D2 Echelle'!$C$61)","v":""},{"$f":"+IF('D2 Echelle'!$C$66=\"\",\"\",'D2 Echelle'!$C$66)","v":""},{"$f":"+IF('D2 Echelle'!$C$66=\"\",\"\",'D2 Echelle'!$C$66)","v":""},{"$f":"+IF('D2 Echelle'!$C$71=\"\",\"\",'D2 Echelle'!$C$71)","v":""},{"$f":"+IF('D2 Echelle'!$C$71=\"\",\"\",'D2 Echelle'!$C$71)","v":""},{"$f":"+IF('D2 Echelle'!$C$76=\"\",\"\",'D2 Echelle'!$C$76)","v":""},{"$f":"+IF('D2 Echelle'!$C$76=\"\",\"\",'D2 Echelle'!$C$76)","v":""}]
[null,null,null,null,null," ",{"$f":"+IF('D1 Données générales'!$H$13=\"\",\"\",'D1 Données générales'!$H$13)","v":"Cedi"},"No. de cibles","Quantité d'unités",null,null,null,"No. de cibles","Quantité d'unités","No. de cibles","Quantité d'unités","No. de cibles","Quantité d'unités","No. de cibles","Quantité d'unités","No. de cibles","Quantité d'unités","No. de cibles","Quantité d'unités","No. de cibles","Quantité d'unités","No. de cibles","Quantité d'unités","No. de cibles","Quantité d'unités"]
[null,"Amoxicilline (sirop)","Tous les cas de MAS ","Cas MAS, en moyen",{"$f":"+'D3 Données épi. démo'!F96","v":3},"g",{"$f":"+'D4 Prix'!F37","v":1},{"$f":"+H81","v":150},{"$f":"+H58*$E$58","v":450},null,null,null,{"$f":"+M81","v":0},{"$f":"+M58*$E$58","v":0},{"$f":"+O81","v":0},{"$f":"+O58*$E$58","v":0},{"$f":"+Q81","v":0},{"$f":"+Q58*$E$58","v":0},{"$f":"+S81","v":0},{"$f":"+S58*$E$58","v":0},{"$f":"+U81","v":0},{"$f":"+U58*$E$58","v":0},{"$f":"+W81","v":0},{"$f":"+W58*$E$58","v":0},{"$f":"+Y81","v":0},{"$f":"+Y58*$E$58","v":0},{"$f":"+AA81","v":0},{"$f":"+AA58*$E$58","v":0},{"$f":"+AC81","v":0},{"$f":"+AC58*$E$58","v":0}]
[null,"Vitamine A ","Tous les cas de MAS de plus de 6 mois","6 à 11 mois ",{"$f":"+'D3 Données épi. démo'!F94","v":1},"Gélules 100 000 UI",{"$f":"+'D4 Prix'!F35","v":0.02},{"$f":"+H83","v":19.5},{"$f":"+H59*$E$59","v":19.5},null,null,null,{"$f":"+M83","v":0},{"$f":"+M59*$E$59","v":0},{"$f":"+O83","v":0},{"$f":"+O59*$E$59","v":0},{"$f":"+Q83","v":0},{"$f":"+Q59*$E$59","v":0},{"$f":"+S83","v":0},{"$f":"+S59*$E$59","v":0},{"$f":"+U83","v":0},{"$f":"+U59*$E$59","v":0},{"$f":"+W83","v":0},{"$f":"+W59*$E$59","v":0},{"$f":"+Y83","v":0},{"$f":"+Y59*$E$59","v":0},{"$f":"+AA83","v":0},{"$f":"+AA59*$E$59","v":0},{"$f":"+AC83","v":0},{"$f":"+AC59*$E$59","v":0}]
[null,null,null,"12 à 59 mois",{"$f":"+'D3 Données épi. démo'!F95","v":2},"Gélules 100 000 UI",{"$f":"+G59","v":0.02},{"$f":"+H84+H85","v":115.5},{"$f":"+H60*$E$60","v":231},null,null,null,{"$f":"+M84+M85","v":0},{"$f":"+M60*$E$60","v":0},{"$f":"+O84+O85","v":0},{"$f":"+O60*$E$60","v":0},{"$f":"+Q84+Q85","v":0},{"$f":"+Q60*$E$60","v":0},{"$f":"+S84+S85","v":0},{"$f":"+S60*$E$60","v":0},{"$f":"+U84+U85","v":0},{"$f":"+U60*$E$60","v":0},{"$f":"+W84+W85","v":0},{"$f":"+W60*$E$60","v":0},{"$f":"+Y84+Y85","v":0},{"$f":"+Y60*$E$60","v":0},{"$f":"+AA84+AA85","v":0},{"$f":"+AA60*$E$60","v":0},{"$f":"+AC84+AC85","v":0},{"$f":"+AC60*$E$60","v":0}]
[null,"Eau sucrée","Enfants venant aux séances PEC MAS ambulatoire","Chaque visite par un enfant à une séance de PEC MAS ambulatoire",{"$f":"+'D3 Données épi. démo'!F93","v":0.1},"litres",{"$f":"+'D4 Prix'!F36","v":0.05},{"$f":"+H86","v":1080},{"$f":"+$E$61*H61","v":108},null,null,null,{"$f":"+M86","v":0},{"$f":"+$E$61*M61","v":0},{"$f":"+O86","v":0},{"$f":"+$E$61*O61","v":0},{"$f":"+Q86","v":0},{"$f":"+$E$61*Q61","v":0},{"$f":"+S86","v":0},{"$f":"+$E$61*S61","v":0},{"$f":"+U86","v":0},{"$f":"+$E$61*U61","v":0},{"$f":"+W86","v":0},{"$f":"+$E$61*W61","v":0},{"$f":"+Y86","v":0},{"$f":"+$E$61*Y61","v":0},{"$f":"+AA86","v":0},{"$f":"+$E$61*AA61","v":0},{"$f":"+AC86","v":0},{"$f":"+$E$61*AC61","v":0}]
[null,"ReSoMal","Enfants avec déshydratation","Enfant avec MAS& deshydratation (traités dans la PEC MAS hospitalière)",{"$f":"+'D3 Données épi. démo'!F88","v":2},"sachets",{"$f":"+'D4 Prix'!F41","v":0.5},{"$f":"+H91/100*(H82+H87*(H81-H82))","v":12.337499999999999},{"$f":"+H62*$E$62","v":24.674999999999997},null,null,null,{"$f":"+M91/100*(M82+M87*(M81-M82))","v":0},{"$f":"+M62*$E$62","v":0},{"$f":"+O91/100*(O82+O87*(O81-O82))","v":0},{"$f":"+O62*$E$62","v":0},{"$f":"+Q91/100*(Q82+Q87*(Q81-Q82))","v":0},{"$f":"+Q62*$E$62","v":0},{"$f":"+S91/100*(S82+S87*(S81-S82))","v":0},{"$f":"+S62*$E$62","v":0},{"$f":"+U91/100*(U82+U87*(U81-U82))","v":0},{"$f":"+U62*$E$62","v":0},{"$f":"+W91/100*(W82+W87*(W81-W82))","v":0},{"$f":"+W62*$E$62","v":0},{"$f":"+Y91/100*(Y82+Y87*(Y81-Y82))","v":0},{"$f":"+Y62*$E$62","v":0},{"$f":"+AA91/100*(AA82+AA87*(AA81-AA82))","v":0},{"$f":"+AA62*$E$62","v":0},{"$f":"+AC91/100*(AC82+AC87*(AC81-AC82))","v":0},{"$f":"+AC62*$E$62","v":0}]
[null,"Anti-paludique","Tous les cas de MAS qui ont les symptômes du paludisme et dont le test est positif  (dans les zones où les tests de diagnostic sont utilisés).",null,1,"protocole complet",{"$f":"+'D4 Prix'!F38","v":3},{"$f":"IF(H88=\"il n'y a pas de paludisme\",0,IF(H88=\"traitement présomptif\",H81,IF(H88=\"symptômes\",H81*H89/100,H81*H89/100*H90/100)))","v":150},{"$f":"+H63*$E$63","v":150},null,null,null,{"$f":"IF(M88=\"il n'y a pas de paludisme\",0,IF(M88=\"traitement présomptif\",M81,IF(M88=\"symptômes\",M81*M89/100,M81*M89/100*M90/100)))","v":0},{"$f":"+M63*$E$63","v":0},{"$f":"IF(O88=\"il n'y a pas de paludisme\",0,IF(O88=\"traitement présomptif\",O81,IF(O88=\"symptômes\",O81*O89/100,O81*O89/100*O90/100)))","v":0},{"$f":"+O63*$E$63","v":0},{"$f":"IF(Q88=\"il n'y a pas de paludisme\",0,IF(Q88=\"traitement présomptif\",Q81,IF(Q88=\"symptômes\",Q81*Q89/100,Q81*Q89/100*Q90/100)))","v":0},{"$f":"+Q63*$E$63","v":0},{"$f":"IF(S88=\"il n'y a pas de paludisme\",0,IF(S88=\"traitement présomptif\",S81,IF(S88=\"symptômes\",S81*S89/100,S81*S89/100*S90/100)))","v":0},{"$f":"+S63*$E$63","v":0},{"$f":"IF(U88=\"il n'y a pas de paludisme\",0,IF(U88=\"traitement présomptif\",U81,IF(U88=\"symptômes\",U81*U89/100,U81*U89/100*U90/100)))","v":0},{"$f":"+U63*$E$63","v":0},{"$f":"IF(W88=\"il n'y a pas de paludisme\",0,IF(W88=\"traitement présomptif\",W81,IF(W88=\"symptômes\",W81*W89/100,W81*W89/100*W90/100)))","v":0},{"$f":"+W63*$E$63","v":0},{"$f":"IF(Y88=\"il n'y a pas de paludisme\",0,IF(Y88=\"traitement présomptif\",Y81,IF(Y88=\"symptômes\",Y81*Y89/100,Y81*Y89/100*Y90/100)))","v":0},{"$f":"+Y63*$E$63","v":0},{"$f":"IF(AA88=\"il n'y a pas de paludisme\",0,IF(AA88=\"traitement présomptif\",AA81,IF(AA88=\"symptômes\",AA81*AA89/100,AA81*AA89/100*AA90/100)))","v":0},{"$f":"+AA63*$E$63","v":0},{"$f":"IF(AC88=\"il n'y a pas de paludisme\",0,IF(AC88=\"traitement présomptif\",AC81,IF(AC88=\"symptômes\",AC81*AC89/100,AC81*AC89/100*AC90/100)))","v":0},{"$f":"+AC63*$E$63","v":0}]
[null,"Test du paludisme","Tous les cas de MAS avec des symptômes de paludisme dans les zones où le test est utilisé pour confirmer les cas.",null,{"$f":"+'D3 Données épi. démo'!F86","v":1},"test",{"$f":"+'D4 Prix'!F39","v":1},{"$f":"IF(OR(H88=\"il n'y a pas de paludisme\",H88=\"symptômes\",H88=\"traitement présomptif\"),0,H81*H89/100)","v":0},{"$f":"+H64*$E$64","v":0},null,null,null,{"$f":"IF(OR(M88=\"il n'y a pas de paludisme\",M88=\"symptômes\",M88=\"traitement présomptif\"),0,M81*M89/100)","v":0},{"$f":"+M64*$E$64","v":0},{"$f":"IF(OR(O88=\"il n'y a pas de paludisme\",O88=\"symptômes\",O88=\"traitement présomptif\"),0,O81*O89/100)","v":0},{"$f":"+O64*$E$64","v":0},{"$f":"IF(OR(Q88=\"il n'y a pas de paludisme\",Q88=\"symptômes\",Q88=\"traitement présomptif\"),0,Q81*Q89/100)","v":0},{"$f":"+Q64*$E$64","v":0},{"$f":"IF(OR(S88=\"il n'y a pas de paludisme\",S88=\"symptômes\",S88=\"traitement présomptif\"),0,S81*S89/100)","v":0},{"$f":"+S64*$E$64","v":0},{"$f":"IF(OR(U88=\"il n'y a pas de paludisme\",U88=\"symptômes\",U88=\"traitement présomptif\"),0,U81*U89/100)","v":0},{"$f":"+U64*$E$64","v":0},{"$f":"IF(OR(W88=\"il n'y a pas de paludisme\",W88=\"symptômes\",W88=\"traitement présomptif\"),0,W81*W89/100)","v":0},{"$f":"+W64*$E$64","v":0},{"$f":"IF(OR(Y88=\"il n'y a pas de paludisme\",Y88=\"symptômes\",Y88=\"traitement présomptif\"),0,Y81*Y89/100)","v":0},{"$f":"+Y64*$E$64","v":0},{"$f":"IF(OR(AA88=\"il n'y a pas de paludisme\",AA88=\"symptômes\",AA88=\"traitement présomptif\"),0,AA81*AA89/100)","v":0},{"$f":"+AA64*$E$64","v":0},{"$f":"IF(OR(AC88=\"il n'y a pas de paludisme\",AC88=\"symptômes\",AC88=\"traitement présomptif\"),0,AC81*AC89/100)","v":0},{"$f":"+AC64*$E$64","v":0}]
[null,"Autres tests de routine","Tous les cas de MAS hospitalisés",null,{"$f":"+IF('D3 Données épi. démo'!F89=\"oui\",1,0)","v":1},"ensembles de tests spécifiés",{"$f":"+'D4 Prix'!F42","v":5},{"$f":"+H82+H87*(H83+H84+H85)","v":35.25},{"$f":"+H65*$E$65","v":35.25},null,null,null,{"$f":"+M82+M87*(M83+M84+M85)","v":0},{"$f":"+M65*$E$65","v":0},{"$f":"+O82+O87*(O83+O84+O85)","v":0},{"$f":"+O65*$E$65","v":0},{"$f":"+Q82+Q87*(Q83+Q84+Q85)","v":0},{"$f":"+Q65*$E$65","v":0},{"$f":"+S82+S87*(S83+S84+S85)","v":0},{"$f":"+S65*$E$65","v":0},{"$f":"+U82+U87*(U83+U84+U85)","v":0},{"$f":"+U65*$E$65","v":0},{"$f":"+W82+W87*(W83+W84+W85)","v":0},{"$f":"+W65*$E$65","v":0},{"$f":"+Y82+Y87*(Y83+Y84+Y85)","v":0},{"$f":"+Y65*$E$65","v":0},{"$f":"+AA82+AA87*(AA83+AA84+AA85)","v":0},{"$f":"+AA65*$E$65","v":0},{"$f":"+AC82+AC87*(AC83+AC84+AC85)","v":0},{"$f":"+AC65*$E$65","v":0}]
[null,"Kits IV",{"$f":"+'D3 Données épi. démo'!F91","v":10},"% des cas de MAS hospitalisés",1,"kits",{"$f":"+'D4 Prix'!F43","v":1},{"$f":"+C66/100*(H82+H87*(H83+H84+H85))","v":3.5250000000000004},{"$f":"+H66*$E$66","v":3.5250000000000004},null,null,null,{"$f":"+H66/100*(M82+M87*(M83+M84+M85))","v":0},{"$f":"+M66*$E$66","v":0},{"$f":"+J66/100*(O82+O87*(O83+O84+O85))","v":0},{"$f":"+O66*$E$66","v":0},{"$f":"+L66/100*(Q82+Q87*(Q83+Q84+Q85))","v":0},{"$f":"+Q66*$E$66","v":0},{"$f":"+N66/100*(S82+S87*(S83+S84+S85))","v":0},{"$f":"+S66*$E$66","v":0},{"$f":"+P66/100*(U82+U87*(U83+U84+U85))","v":0},{"$f":"+U66*$E$66","v":0},{"$f":"+R66/100*(W82+W87*(W83+W84+W85))","v":0},{"$f":"+W66*$E$66","v":0},{"$f":"+T66/100*(Y82+Y87*(Y83+Y84+Y85))","v":0},{"$f":"+Y66*$E$66","v":0},{"$f":"+V66/100*(AA82+AA87*(AA83+AA84+AA85))","v":0},{"$f":"+AA66*$E$66","v":0},{"$f":"+X66/100*(AC82+AC87*(AC83+AC84+AC85))","v":0},{"$f":"+AC66*$E$66","v":0}]
[null,"Sondes naso-gastriques",{"$f":"+'D3 Données épi. démo'!F92","v":25},"% de cas de MAS hospitalisés",1,"tubes",{"$f":"+'D4 Prix'!F44","v":1},{"$f":"+C67/100*(H82+H87*(H83+H84+H85))","v":8.8125},{"$f":"+H67*$E$67","v":8.8125},null,null,null,{"$f":"+H67/100*(M82+M87*(M83+M84+M85))","v":0},{"$f":"+M67*$E$67","v":0},{"$f":"+J67/100*(O82+O87*(O83+O84+O85))","v":0},{"$f":"+O67*$E$67","v":0},{"$f":"+L67/100*(Q82+Q87*(Q83+Q84+Q85))","v":0},{"$f":"+Q67*$E$67","v":0},{"$f":"+N67/100*(S82+S87*(S83+S84+S85))","v":0},{"$f":"+S67*$E$67","v":0},{"$f":"+P67/100*(U82+U87*(U83+U84+U85))","v":0},{"$f":"+U67*$E$67","v":0},{"$f":"+R67/100*(W82+W87*(W83+W84+W85))","v":0},{"$f":"+W67*$E$67","v":0},{"$f":"+T67/100*(Y82+Y87*(Y83+Y84+Y85))","v":0},{"$f":"+Y67*$E$67","v":0},{"$f":"+V67/100*(AA82+AA87*(AA83+AA84+AA85))","v":0},{"$f":"+AA67*$E$67","v":0},{"$f":"+X67/100*(AC82+AC87*(AC83+AC84+AC85))","v":0},{"$f":"+AC67*$E$67","v":0}]
[null,"Albendazole","Tous les cas de MAS de plus de 12 mois","12 à 23 mois ",{"$f":"+'D3 Données épi. démo'!F97","v":2},"comprimés  (100 mg)",{"$f":"+'D4 Prix'!F40","v":0.03},{"$f":"+H84","v":37.5},{"$f":"+H68*$E$68","v":75},null,null,null,{"$f":"+M84","v":0},{"$f":"+M68*$E$68","v":0},{"$f":"+O84","v":0},{"$f":"+O68*$E$68","v":0},{"$f":"+Q84","v":0},{"$f":"+Q68*$E$68","v":0},{"$f":"+S84","v":0},{"$f":"+S68*$E$68","v":0},{"$f":"+U84","v":0},{"$f":"+U68*$E$68","v":0},{"$f":"+W84","v":0},{"$f":"+W68*$E$68","v":0},{"$f":"+Y84","v":0},{"$f":"+Y68*$E$68","v":0},{"$f":"+AA84","v":0},{"$f":"+AA68*$E$68","v":0},{"$f":"+AC84","v":0},{"$f":"+AC68*$E$68","v":0}]
[null,null,null,"24 à 59 mois",{"$f":"+'D3 Données épi. démo'!F98","v":4},null,{"$f":"+G68","v":0.03},{"$f":"+H85","v":78},{"$f":"+H69*$E$69","v":312},null,null,null,{"$f":"+M85","v":0},{"$f":"+M69*$E$69","v":0},{"$f":"+O85","v":0},{"$f":"+O69*$E$69","v":0},{"$f":"+Q85","v":0},{"$f":"+Q69*$E$69","v":0},{"$f":"+S85","v":0},{"$f":"+S69*$E$69","v":0},{"$f":"+U85","v":0},{"$f":"+U69*$E$69","v":0},{"$f":"+W85","v":0},{"$f":"+W69*$E$69","v":0},{"$f":"+Y85","v":0},{"$f":"+Y69*$E$69","v":0},{"$f":"+AA85","v":0},{"$f":"+AA69*$E$69","v":0},{"$f":"+AC85","v":0},{"$f":"+AC69*$E$69","v":0}]
[null,"Vaccins contre la rougeole","Tous les cas de MAS de plus de 6 mois","Sans complications médicales",{"$f":"+'D3 Données épi. démo'!F99","v":1},"dose",{"$f":"+'D4 Prix'!F45","v":1},{"$f":"+(H83+H84+H85)*(1-H87)","v":114.75},{"$f":"+H70*$E$70","v":114.75},null,null,null,{"$f":"+(M83+M84+M85)*(1-M87)","v":0},{"$f":"+M70*$E$70","v":0},{"$f":"+(O83+O84+O85)*(1-O87)","v":0},{"$f":"+O70*$E$70","v":0},{"$f":"+(Q83+Q84+Q85)*(1-Q87)","v":0},{"$f":"+Q70*$E$70","v":0},{"$f":"+(S83+S84+S85)*(1-S87)","v":0},{"$f":"+S70*$E$70","v":0},{"$f":"+(U83+U84+U85)*(1-U87)","v":0},{"$f":"+U70*$E$70","v":0},{"$f":"+(W83+W84+W85)*(1-W87)","v":0},{"$f":"+W70*$E$70","v":0},{"$f":"+(Y83+Y84+Y85)*(1-Y87)","v":0},{"$f":"+Y70*$E$70","v":0},{"$f":"+(AA83+AA84+AA85)*(1-AA87)","v":0},{"$f":"+AA70*$E$70","v":0},{"$f":"+(AC83+AC84+AC85)*(1-AC87)","v":0},{"$f":"+AC70*$E$70","v":0}]
[null,null,null,"Avec complications médicales",{"$f":"+'D3 Données épi. démo'!F100","v":2},"doses",{"$f":"+G70","v":1},{"$f":"+(H83+H84+H85)*H87","v":20.25},{"$f":"+$E$71*H71","v":40.5},null,null,null,{"$f":"+(M83+M84+M85)*M87","v":0},{"$f":"+$E$71*M71","v":0},{"$f":"+(O83+O84+O85)*O87","v":0},{"$f":"+$E$71*O71","v":0},{"$f":"+(Q83+Q84+Q85)*Q87","v":0},{"$f":"+$E$71*Q71","v":0},{"$f":"+(S83+S84+S85)*S87","v":0},{"$f":"+$E$71*S71","v":0},{"$f":"+(U83+U84+U85)*U87","v":0},{"$f":"+$E$71*U71","v":0},{"$f":"+(W83+W84+W85)*W87","v":0},{"$f":"+$E$71*W71","v":0},{"$f":"+(Y83+Y84+Y85)*Y87","v":0},{"$f":"+$E$71*Y71","v":0},{"$f":"+(AA83+AA84+AA85)*AA87","v":0},{"$f":"+$E$71*AA71","v":0},{"$f":"+(AC83+AC84+AC85)*AC87","v":0},{"$f":"+$E$71*AC71","v":0}]
[null,"Seringue autodestructible pour la rougeole","Tous les cas de MAS de plus de 6 mois","Sans complications médicales",{"$f":"+'D3 Données épi. démo'!F101","v":1},"seringue",{"$f":"+'D4 Prix'!F46","v":0.2},{"$f":"+(H83+H84+H85)*(1-H87)","v":114.75},{"$f":"+H72*$E$72","v":114.75},null,null,null,{"$f":"+(M83+M84+M85)*(1-M87)","v":0},{"$f":"+M72*$E$72","v":0},{"$f":"+(O83+O84+O85)*(1-O87)","v":0},{"$f":"+O72*$E$72","v":0},{"$f":"+(Q83+Q84+Q85)*(1-Q87)","v":0},{"$f":"+Q72*$E$72","v":0},{"$f":"+(S83+S84+S85)*(1-S87)","v":0},{"$f":"+S72*$E$72","v":0},{"$f":"+(U83+U84+U85)*(1-U87)","v":0},{"$f":"+U72*$E$72","v":0},{"$f":"+(W83+W84+W85)*(1-W87)","v":0},{"$f":"+W72*$E$72","v":0},{"$f":"+(Y83+Y84+Y85)*(1-Y87)","v":0},{"$f":"+Y72*$E$72","v":0},{"$f":"+(AA83+AA84+AA85)*(1-AA87)","v":0},{"$f":"+AA72*$E$72","v":0},{"$f":"+(AC83+AC84+AC85)*(1-AC87)","v":0},{"$f":"+AC72*$E$72","v":0}]
[null,null,null,"Avec complications médicales",{"$f":"+'D3 Données épi. démo'!F102","v":2},"seringue",{"$f":"+G72","v":0.2},{"$f":"+(H83+H84+H85)*H87","v":20.25},{"$f":"+$E$73*H73","v":40.5},null,null,null,{"$f":"+(M83+M84+M85)*M87","v":0},{"$f":"+$E$73*M73","v":0},{"$f":"+(O83+O84+O85)*O87","v":0},{"$f":"+$E$73*O73","v":0},{"$f":"+(Q83+Q84+Q85)*Q87","v":0},{"$f":"+$E$73*Q73","v":0},{"$f":"+(S83+S84+S85)*S87","v":0},{"$f":"+$E$73*S73","v":0},{"$f":"+(U83+U84+U85)*U87","v":0},{"$f":"+$E$73*U73","v":0},{"$f":"+(W83+W84+W85)*W87","v":0},{"$f":"+$E$73*W73","v":0},{"$f":"+(Y83+Y84+Y85)*Y87","v":0},{"$f":"+$E$73*Y73","v":0},{"$f":"+(AA83+AA84+AA85)*AA87","v":0},{"$f":"+$E$73*AA73","v":0},{"$f":"+(AC83+AC84+AC85)*AC87","v":0},{"$f":"+$E$73*AC73","v":0}]
[null,"Seringues mélange","Tous les cas de MAS de plus de 6 mois","Sans complications médicales",{"$f":"+'D3 Données épi. démo'!F103","v":0.1},"seringue",{"$f":"+'D4 Prix'!F47","v":0.2},{"$f":"+(H83+H84+H85)*(1-H87)","v":114.75},{"$f":"+H74*$E$74","v":11.475000000000001},null,null,null,{"$f":"+(M83+M84+M85)*(1-M87)","v":0},{"$f":"+M74*$E$74","v":0},{"$f":"+(O83+O84+O85)*(1-O87)","v":0},{"$f":"+O74*$E$74","v":0},{"$f":"+(Q83+Q84+Q85)*(1-Q87)","v":0},{"$f":"+Q74*$E$74","v":0},{"$f":"+(S83+S84+S85)*(1-S87)","v":0},{"$f":"+S74*$E$74","v":0},{"$f":"+(U83+U84+U85)*(1-U87)","v":0},{"$f":"+U74*$E$74","v":0},{"$f":"+(W83+W84+W85)*(1-W87)","v":0},{"$f":"+W74*$E$74","v":0},{"$f":"+(Y83+Y84+Y85)*(1-Y87)","v":0},{"$f":"+Y74*$E$74","v":0},{"$f":"+(AA83+AA84+AA85)*(1-AA87)","v":0},{"$f":"+AA74*$E$74","v":0},{"$f":"+(AC83+AC84+AC85)*(1-AC87)","v":0},{"$f":"+AC74*$E$74","v":0}]
[null,null,null,"Avec complications médicales",{"$f":"+'D3 Données épi. démo'!F104","v":0.2},"seringue",{"$f":"+G74","v":0.2},{"$f":"+(H83+H84+H85)*H87","v":20.25},{"$f":"+$E$75*H75","v":4.05},null,null,null,{"$f":"+(M83+M84+M85)*M87","v":0},{"$f":"+$E$75*M75","v":0},{"$f":"+(O83+O84+O85)*O87","v":0},{"$f":"+$E$75*O75","v":0},{"$f":"+(Q83+Q84+Q85)*Q87","v":0},{"$f":"+$E$75*Q75","v":0},{"$f":"+(S83+S84+S85)*S87","v":0},{"$f":"+$E$75*S75","v":0},{"$f":"+(U83+U84+U85)*U87","v":0},{"$f":"+$E$75*U75","v":0},{"$f":"+(W83+W84+W85)*W87","v":0},{"$f":"+$E$75*W75","v":0},{"$f":"+(Y83+Y84+Y85)*Y87","v":0},{"$f":"+$E$75*Y75","v":0},{"$f":"+(AA83+AA84+AA85)*AA87","v":0},{"$f":"+$E$75*AA75","v":0},{"$f":"+(AC83+AC84+AC85)*AC87","v":0},{"$f":"+$E$75*AC75","v":0}]
[]
[]
[null,null,null,null,"Drivers de base, données brutes"]
[null,null,null,null,null,null,null,"Zone 1",null,null,null,null,"Zone 2",null,"Zone 3",null,"Zone 4",null,"Zone 5",null,"Zone 6",null,"Zone 7",null,"Zone 8",null,"Zone 9",null,"Zone 10"]
[null,null,null,null,"Nombre de séances de PCMA (R8)",null,null,{"$f":"+'R8 Traitement (main-d''oeuvres)'!F92","v":104},null,null,null,null,{"$f":"+'R8 Traitement (main-d''oeuvres)'!J92","v":0},null,{"$f":"+'R8 Traitement (main-d''oeuvres)'!K92","v":0},null,{"$f":"+'R8 Traitement (main-d''oeuvres)'!L92","v":0},null,{"$f":"+'R8 Traitement (main-d''oeuvres)'!M92","v":0},null,{"$f":"+'R8 Traitement (main-d''oeuvres)'!N92","v":0},null,{"$f":"+'R8 Traitement (main-d''oeuvres)'!O92","v":0},null,{"$f":"+'R8 Traitement (main-d''oeuvres)'!P92","v":0},null,{"$f":"+'R8 Traitement (main-d''oeuvres)'!Q92","v":0},null,{"$f":"+'R8 Traitement (main-d''oeuvres)'!R92","v":0}]
[null,null,null,null,"Nombre de cas de MAS par an (D9)",null,null,{"$f":"+'D9 Variables temps'!F39","v":150},null,null,null,null,{"$f":"+'D9 Variables temps'!J39","v":0},null,{"$f":"+'D9 Variables temps'!K39","v":0},null,{"$f":"+'D9 Variables temps'!L39","v":0},null,{"$f":"+'D9 Variables temps'!M39","v":0},null,{"$f":"+'D9 Variables temps'!N39","v":0},null,{"$f":"+'D9 Variables temps'!O39","v":0},null,{"$f":"+'D9 Variables temps'!P39","v":0},null,{"$f":"+'D9 Variables temps'!Q39","v":0},null,{"$f":"+'D9 Variables temps'!R39","v":0}]
[null,null,null,null,"  -  moins de 6 mois",null,null,{"$f":"+H81*'D3 Données épi. démo'!$F$22/100","v":15},null,null,null,null,{"$f":"+M81*'D3 Données épi. démo'!$J$22/100","v":0},null,{"$f":"+O81*'D3 Données épi. démo'!$K$22/100","v":0},null,{"$f":"+Q81*'D3 Données épi. démo'!$L$22/100","v":0},null,{"$f":"+S81*'D3 Données épi. démo'!$M$22/100","v":0},null,{"$f":"+U81*'D3 Données épi. démo'!$N$22/100","v":0},null,{"$f":"+W81*'D3 Données épi. démo'!$O$22/100","v":0},null,{"$f":"+Y81*'D3 Données épi. démo'!$P$22/100","v":0},null,{"$f":"+AA81*'D3 Données épi. démo'!$Q$22/100","v":0},null,{"$f":"+AC81*'D3 Données épi. démo'!$R$22/100","v":0}]
[null,null,null,null,"  -  6 à 11 mois",null,null,{"$f":"+H81*'D3 Données épi. démo'!$F$23/100","v":19.5},null,null,null,null,{"$f":"+M81*'D3 Données épi. démo'!$J$23/100","v":0},null,{"$f":"+O81*'D3 Données épi. démo'!$K$23/100","v":0},null,{"$f":"+Q81*'D3 Données épi. démo'!L23/100","v":0},null,{"$f":"+S81*'D3 Données épi. démo'!M23/100","v":0},null,{"$f":"+U81*'D3 Données épi. démo'!N23/100","v":0},null,{"$f":"+W81*'D3 Données épi. démo'!O23/100","v":0},null,{"$f":"+Y81*'D3 Données épi. démo'!P23/100","v":0},null,{"$f":"+AA81*'D3 Données épi. démo'!Q23/100","v":0},null,{"$f":"+AC81*'D3 Données épi. démo'!R23/100","v":0}]
[null,null,null,null,"  -  12 à 23 mois",null,null,{"$f":"+H81*'D3 Données épi. démo'!$F$24/100","v":37.5},null,null,null,null,{"$f":"+M81*'D3 Données épi. démo'!$J$24/100","v":0},null,{"$f":"+O81*'D3 Données épi. démo'!$K$24/100","v":0},null,{"$f":"+Q81*'D3 Données épi. démo'!L24/100","v":0},null,{"$f":"+S81*'D3 Données épi. démo'!M24/100","v":0},null,{"$f":"+U83*'D3 Données épi. démo'!N24/100","v":0},null,{"$f":"+W81*'D3 Données épi. démo'!O24/100","v":0},null,{"$f":"+Y81*'D3 Données épi. démo'!P24/100","v":0},null,{"$f":"+AA81*'D3 Données épi. démo'!Q24/100","v":0},null,{"$f":"+AC81*'D3 Données épi. démo'!R24/100","v":0}]
[null,null,null,null,"  -  24 à 59 mois",null,null,{"$f":"+H81*'D3 Données épi. démo'!$F$25/100","v":78},null,null,null,null,{"$f":"+M81*'D3 Données épi. démo'!$J$25/100","v":0},null,{"$f":"+O81*'D3 Données épi. démo'!$K$25/100","v":0},null,{"$f":"+Q81*'D3 Données épi. démo'!L25/100","v":0},null,{"$f":"+S81*'D3 Données épi. démo'!M25/100","v":0},null,{"$f":"+U81*'D3 Données épi. démo'!N25/100","v":0},null,{"$f":"+W81*'D3 Données épi. démo'!O25/100","v":0},null,{"$f":"+Y81*'D3 Données épi. démo'!P25/100","v":0},null,{"$f":"+AA81*'D3 Données épi. démo'!Q25/100","v":0},null,{"$f":"+AC81*'D3 Données épi. démo'!R25/100","v":0}]
[null,null,null,null,"Nombre de visites aux séances PEC MAS ambulatoire (D9, D3)",null,null,{"$f":"+'D9 Variables temps'!F40*'D3 Données épi. démo'!F33","v":1080},null,null,null,null,{"$f":"+'D9 Variables temps'!J40*'D3 Données épi. démo'!J33","v":0},null,{"$f":"+'D9 Variables temps'!K40*'D3 Données épi. démo'!K33","v":0},null,{"$f":"+'D9 Variables temps'!L40*'D3 Données épi. démo'!L33","v":0},null,{"$f":"+'D9 Variables temps'!M40*'D3 Données épi. démo'!M33","v":0},null,{"$f":"+'D9 Variables temps'!N40*'D3 Données épi. démo'!N33","v":0},null,{"$f":"+'D9 Variables temps'!O40*'D3 Données épi. démo'!O33","v":0},null,{"$f":"+'D9 Variables temps'!P40*'D3 Données épi. démo'!P33","v":0},null,{"$f":"+'D9 Variables temps'!Q40*'D3 Données épi. démo'!Q33","v":0},null,{"$f":"+'D9 Variables temps'!R40*'D3 Données épi. démo'!R33","v":0}]
[null,null,null,null,"Proportion de cas de MAS > 6 mois avec complications médicales (D3)",null,null,{"$f":"+'D3 Données épi. démo'!$F$27","v":0.15},null,null,null,null,{"$f":"+'D3 Données épi. démo'!$J$27","v":0.15},null,{"$f":"+'D3 Données épi. démo'!$K$27","v":0.15},null,{"$f":"+'D3 Données épi. démo'!$L$27","v":0.15},null,{"$f":"+'D3 Données épi. démo'!$M$27","v":0.15},null,{"$f":"+'D3 Données épi. démo'!$N$27","v":0.15},null,{"$f":"+'D3 Données épi. démo'!$O$27","v":0.15},null,{"$f":"+'D3 Données épi. démo'!$P$27","v":0.15},null,{"$f":"+'D3 Données épi. démo'!$Q$27","v":0.15},null,{"$f":"+'D3 Données épi. démo'!$R$27","v":0.15}]
[null,null,null,null,"Comment le paludisme est diagnostiqué ? (D3)",null,null,{"$f":"+'D3 Données épi. démo'!F83","v":"traitement présomptif"},null,null,null,null,{"$f":"+'D3 Données épi. démo'!J83","v":"il n'y a pas de paludisme"},null,{"$f":"+'D3 Données épi. démo'!K83","v":"symptômes"},null,{"$f":"+'D3 Données épi. démo'!L83","v":"paracheck"},null,{"$f":"+'D3 Données épi. démo'!M83","v":"test diagnostic autre"},null,{"$f":"+'D3 Données épi. démo'!N83","v":"traitement présomptif"},null,{"$f":"+'D3 Données épi. démo'!O83","v":"il n'y a pas de paludisme"},null,{"$f":"+'D3 Données épi. démo'!P83","v":"test diagnostic autre"},null,{"$f":"+'D3 Données épi. démo'!Q83","v":0},null,{"$f":"+'D3 Données épi. démo'!R83","v":"test diagnostic autre"}]
[null,null,null,null,"% de cas de MAS avec symptômes de paludisme (D3).",null,null,{"$f":"+'D3 Données épi. démo'!F84","v":0},null,null,null,null,{"$f":"+'D3 Données épi. démo'!J84","v":0},null,{"$f":"+'D3 Données épi. démo'!K84","v":0},null,{"$f":"+'D3 Données épi. démo'!L84","v":0},null,{"$f":"+'D3 Données épi. démo'!M84","v":0},null,{"$f":"+'D3 Données épi. démo'!N84","v":0},null,{"$f":"+'D3 Données épi. démo'!O84","v":0},null,{"$f":"+'D3 Données épi. démo'!P84","v":0},null,{"$f":"+'D3 Données épi. démo'!Q84","v":0},null,{"$f":"+'D3 Données épi. démo'!R84","v":0}]
[null,null,null,null,"% de cas de MAS avec symptômes de paludisme dont le diagnostic est confirmé par les tests (D3).",null,null,{"$f":"+'D3 Données épi. démo'!F85","v":0},null,null,null,null,{"$f":"+'D3 Données épi. démo'!J85","v":0},null,{"$f":"+'D3 Données épi. démo'!K85","v":0},null,{"$f":"+'D3 Données épi. démo'!L85","v":0},null,{"$f":"+'D3 Données épi. démo'!M85","v":0},null,{"$f":"+'D3 Données épi. démo'!N85","v":0},null,{"$f":"+'D3 Données épi. démo'!O85","v":0},null,{"$f":"+'D3 Données épi. démo'!P85","v":0},null,{"$f":"+'D3 Données épi. démo'!Q85","v":0},null,{"$f":"+'D3 Données épi. démo'!R85","v":0}]
[null,null,null,null,"Proportion de cas de MAS en PEC MAS ambulatoire avec déshydratation (D3)",null,null,{"$f":"+'D3 Données épi. démo'!F87","v":35},null,null,null,null,{"$f":"+'D3 Données épi. démo'!J87","v":35}," ",{"$f":"+'D3 Données épi. démo'!K87","v":35}," ",{"$f":"+'D3 Données épi. démo'!L87","v":35}," ",{"$f":"+'D3 Données épi. démo'!M87","v":35}," ",{"$f":"+'D3 Données épi. démo'!N87","v":35}," ",{"$f":"+'D3 Données épi. démo'!O87","v":35}," ",{"$f":"+'D3 Données épi. démo'!P87","v":35}," ",{"$f":"+'D3 Données épi. démo'!Q87","v":35}," ",{"$f":"+'D3 Données épi. démo'!R87","v":35}]

{"sheet":"R10 Traitement (fournitures)","index":24,"n_rows":113,"n_cols":26,"rows_kept":113,"cut":false,"hidden":false,"merged":[[16,0,22,0],[25,0,41,0],[1,2,1,3],[23,2,23,5],[3,2,3,6]]}
[]
["Retour au sommaire",null,"R10:  Traitement (autres fournitures)"]
[]
[null,null,"Cette Feuille de calcul montre (pour l'année choisie) les quantités de fournitures non-médicales nécessaires pour la PCMA (traitement) et les coûts de ces intrants. "]
[]
[null,null,"Voir ci-dessous pour la manière dont sont calculés les chiffres."]
[null,null,"Number of Areas included ",{"$f":"+'D2 Echelle'!$I$8","v":1},"  (taken from Worksheet 2)",null,null,null,"hide"]
[]
[]
[]
[null,null,{"$f":"+IF('D1 Données générales'!$H$11=\"\",\"\",'D1 Données générales'!$H$11)","v":"Ghana"}]
[null,null,{"$f":"+'D9 Variables temps'!I6","v":2011},null,null,null,"Zone 1",null,"Zone 2",null,"Zone 3",null,"Zone 4",null,"Zone 5",null,"Zone 6",null,"Zone 7",null,"Zone 8",null,"Zone 9",null,"Zone 10"]
[null,null,null,null,null,{"$f":"+'D2 Echelle'!C30","v":"district"},{"$f":"+IF('D2 Echelle'!$C$31=\"\",\"\",'D2 Echelle'!$C$31)","v":"Ashiedu Keteke"},null,{"$f":"+IF('D2 Echelle'!$C$36=\"\",\"\",'D2 Echelle'!$C$36)","v":""},null,{"$f":"+IF('D2 Echelle'!$C$41=\"\",\"\",'D2 Echelle'!$C$41)","v":""},null,{"$f":"+IF('D2 Echelle'!$C$46=\"\",\"\",'D2 Echelle'!$C$46)","v":""},null,{"$f":"+IF('D2 Echelle'!$C$51=\"\",\"\",'D2 Echelle'!$C$51)","v":""},null,{"$f":"+IF('D2 Echelle'!$C$56=\"\",\"\",'D2 Echelle'!$C$56)","v":""},null,{"$f":"+IF('D2 Echelle'!$C$61=\"\",\"\",'D2 Echelle'!$C$61)","v":""},null,{"$f":"+IF('D2 Echelle'!$C$66=\"\",\"\",'D2 Echelle'!$C$66)","v":""},null,{"$f":"+IF('D2 Echelle'!$C$71=\"\",\"\",'D2 Echelle'!$C$71)","v":""},null,{"$f":"+IF('D2 Echelle'!$C$76=\"\",\"\",'D2 Echelle'!$C$76)","v":""}]
[null,null,null,null,null,{"$f":"+'D2 Echelle'!D30","v":"région"},{"$f":"+IF('D2 Echelle'!$D$31=\"\",\"\",'D2 Echelle'!$D$31)","v":"Greater Accra"},null,{"$f":"+IF('D2 Echelle'!$D$36=\"\",\"\",'D2 Echelle'!$D$36)","v":""},null,{"$f":"+IF('D2 Echelle'!$D$41=\"\",\"\",'D2 Echelle'!$D$41)","v":""},null,{"$f":"+IF('D2 Echelle'!$D$46=\"\",\"\",'D2 Echelle'!$D$46)","v":""},null,{"$f":"+IF('D2 Echelle'!$D$51=\"\",\"\",'D2 Echelle'!$D$51)","v":""},null,{"$f":"+IF('D2 Echelle'!$D$56=\"\",\"\",'D2 Echelle'!$D$56)","v":""},null,{"$f":"+IF('D2 Echelle'!$D$61=\"\",\"\",'D2 Echelle'!$D$61)","v":""},null,{"$f":"+IF('D2 Echelle'!$D$66=\"\",\"\",'D2 Echelle'!$D$66)","v":""},null,{"$f":"+IF('D2 Echelle'!$D$71=\"\",\"\",'D2 Echelle'!$D$71)","v":""},null,{"$f":"+IF('D2 Echelle'!$D$76=\"\",\"\",'D2 Echelle'!$D$76)","v":""}]
[null,null,"Coûts annuels de cette activité"]
[null,null,"Variables","Unités","Commentaires"]
[null,null,"Aliment thérapeutique"]
[null,null,"           - ATPE",{"$f":"+IF('D1 Données générales'!$H$13=\"\",\"\",'D1 Données générales'!$H$13)","v":"Cedi"},null,null,{"$f":"+H62+H63+H64","v":11961.4275},null,{"$f":"+J62+J63+J64","v":0},null,0,null,0,null,0,null,0,null,0,null,0,null,0,null,0]
[null,null,"          - F-75 et F-100",{"$f":"+IF('D1 Données générales'!$H$13=\"\",\"\",'D1 Données générales'!$H$13)","v":"Cedi"},null,null,{"$f":"+H65+H66","v":465.29999999999995},null,{"$f":"+J65+J66","v":0},null,{"$f":"+L65+L66","v":0},null,{"$f":"+N65+N66","v":0},null,{"$f":"+P65+P66","v":0},null,{"$f":"+R65+R66","v":0},null,{"$f":"+T65+T66","v":0},null,{"$f":"+V65+V66","v":0},null,{"$f":"+X65+X66","v":0},null,{"$f":"+Z65+Z66","v":0}]
[null,null,"Autres fournitures pour tous les cas de MAS",{"$f":"+IF('D1 Données générales'!$H$13=\"\",\"\",'D1 Données générales'!$H$13)","v":"Cedi"},null,null,{"$f":"+H76","v":879.56},null,{"$f":"+J76","v":0},null,{"$f":"+L76","v":0},null,{"$f":"+N76","v":0},null,{"$f":"+P76","v":0},null,{"$f":"+R76","v":0},null,{"$f":"+T76","v":0},null,{"$f":"+V76","v":0},null,{"$f":"+X76","v":0},null,{"$f":"+Z76","v":0}]
[null,null,"Autres fournitures pour les cas de PEC MAS hospitalière ",{"$f":"+IF('D1 Données générales'!$H$13=\"\",\"\",'D1 Données générales'!$H$13)","v":"Cedi"},null,null,{"$f":"+H85","v":481.03000000000003},null,{"$f":"+J85","v":0},null,{"$f":"+L85","v":0},null,{"$f":"+N85","v":0},null,{"$f":"+P85","v":0},null,{"$f":"+R85","v":0},null,{"$f":"+T85","v":0},null,{"$f":"+V85","v":0},null,{"$f":"+X85","v":0},null,{"$f":"+Z85","v":0}]
[null,null," Total coût annuel",{"$f":"+IF('D1 Données générales'!$H$13=\"\",\"\",'D1 Données générales'!$H$13)","v":"Cedi"},null,null,{"$f":"+SUM(G18:G21)","v":13787.317499999999},null,{"$f":"+SUM(I18:I21)","v":0},null,{"$f":"+SUM(K18:K21)","v":0},null,{"$f":"+SUM(M18:M21)","v":0},null,{"$f":"+SUM(O18:O21)","v":0},null,{"$f":"+SUM(Q18:Q21)","v":0},null,{"$f":"+SUM(S18:S21)","v":0},null,{"$f":"+SUM(U18:U21)","v":0},null,{"$f":"+SUM(W18:W21)","v":0},null,{"$f":"+SUM(Y18:Y21)","v":0}]
[]
[null,null,"Quantités d'intrants nécessaires pour cette activité"]
[null,null,"Variables","Unités","Commentaires"]
[null,null,"ATPE (en tenant compte des pertes)","kg",null,null,{"$f":"+G62+G63+G64","v":1993.5712500000002},null,{"$f":"+I62+I63+I64","v":0},null,0,null,0,null,0,null,0,null,0,null,0,null,0,null,0]
[null,null,"F-75  (en tenant compte des pertes)","kg",null,null,{"$f":"+G65","v":77.55},null,{"$f":"+I65","v":0},null,{"$f":"+K65","v":0},null,{"$f":"+M65","v":0},null,{"$f":"+O65","v":0},null,{"$f":"+Q65","v":0},null,{"$f":"+S65","v":0},null,{"$f":"+U65","v":0},null,{"$f":"+W65","v":0},null,{"$f":"+Y65","v":0}]
[null,null,"F-100  (en tenant compte des pertes)","kg",null,null,{"$f":"+G66","v":23.265000000000001},null,{"$f":"+I66","v":0},null,{"$f":"+K66","v":0},null,{"$f":"+M66","v":0},null,{"$f":"+O66","v":0},null,{"$f":"+Q66","v":0},null,{"$f":"+S66","v":0},null,{"$f":"+U66","v":0},null,{"$f":"+W66","v":0},null,{"$f":"+Y66","v":0}]
[null,null,"Ensemble de fournitures fixes de la PEC MAS ambulatoire (nouveau site PEC MAS ambulatoire)","ensemble",null,null,{"$f":"+G74","v":0},null,{"$f":"+I74","v":0},null,{"$f":"+K74","v":0},null,{"$f":"+M74","v":0},null,{"$f":"+O74","v":0},null,{"$f":"+Q74","v":0},null,{"$f":"+S74","v":0},null,{"$f":"+U74","v":0},null,{"$f":"+W74","v":0},null,{"$f":"+Y74","v":0}]
[null,null,"Ensemble de fournitures fixes PEC MAS ambulatoire (site PEC MAS ambulatoire établi)","ensemble",null,null,{"$f":"+G75","v":2},null,{"$f":"+I75","v":0},null,{"$f":"+K75","v":0},null,{"$f":"+M75","v":0},null,{"$f":"+O75","v":0},null,{"$f":"+Q75","v":0},null,{"$f":"+S75","v":0},null,{"$f":"+U75","v":0},null,{"$f":"+W75","v":0},null,{"$f":"+Y75","v":0}]
[null,null,"Fiches de suivi de la PEC MAS ambulatoire  ","fiches",null,null,{"$f":"+G68","v":150},null,{"$f":"+I68","v":0},null,{"$f":"+K68","v":0},null,{"$f":"+M68","v":0},null,{"$f":"+O68","v":0},null,{"$f":"+Q68","v":0},null,{"$f":"+S68","v":0},null,{"$f":"+U68","v":0},null,{"$f":"+W68","v":0},null,{"$f":"+Y68","v":0}]
[null,null,"Fiches de rations de l'ATPE pour les nouvelles admissions dans la PEC MAS ambulatoire","fiches",null,null,150,null,0,null,0,null,0,null,0,null,0,null,0,null,0,null,0,null,0]
[null,null,"Bracelets PB","bracelets",null,null,150,null,0,null,0,null,0,null,0,null,0,null,0,null,0,null,0,null,0]
[null,null,"Essuie-main pour les séances de la PEC MAS ambulatoire ","rouleaux",null,null,208,null,0,null,0,null,0,null,0,null,0,null,0,null,0,null,0,null,0]
[null,null,"Savon pour les séances de la PEC MAS ambulatoire ","pièce",null,null,104,null,0,null,0,null,0,null,0,null,0,null,0,null,0,null,0,null,0]
[null,null,"Eau de boisson pour les séances de la PEC MAS ambulatoire ","litres",null,null,104,null,0,null,0,null,0,null,0,null,0,null,0,null,0,null,0,null,0]
[null,null,"Transport entre les sites de la PEC MAS ambulatoire et de la PEC MAS hospitalière  (voyage retour)","km",null,null,{"$f":"+G78","v":105.75},null,0,null,{"$f":"+K78","v":0},null,{"$f":"+M78","v":0},null,{"$f":"+O78","v":0},null,{"$f":"+Q78","v":0},null,{"$f":"+S78","v":0},null,{"$f":"+U78","v":0},null,{"$f":"+W78","v":0},null,{"$f":"+Y78","v":0}]
[null,null,"Nourriture pour l'accompagnant dans la PEC MAS hospitalière ","jours de repas",null,null,652.49999999999989,null,0,null,0,null,0,null,0,null,0,null,0,null,0,null,0,null,0]
[null,null,"Fiches de suivi de la PEC MAS hospitalière ","fiches",null,null,{"$f":"+G80","v":35.25},null,{"$f":"+I80","v":0}," ",0," ",0," ",0," ",0," ",0," ",0," ",0," ",0," "]
[null,null,"Ensemble de fournitures fixes de la PEC MAS hospitalière (nouveau site de la  PEC MAS hospitalière)","ensemble",null,null,{"$f":"+G81","v":0},null,{"$f":"+I81","v":0},null,0,null,0,null,0,null,0,null,0,null,0,null,0,null,0]
[null,null,"Ensemble de fournitures fixes de la PEC MAS hospitalière (site établi de la PEC MAS hospitalière)","ensemble",null,null,{"$f":"+G82","v":1},null,{"$f":"+I82","v":0},null,0,null,0,null,0,null,0,null,0,null,0,null,0,null,0]
[null,null,"Nombre de jours-lit d'hôpital ","jours ",null,null,{"$f":"+G83","v":652.49999999999989},null,{"$f":"+I83","v":0},null,0,null,0,null,0,null,0,null,0,null,0,null,0,null,0]
[null,null,"Nombre de lits d'hôpital nécessaires pour les enfants avec MAS (en supposant une distribution égale des cas sur toute l'année)  ","lits",null,null,{"$f":"+G84","v":2},null,{"$f":"+I84","v":0},null,0,null,0,null,0,null,0,null,0,null,0,null,0,null,0]
[]
[]
[]
[]
[]
[]
[]
[]
[]
[]
[]
[]
[]
[null,null,null,null,null,null,"Zone 1",null,"Zone 2",null,"Zone 3",null,"Zone 4",null,"Zone 5",null,"Zone 6",null,"Zone 7",null,"Zone 8",null,"Zone 9",null,"Zone 10"]
[null,null,null,null,null,null,{"$f":"+IF('D2 Echelle'!$C$31=\"\",\"\",'D2 Echelle'!$C$31)","v":"Ashiedu Keteke"},null,{"$f":"+IF('D2 Echelle'!$C$36=\"\",\"\",'D2 Echelle'!$C$36)","v":""},null,{"$f":"+IF('D2 Echelle'!$C$41=\"\",\"\",'D2 Echelle'!$C$41)","v":""},null,{"$f":"+IF('D2 Echelle'!$C$46=\"\",\"\",'D2 Echelle'!$C$46)","v":""},null,{"$f":"+IF('D2 Echelle'!$C$51=\"\",\"\",'D2 Echelle'!$C$51)","v":""},null,{"$f":"+IF('D2 Echelle'!$C$56=\"\",\"\",'D2 Echelle'!$C$56)","v":""},null,{"$f":"+IF('D2 Echelle'!$C$61=\"\",\"\",'D2 Echelle'!$C$61)","v":""},null,{"$f":"+IF('D2 Echelle'!$C$66=\"\",\"\",'D2 Echelle'!$C$66)","v":""},null,{"$f":"+IF('D2 Echelle'!$C$71=\"\",\"\",'D2 Echelle'!$C$71)","v":""},null,{"$f":"+IF('D2 Echelle'!$C$76=\"\",\"\",'D2 Echelle'!$C$76)","v":""}]
["Haut de page",null,"Calculs",null,null,null,{"$f":"+IF('D2 Echelle'!$D$31=\"\",\"\",'D2 Echelle'!$D$31)","v":"Greater Accra"},null,{"$f":"+IF('D2 Echelle'!$D$36=\"\",\"\",'D2 Echelle'!$D$36)","v":""},null,{"$f":"+IF('D2 Echelle'!$D$41=\"\",\"\",'D2 Echelle'!$D$41)","v":""},null,{"$f":"+IF('D2 Echelle'!$D$46=\"\",\"\",'D2 Echelle'!$D$46)","v":""},null,{"$f":"+IF('D2 Echelle'!$D$51=\"\",\"\",'D2 Echelle'!$D$51)","v":""},null,{"$f":"+IF('D2 Echelle'!$D$56=\"\",\"\",'D2 Echelle'!$D$56)","v":""},null,{"$f":"+IF('D2 Echelle'!$D$61=\"\",\"\",'D2 Echelle'!$D$61)","v":""},null,{"$f":"+IF('D2 Echelle'!$D$66=\"\",\"\",'D2 Echelle'!$D$66)","v":""},null,{"$f":"+IF('D2 Echelle'!$D$71=\"\",\"\",'D2 Echelle'!$D$71)","v":""},null,{"$f":"+IF('D2 Echelle'!$D$76=\"\",\"\",'D2 Echelle'!$D$76)","v":""}]
[null,null,"Variables","Unités","Commentaires","Prix par unité","No. d'unités","Coût","No. d'unités","Coût","No. d'unités","Coût","No. d'unités","Coût","No. d'unités","Coût","No. d'unités","Coût","No. d'unités","Coût","No. d'unités","Coût","No. d'unités","Coût","No. d'unités","Coût"]
[null,null,"Aliment thérapeutique ",null,null,{"$f":"+IF('D1 Données générales'!$H$13=\"\",\"\",'D1 Données générales'!$H$13)","v":"Cedi"},null,{"$f":"+IF('D1 Données générales'!$H$13=\"\",\"\",'D1 Données générales'!$H$13)","v":"Cedi"},null,{"$f":"+IF('D1 Données générales'!$H$13=\"\",\"\",'D1 Données générales'!$H$13)","v":"Cedi"},null,{"$f":"+IF('D1 Données générales'!$H$13=\"\",\"\",'D1 Données générales'!$H$13)","v":"Cedi"},null,{"$f":"+'D1 Données générales'!$H$13","v":"Cedi"},null,{"$f":"+'D1 Données générales'!$H$13","v":"Cedi"},null,{"$f":"+'D1 Données générales'!$H$13","v":"Cedi"},null,{"$f":"+'D1 Données générales'!$H$13","v":"Cedi"},null,{"$f":"+'D1 Données générales'!$H$13","v":"Cedi"},null,{"$f":"+'D1 Données générales'!$H$13","v":"Cedi"},null,{"$f":"+'D1 Données générales'!$H$13","v":"Cedi"}]
[null,null,"ATPE pour enfant  avec MAS sans complications médicales (et + de 6 mois)","kg",null,{"$f":"+'D4 Prix'!F49","v":6},{"$f":"+G102*(G90-G91)*(100+G96)/100","v":1514.7},{"$f":"+G62*$F$62","v":9088.2000000000007},{"$f":"+I102*(I90-I91)*(100+I96)/100","v":0},{"$f":"+I62*$F$62","v":0},{"$f":"+K102*(K90-K91)*(100+K96)/100","v":0},{"$f":"+K62*$F$62","v":0},{"$f":"+M102*(M90-M91)*(100+M96)/100","v":0},{"$f":"+M62*$F$62","v":0},{"$f":"+O102*(O90-O91)*(100+O96)/100","v":0},{"$f":"+O62*$F$62","v":0},{"$f":"+Q102*(Q90-Q91)*(100+Q96)/100","v":0},{"$f":"+Q62*$F$62","v":0},{"$f":"+S102*(S90-S91)*(100+S96)/100","v":0},{"$f":"+S62*$F$62","v":0},{"$f":"+U102*(U90-U91)*(100+U96)/100","v":0},{"$f":"+U62*$F$62","v":0},{"$f":"+W102*(W90-W91)*(100+W96)/100","v":0},{"$f":"+W62*$F$62","v":0},{"$f":"+Y102*(Y90-Y91)*(100+Y96)/100","v":0},{"$f":"+Y62*$F$62","v":0}]
[null,null,"ATPE pour enfants avec MAS et complications médicales (et + de 6 mois)","kg",null,{"$f":"+'D4 Prix'!F49","v":6},{"$f":"+G103*G91*(100+G96)/100","v":442.03500000000003},{"$f":"+G63*$F$63","v":2652.21},{"$f":"+I103*I91*(100+I96)/100","v":0},{"$f":"+I63*$F$63","v":0},{"$f":"+K103*K91*(100+K96)/100","v":0},{"$f":"+K63*$F$63","v":0},{"$f":"+M103*M91*(100+M96)/100","v":0},{"$f":"+M63*$F$63","v":0},{"$f":"+O103*O91*(100+O96)/100","v":0},{"$f":"+O63*$F$63","v":0},{"$f":"+Q103*Q91*(100+Q96)/100","v":0},{"$f":"+Q63*$F$63","v":0},{"$f":"+S103*S91*(100+S96)/100","v":0},{"$f":"+S63*$F$63","v":0},{"$f":"+U103*U91*(100+U96)/100","v":0},{"$f":"+U63*$F$63","v":0},{"$f":"+W103*W91*(100+W96)/100","v":0},{"$f":"+W63*$F$63","v":0},{"$f":"+Y103*Y91*(100+Y96)/100","v":0},{"$f":"+Y63*$F$63","v":0}]
[null,null,"ATPE fourni dans les sites de PEC MAS hospitalière ","kg",null,{"$f":"+'D4 Prix'!F49","v":6},{"$f":"+G104*G91*(100+G96)/100","v":36.836249999999993},{"$f":"+G64*$F$64","v":221.01749999999996},{"$f":"+I104*I91*(100+I96)/100","v":0},{"$f":"+I64*$F$64","v":0},{"$f":"+K104*K91*(100+K96)/100","v":0},{"$f":"+K64*$F$64","v":0},{"$f":"+M104*M91*(100+M96)/100","v":0},{"$f":"+M64*$F$64","v":0},{"$f":"+O104*O91*(100+O96)/100","v":0},{"$f":"+O64*$F$64","v":0},{"$f":"+Q104*Q91*(100+Q96)/100","v":0},{"$f":"+Q64*$F$64","v":0},{"$f":"+S104*S91*(100+S96)/100","v":0},{"$f":"+S64*$F$64","v":0},{"$f":"+U104*U91*(100+U96)/100","v":0},{"$f":"+U64*$F$64","v":0},{"$f":"+W104*W91*(100+W96)/100","v":0},{"$f":"+W64*$F$64","v":0},{"$f":"+Y104*Y91*(100+Y96)/100","v":0},{"$f":"+Y64*$F$64","v":0}]
[null,null,"F-75 pour les enfants avec MAS qui sont hospitalisés","kg",null,{"$f":"+'D4 Prix'!F50","v":4.5},{"$f":"+G105*G91*(100+G96)/100","v":77.55},{"$f":"+G65*$F$65","v":348.97499999999997},{"$f":"+I105*I91*(100+I96)/100","v":0},{"$f":"+I65*$F$65","v":0},{"$f":"+K105*K91*(100+K96)/100","v":0},{"$f":"+K65*$F$65","v":0},{"$f":"+M105*M91*(100+M96)/100","v":0},{"$f":"+M65*$F$65","v":0},{"$f":"+O105*O91*(100+O96)/100","v":0},{"$f":"+O65*$F$65","v":0},{"$f":"+Q105*Q91*(100+Q96)/100","v":0},{"$f":"+Q65*$F$65","v":0},{"$f":"+S105*S91*(100+S96)/100","v":0},{"$f":"+S65*$F$65","v":0},{"$f":"+U105*U91*(100+U96)/100","v":0},{"$f":"+U65*$F$65","v":0},{"$f":"+W105*W91*(100+W96)/100","v":0},{"$f":"+W65*$F$65","v":0},{"$f":"+Y105*Y91*(100+Y96)/100","v":0},{"$f":"+Y65*$F$65","v":0}]
[null,null,"F-100 pour les enfants avec MAS qui sont hospitalisés et y restent jusqu'à la guérisson","kg",null,{"$f":"+'D4 Prix'!F51","v":5},{"$f":"+G106*G91*(100+G96)/100","v":23.265000000000001},{"$f":"+G66*$F$66","v":116.325},{"$f":"+I106*I91*(100+I96)/100","v":0},{"$f":"+I66*$F$66","v":0},{"$f":"+K106*K91*(100+K96)/100","v":0},{"$f":"+K66*$F$66","v":0},{"$f":"+M106*M91*(100+M96)/100","v":0},{"$f":"+M66*$F$66","v":0},{"$f":"+O106*O91*(100+O96)/100","v":0},{"$f":"+O66*$F$66","v":0},{"$f":"+Q106*Q91*(100+Q96)/100","v":0},{"$f":"+Q66*$F$66","v":0},{"$f":"+S106*S91*(100+S96)/100","v":0},{"$f":"+S66*$F$66","v":0},{"$f":"+U106*U91*(100+U96)/100","v":0},{"$f":"+U66*$F$66","v":0},{"$f":"+W106*W91*(100+W96)/100","v":0},{"$f":"+W66*$F$66","v":0},{"$f":"+Y106*Y91*(100+Y96)/100","v":0},{"$f":"+Y66*$F$66","v":0}]
[null,null,"Fiches et autres fournitures",null,null," "]
[null,null,"Fiche de suivi de la PEC MAS ambulatoire pour les nouvelles admissions ","fiche",null,{"$f":"+'D4 Prix'!F52","v":0.6},{"$f":"+G90*G107","v":150},{"$f":"+G68*$F$68","v":90},{"$f":"+I90*I107","v":0},{"$f":"+I68*$F$68","v":0},{"$f":"+K90*K107","v":0},{"$f":"+K68*$F$68","v":0},{"$f":"+M90*M107","v":0},{"$f":"+M68*$F$68","v":0},{"$f":"+O90*O107","v":0},{"$f":"+O68*$F$68","v":0},{"$f":"+Q90*Q107","v":0},{"$f":"+Q68*$F$68","v":0},{"$f":"+S90*S107","v":0},{"$f":"+S68*$F$68","v":0},{"$f":"+U90*U107","v":0},{"$f":"+U68*$F$68","v":0},{"$f":"+W90*W107","v":0},{"$f":"+W68*$F$68","v":0},{"$f":"+Y90*Y107","v":0},{"$f":"+Y68*$F$68","v":0}]
[null,null,"Fiche de ration de l'ATPE pour les nouvelles admissions","fiche",null,{"$f":"+'D4 Prix'!F54","v":0.5},{"$f":"+G90*G109","v":150},{"$f":"+G69*$F$69","v":75},{"$f":"+I90*I109","v":0},{"$f":"+I69*$F$69","v":0},{"$f":"+K90*K109","v":0},{"$f":"+K69*$F$69","v":0},{"$f":"+M90*M109","v":0},{"$f":"+M69*$F$69","v":0},{"$f":"+O90*O109","v":0},{"$f":"+O69*$F$69","v":0},{"$f":"+Q90*Q109","v":0},{"$f":"+Q69*$F$69","v":0},{"$f":"+S90*S109","v":0},{"$f":"+S69*$F$69","v":0},{"$f":"+U90*U109","v":0},{"$f":"+U69*$F$69","v":0},{"$f":"+W90*W109","v":0},{"$f":"+W69*$F$69","v":0},{"$f":"+Y90*Y109","v":0},{"$f":"+Y69*$F$69","v":0}]
[null,null,"Bracelets PB","bracelets",null,{"$f":"+'D4 Prix'!F55","v":0},{"$f":"+G90*G110","v":150},{"$f":"+G70*$F$70","v":0},{"$f":"+I90*I110","v":0},{"$f":"+I70*$F$70","v":0},{"$f":"+K90*K110","v":0},{"$f":"+K70*$F$70","v":0},{"$f":"+M90*M110","v":0},{"$f":"+M70*$F$70","v":0},{"$f":"+O90*O110","v":0},{"$f":"+O70*$F$70","v":0},{"$f":"+Q90*Q110","v":0},{"$f":"+Q70*$F$70","v":0},{"$f":"+S90*S110","v":0},{"$f":"+S70*$F$70","v":0},{"$f":"+U90*U110","v":0},{"$f":"+U70*$F$70","v":0},{"$f":"+W90*W110","v":0},{"$f":"+W70*$F$70","v":0},{"$f":"+Y90*Y110","v":0},{"$f":"+Y70*$F$70","v":0}]
[null,null,"Essuie-main pour les séances de la PEC MAS ambulatoire ","rouleaux",null,{"$f":"+'D4 Prix'!F56","v":1},{"$f":"+G111*G94","v":208},{"$f":"+G71*$F$71","v":208},{"$f":"+I111*I94","v":0},{"$f":"+I71*$F$71","v":0},{"$f":"+K111*K94","v":0},{"$f":"+K71*$F$71","v":0},{"$f":"+M111*M94","v":0},{"$f":"+M71*$F$71","v":0},{"$f":"+O111*O94","v":0},{"$f":"+O71*$F$71","v":0},{"$f":"+Q111*Q94","v":0},{"$f":"+Q71*$F$71","v":0},{"$f":"+S111*S94","v":0},{"$f":"+S71*$F$71","v":0},{"$f":"+U111*U94","v":0},{"$f":"+U71*$F$71","v":0},{"$f":"+W111*W94","v":0},{"$f":"+W71*$F$71","v":0},{"$f":"+Y111*Y94","v":0},{"$f":"+Y71*$F$71","v":0}]
[null,null,"Savon pour les séances de la PEC MAS ambulatoire ","pièces",null,{"$f":"+'D4 Prix'!F57","v":0.8},{"$f":"+G112*G94","v":104},{"$f":"+G72*$F$72","v":83.2},{"$f":"+I112*I94","v":0},{"$f":"+I72*$F$72","v":0},{"$f":"+K112*K94","v":0},{"$f":"+K72*$F$72","v":0},{"$f":"+M112*M94","v":0},{"$f":"+M72*$F$72","v":0},{"$f":"+O112*O94","v":0},{"$f":"+O72*$F$72","v":0},{"$f":"+Q112*Q94","v":0},{"$f":"+Q72*$F$72","v":0},{"$f":"+S112*S94","v":0},{"$f":"+S72*$F$72","v":0},{"$f":"+U112*U94","v":0},{"$f":"+U72*$F$72","v":0},{"$f":"+W112*W94","v":0},{"$f":"+W72*$F$72","v":0},{"$f":"+Y112*Y94","v":0},{"$f":"+Y72*$F$72","v":0}]
[null,null,"Eau de boisson pour les séances de la  PEC MAS ambulatoire ","litres",null,{"$f":"+'D4 Prix'!F58","v":0.5},{"$f":"+G113*G94","v":104},{"$f":"+G73*$F$73","v":52},{"$f":"+I113*I94","v":0},{"$f":"+I73*$F$73","v":0},{"$f":"+K113*K94","v":0},{"$f":"+K73*$F$73","v":0},{"$f":"+M113*M94","v":0},{"$f":"+M73*$F$73","v":0},{"$f":"+O113*O94","v":0},{"$f":"+O73*$F$73","v":0},{"$f":"+Q113*Q94","v":0},{"$f":"+Q73*$F$73","v":0},{"$f":"+S113*S94","v":0},{"$f":"+S73*$F$73","v":0},{"$f":"+U113*U94","v":0},{"$f":"+U73*$F$73","v":0},{"$f":"+W113*W94","v":0},{"$f":"+W73*$F$73","v":0},{"$f":"+Y113*Y94","v":0},{"$f":"+Y73*$F$73","v":0}]
[null,null,"Ensembles de fournitures fixes de la PEC MAS ambulatoire pour les nouveaux sites de la PEC MAS ambulatoire ","ensembles",null,{"$f":"+'D6 Fournitures fixes'!K71","v":558.19999999999993},{"$f":"+G97","v":0},{"$f":"+G74*$F74","v":0},{"$f":"+I97","v":0},{"$f":"+I74*$F74","v":0},{"$f":"+K97","v":0},{"$f":"+K74*$F74","v":0},{"$f":"+M97","v":0},{"$f":"+M74*$F74","v":0},{"$f":"+O97","v":0},{"$f":"+O74*$F74","v":0},{"$f":"+Q97","v":0},{"$f":"+Q74*$F74","v":0},{"$f":"+S97","v":0},{"$f":"+S74*$F74","v":0},{"$f":"+U97","v":0},{"$f":"+U74*$F74","v":0},{"$f":"+W97","v":0},{"$f":"+W74*$F74","v":0},{"$f":"+Y97","v":0},{"$f":"+Y74*$F74","v":0}]
[null,null,"Ensembles de fournitures fixes de la PEC MAS ambulatoire pour un site PEC MAS ambulatoire établi (Feuille de calcul D6, coûts moyens pour les années 2-6))","ensembles",null,{"$f":"+SUM('D6 Fournitures fixes'!L71:P71)/5","v":185.68},{"$f":"+G98","v":2},{"$f":"+$F$75*G75","v":371.36},{"$f":"+I98","v":0},{"$f":"+$F$75*I75","v":0},{"$f":"+K98","v":0},{"$f":"+$F$75*K75","v":0},{"$f":"+M98","v":0},{"$f":"+$F$75*M75","v":0},{"$f":"+O98","v":0},{"$f":"+$F$75*O75","v":0},{"$f":"+Q98","v":0},{"$f":"+$F$75*Q75","v":0},{"$f":"+S98","v":0},{"$f":"+$F$75*S75","v":0},{"$f":"+U98","v":0},{"$f":"+$F$75*U75","v":0},{"$f":"+W98","v":0},{"$f":"+$F$75*W75","v":0},{"$f":"+Y98","v":0},{"$f":"+$F$75*Y75","v":0}]
[null,null,"Sous-total",null,null,null,null,{"$f":"+SUM(H68:H75)","v":879.56},null,{"$f":"+SUM(J68:J75)","v":0},null,{"$f":"+SUM(L68:L75)","v":0},null,{"$f":"+SUM(N68:N75)","v":0},null,{"$f":"+SUM(P68:P75)","v":0},null,{"$f":"+SUM(R68:R75)","v":0},null,{"$f":"+SUM(T68:T75)","v":0},null,{"$f":"+SUM(V68:V75)","v":0},null,{"$f":"+SUM(X68:X75)","v":0},null,{"$f":"+SUM(Z68:Z75)","v":0}]
[null,null,"Fournitures pour les cas compliqués"]
[null,null,"Transport pour les patients de la PEC MAS ambulatoire vers la PEC MAS hospitalière et retour ","km",null,{"$f":"+'D4 Prix'!F76","v":2},{"$f":"+G101*2*G91","v":105.75},{"$f":"+G78*$F$78","v":211.5},{"$f":"+I101*2*I91","v":0},{"$f":"+I78*$F$78","v":0},{"$f":"+K101*2*K91","v":0},{"$f":"+K78*$F$78","v":0},{"$f":"+M101*2*M91","v":0},{"$f":"+M78*$F$78","v":0},{"$f":"+O101*2*O91","v":0},{"$f":"+O78*$F$78","v":0},{"$f":"+Q101*2*Q91","v":0},{"$f":"+Q78*$F$78","v":0},{"$f":"+S101*2*S91","v":0},{"$f":"+S78*$F$78","v":0},{"$f":"+U101*2*U91","v":0},{"$f":"+U78*$F$78","v":0},{"$f":"+W101*2*W91","v":0},{"$f":"+W78*$F$78","v":0},{"$f":"+Y101*2*Y91","v":0},{"$f":"+Y78*$F$78","v":0}]
[null,null,"Nourriture pour l'accompagnant de l'enfant avec MAS qui est hospitalisé","jours de repas",null,{"$f":"+'D4 Prix'!F59","v":0},{"$f":"+G91*G92","v":652.49999999999989},{"$f":"+G79*$F$79","v":0},{"$f":"+I91*I92","v":0},{"$f":"+I79*$F$79","v":0},{"$f":"+K91*K92","v":0},{"$f":"+K79*$F$79","v":0},{"$f":"+M91*M92","v":0},{"$f":"+M79*$F$79","v":0},{"$f":"+O91*O92","v":0},{"$f":"+O79*$F$79","v":0},{"$f":"+Q91*Q92","v":0},{"$f":"+Q79*$F$79","v":0},{"$f":"+S91*S92","v":0},{"$f":"+S79*$F$79","v":0},{"$f":"+U91*U92","v":0},{"$f":"+U79*$F$79","v":0},{"$f":"+W91*W92","v":0},{"$f":"+W79*$F$79","v":0},{"$f":"+Y91*Y92","v":0},{"$f":"+Y79*$F$79","v":0}]
[null,null,"Fiche de suivi de la PEC MAS hospitalière  ","paquet de fiches",null,{"$f":"+'D4 Prix'!F53","v":1},{"$f":"+G91*G108","v":35.25},{"$f":"+G80*$F$80","v":35.25},{"$f":"+I91*I108","v":0},{"$f":"+I80*$F$80","v":0},{"$f":"+K91*K108","v":0},{"$f":"+K80*$F$80","v":0},{"$f":"+M91*M108","v":0},{"$f":"+M80*$F$80","v":0},{"$f":"+O91*O108","v":0},{"$f":"+O80*$F$80","v":0},{"$f":"+Q91*Q108","v":0},{"$f":"+Q80*$F$80","v":0},{"$f":"+S91*S108","v":0},{"$f":"+S80*$F$80","v":0},{"$f":"+U91*U108","v":0},{"$f":"+U80*$F$80","v":0},{"$f":"+W91*W108","v":0},{"$f":"+W80*$F$80","v":0},{"$f":"+Y91*Y108","v":0},{"$f":"+Y80*$F$80","v":0}]
[null,null,"Ensembles de fournitures fixes de la PEC MAS hospitalière pour les nouveaux sites de la PEC MAS hospitalière ","ensemble de fournitures",null,{"$f":"+'D6 Fournitures fixes'!K121","v":801.19999999999993},{"$f":"+G99","v":0},{"$f":"+G81*$F81","v":0},{"$f":"+I99","v":0},{"$f":"+I81*$F81","v":0},{"$f":"+K99","v":0},{"$f":"+K81*$F81","v":0},{"$f":"+M99","v":0},{"$f":"+M81*$F81","v":0},{"$f":"+O99","v":0},{"$f":"+O81*$F81","v":0},{"$f":"+Q99","v":0},{"$f":"+Q81*$F81","v":0},{"$f":"+S99","v":0},{"$f":"+S81*$F81","v":0},{"$f":"+U99","v":0},{"$f":"+U81*$F81","v":0},{"$f":"+W99","v":0},{"$f":"+W81*$F81","v":0},{"$f":"+Y99","v":0},{"$f":"+Y81*$F81","v":0}]
[null,null,"Ensembles de fournitures fixes du site de la  PEC MAS hospitalière pour des sites établis de la PEC MAS hospitalière ","ensemble de fournitures",null,{"$f":"+SUM('D6 Fournitures fixes'!L121:P121)/5","v":234.28000000000003},{"$f":"+G100","v":1},{"$f":"+G82*$F$82","v":234.28000000000003},{"$f":"+I100","v":0},{"$f":"+I82*$F$82","v":0},{"$f":"+K100","v":0},{"$f":"+K82*$F$82","v":0},{"$f":"+M100","v":0},{"$f":"+M82*$F$82","v":0},{"$f":"+O100","v":0},{"$f":"+O82*$F$82","v":0},{"$f":"+Q100","v":0},{"$f":"+Q82*$F$82","v":0},{"$f":"+S100","v":0},{"$f":"+S82*$F$82","v":0},{"$f":"+U100","v":0},{"$f":"+U82*$F$82","v":0},{"$f":"+W100","v":0},{"$f":"+W82*$F$82","v":0},{"$f":"+Y100","v":0},{"$f":"+Y82*$F$82","v":0}]
[null,null,"Nombre de jours-lit d'hôpital pour les enfants avec MAS ","jours-lit",null,null,{"$f":"+G91*G92","v":652.49999999999989},null,{"$f":"+I91*I92","v":0},null,{"$f":"+K91*K92","v":0},null,{"$f":"+M91*M92","v":0},null,{"$f":"+O91*O92","v":0},null,{"$f":"+Q91*Q92","v":0},null,{"$f":"+S91*S92","v":0},null,{"$f":"+U91*U92","v":0},null,{"$f":"+W91*W92","v":0},null,{"$f":"+Y91*Y92","v":0}]
[null,null,"Nombre minimum de lits d'hôpital nécessaires pour les enfants avec MAS avec complications (en supposant une distribution égale des cas sur toute l'année)  (l'accompagnant partage le lit avec l'enfant)","lits",null,null,{"$f":"+G93","v":2},null,{"$f":"+I93","v":0},null,{"$f":"+K93","v":0},null,{"$f":"+M93","v":0},null,{"$f":"+O93","v":0},null,{"$f":"+Q93","v":0},null,{"$f":"+S93","v":0},null,{"$f":"+U93","v":0},null,{"$f":"+W93","v":0},null,{"$f":"+Y93","v":0}]
[null,null,"Sous-total",null,null,null,null,{"$f":"+SUM(H78:H84)","v":481.03000000000003},null,{"$f":"+SUM(J78:J84)","v":0},null,{"$f":"+SUM(L78:L84)","v":0},null,{"$f":"+SUM(N78:N84)","v":0},null,{"$f":"+SUM(P78:P84)","v":0},null,{"$f":"+SUM(R78:R84)","v":0},null,{"$f":"+SUM(T78:T84)","v":0},null,{"$f":"+SUM(V78:V84)","v":0},null,{"$f":"+SUM(X78:X84)","v":0},null,{"$f":"+SUM(Z78:Z84)","v":0}]
[]
[]
[null,null,"Drivers de base, données brutes"]
[null,null,"Variables","Unités","Commentaires"]
[null,null,"Nombre de cas de MAS par an","cas","Feuille de cacul D9",null,{"$f":"+'D9 Variables temps'!F39","v":150},null,{"$f":"+'D9 Variables temps'!J39","v":0},null,{"$f":"+'D9 Variables temps'!K39","v":0},null,{"$f":"+'D9 Variables temps'!L39","v":0},null,{"$f":"+'D9 Variables temps'!M39","v":0},null,{"$f":"+'D9 Variables temps'!N39","v":0},null,{"$f":"+'D9 Variables temps'!O39","v":0},null,{"$f":"+'D9 Variables temps'!P39","v":0},null,{"$f":"+'D9 Variables temps'!Q39","v":0},null,{"$f":"+'D9 Variables temps'!R39","v":0}]
[null,null,"Nombre de cas de MAS demandant PEC MAS hospitalière par an","cas","Feuille de calcul D9",null,{"$f":"+'D9 Variables temps'!F42","v":35.25},null,{"$f":"+'D9 Variables temps'!J42","v":0},null,{"$f":"+'D9 Variables temps'!K42","v":0},null,{"$f":"+'D9 Variables temps'!L42","v":0},null,{"$f":"+'D9 Variables temps'!M42","v":0},null,{"$f":"+'D9 Variables temps'!N42","v":0},null,{"$f":"+'D9 Variables temps'!O42","v":0},null,{"$f":"+'D9 Variables temps'!P42","v":0},null,{"$f":"+'D9 Variables temps'!Q42","v":0},null,{"$f":"+'D9 Variables temps'!R42","v":0}]
[null,null,"Nombre moyen de jours dans la  PEC MAS hospitalière par enfant hospitalisé avec MAS  ","jours","Feuille de calcul D3",null,{"$f":"+'D3 Données épi. démo'!F31","v":18.510638297872337},null,{"$f":"+'D3 Données épi. démo'!J31","v":10},null,{"$f":"+'D3 Données épi. démo'!K31","v":10},null,{"$f":"+'D3 Données épi. démo'!L31","v":10},null,{"$f":"+'D3 Données épi. démo'!M31","v":10},null,{"$f":"+'D3 Données épi. démo'!N31","v":10},null,{"$f":"+'D3 Données épi. démo'!O31","v":10},null,{"$f":"+'D3 Données épi. démo'!P31","v":10},null,{"$f":"+'D3 Données épi. démo'!Q31","v":10},null,{"$f":"+'D3 Données épi. démo'!R31","v":10}]
[null,null,"Nombre de cas de MAS dans la PEC MAS hospitalière à n'importe quel moment du temps","cas","Feuille de calculD4",null,{"$f":"+'D9 Variables temps'!F43","v":2},null,{"$f":"+'D9 Variables temps'!J43","v":0},null,{"$f":"+'D9 Variables temps'!K43","v":0},null,{"$f":"+'D9 Variables temps'!L43","v":0},null,{"$f":"+'D9 Variables temps'!M43","v":0},null,{"$f":"+'D9 Variables temps'!N43","v":0},null,{"$f":"+'D9 Variables temps'!O43","v":0},null,{"$f":"+'D9 Variables temps'!P43","v":0},null,{"$f":"+'D9 Variables temps'!Q43","v":0},null,{"$f":"+'D9 Variables temps'!R43","v":0}]
[null,null,"Nombre de séances de PEC MAS ambulatoire/an","séances","Feuille de calcul D5",null,{"$f":"+'R8 Traitement (main-d''oeuvres)'!F92","v":104},null,{"$f":"+'R8 Traitement (main-d''oeuvres)'!J92","v":0},null,{"$f":"+'R8 Traitement (main-d''oeuvres)'!K92","v":0},null,{"$f":"+'R8 Traitement (main-d''oeuvres)'!L92","v":0},null,{"$f":"+'R8 Traitement (main-d''oeuvres)'!M92","v":0},null,{"$f":"+'R8 Traitement (main-d''oeuvres)'!N92","v":0},null,{"$f":"+'R8 Traitement (main-d''oeuvres)'!O92","v":0},null,{"$f":"+'R8 Traitement (main-d''oeuvres)'!P92","v":0},null,{"$f":"+'R8 Traitement (main-d''oeuvres)'!Q92","v":0},null,{"$f":"+'R8 Traitement (main-d''oeuvres)'!R92","v":0}]
[null,null,"Nombre de visites par enfant avec MAS","visites","Feuille de calcul D6",null,{"$f":"+'D3 Données épi. démo'!F33","v":8},null,{"$f":"+'D3 Données épi. démo'!J33","v":8},null,{"$f":"+'D3 Données épi. démo'!K33","v":8},null,{"$f":"+'D3 Données épi. démo'!L33","v":8},null,{"$f":"+'D3 Données épi. démo'!M33","v":8},null,{"$f":"+'D3 Données épi. démo'!N33","v":8},null,{"$f":"+'D3 Données épi. démo'!O33","v":8},null,{"$f":"+'D3 Données épi. démo'!P32","v":8},null,{"$f":"+'D3 Données épi. démo'!Q33","v":8},null,{"$f":"+'D3 Données épi. démo'!R33","v":8}]
[null,null,"Perte estimée (%) de l'aliment thérapeutique","%","Feuille de calculD7",null,{"$f":"+'D3 Données épi. démo'!F109","v":10},null,{"$f":"+'D3 Données épi. démo'!J109","v":10},null,{"$f":"+'D3 Données épi. démo'!K109","v":10},null,{"$f":"+'D3 Données épi. démo'!L109","v":10},null,{"$f":"+'D3 Données épi. démo'!M109","v":10},null,{"$f":"+'D3 Données épi. démo'!N109","v":10},null,{"$f":"+'D3 Données épi. démo'!O109","v":10},null,{"$f":"+'D3 Données épi. démo'!P109","v":10},null,{"$f":"+'D3 Données épi. démo'!Q109","v":10},null,{"$f":"+'D3 Données épi. démo'!R109","v":10}]
[null,null,"Nombre de nouveaux sites de la PEC MAS ambulatoire ","sites","Feuille de calcul D8",null,{"$f":"+'D9 Variables temps'!F30","v":0},null,{"$f":"+'D9 Variables temps'!J30","v":0},null,{"$f":"+'D9 Variables temps'!K30","v":0},null,{"$f":"+'D9 Variables temps'!L30","v":0},null,{"$f":"+'D9 Variables temps'!M30","v":0},null,{"$f":"+'D9 Variables temps'!N30","v":0},null,{"$f":"+'D9 Variables temps'!O30","v":0},null,{"$f":"+'D9 Variables temps'!P30","v":0},null,{"$f":"+'D9 Variables temps'!Q30","v":0},null,{"$f":"+'D9 Variables temps'!R30","v":0}]
[null,null,"Nombre de sites établis de la PEC MAS ambulatoire ","sites","Feuille de calcul D9",null,{"$f":"+'D9 Variables temps'!F31","v":2},null,{"$f":"+'D9 Variables temps'!J31","v":0},null,{"$f":"+'D9 Variables temps'!K31","v":0},null,{"$f":"+'D9 Variables temps'!L31","v":0},null,{"$f":"+'D9 Variables temps'!M31","v":0},null,{"$f":"+'D9 Variables temps'!N31","v":0},null,{"$f":"+'D9 Variables temps'!O31","v":0},null,{"$f":"+'D9 Variables temps'!P31","v":0},null,{"$f":"+'D9 Variables temps'!Q31","v":0},null,{"$f":"+'D9 Variables temps'!R31","v":0}]
[null,null,"Nombre de nouveaux sites de la PEC MAS hospitalière ","sites","Feuille de calcul D10",null,{"$f":"+'D9 Variables temps'!F33","v":0},null,{"$f":"+'D9 Variables temps'!J33","v":0},null,{"$f":"+'D9 Variables temps'!K33","v":0},null,{"$f":"+'D9 Variables temps'!L33","v":0},null,{"$f":"+'D9 Variables temps'!M33","v":0},null,{"$f":"+'D9 Variables temps'!N33","v":0},null,{"$f":"+'D9 Variables temps'!O33","v":0},null,{"$f":"+'D9 Variables temps'!P33","v":0},null,{"$f":"+'D9 Variables temps'!Q33","v":0},null,{"$f":"+'D9 Variables temps'!R33","v":0}]
[null,null,"Nombre de sites établis de la PEC MAS hospitalière ","sites","Feuille de calcul D11",null,{"$f":"+'D9 Variables temps'!F34","v":1},null,{"$f":"+'D9 Variables temps'!J34","v":0},null,{"$f":"+'D9 Variables temps'!K34","v":0},null,{"$f":"+'D9 Variables temps'!L34","v":0},null,{"$f":"+'D9 Variables temps'!M34","v":0},null,{"$f":"+'D9 Variables temps'!N34","v":0},null,{"$f":"+'D9 Variables temps'!O34","v":0},null,{"$f":"+'D9 Variables temps'!P34","v":0},null,{"$f":"+'D9 Variables temps'!Q34","v":0},null,{"$f":"+'D9 Variables temps'!R34","v":0}]
[null,null,"Distance moyenne des sites PEC MAS ambulatoire au site de la PEC MAS hospitalière ","kms","Feuille de calcul D12",null,{"$f":"+'D3 Données épi. démo'!F129","v":1.5},null,{"$f":"+'D3 Données épi. démo'!J129","v":0},null,{"$f":"+'D3 Données épi. démo'!K129","v":0},null,{"$f":"+'D3 Données épi. démo'!L129","v":0},null,{"$f":"+'D3 Données épi. démo'!M129","v":0},null,{"$f":"+'D3 Données épi. démo'!N129","v":0},null,{"$f":"+'D3 Données épi. démo'!O129","v":0},null,{"$f":"+'D3 Données épi. démo'!P129","v":0},null,{"$f":"+'D3 Données épi. démo'!Q129","v":0},null,{"$f":"+'D3 Données épi. démo'!R129","v":0}]
[null,null,"ATPE par enfant avec MAS sans complications médicales (et de plus de 6 mois)","kg","Feuille de calcul D13",null,{"$f":"+'D3 Données épi. démo'!$F$106","v":12},null,{"$f":"+'D3 Données épi. démo'!$J$106","v":12},null,{"$f":"+'D3 Données épi. démo'!$K$106","v":12},null,{"$f":"+'D3 Données épi. démo'!$L$106","v":12},null,{"$f":"+'D3 Données épi. démo'!$M$106","v":12},null,{"$f":"+'D3 Données épi. démo'!$N$106","v":12},null,{"$f":"+'D3 Données épi. démo'!$O$106","v":12},null,{"$f":"+'D3 Données épi. démo'!$P$106","v":12},null,{"$f":"+'D3 Données épi. démo'!$Q$106","v":12},null,{"$f":"+'D3 Données épi. démo'!$R$106","v":12}]
[null,null,"ATPE par enfant avec MAS et complications médicales (et de plus de 6 mois)","kg","Feuille de calculD14",null,{"$f":"+'D3 Données épi. démo'!$F$107","v":11.4},null,{"$f":"+'D3 Données épi. démo'!$J$107","v":11.4},null,{"$f":"+'D3 Données épi. démo'!$K$107","v":11.4},null,{"$f":"+'D3 Données épi. démo'!$L$107","v":11.4},null,{"$f":"+'D3 Données épi. démo'!$M$107","v":11.4},null,{"$f":"+'D3 Données épi. démo'!$N$107","v":11.4},null,{"$f":"+'D3 Données épi. démo'!O$107","v":11.4},null,{"$f":"+'D3 Données épi. démo'!$P$107","v":11.4},null,{"$f":"+'D3 Données épi. démo'!$Q$107","v":11.4},null,{"$f":"+'D3 Données épi. démo'!$R$107","v":11.4}]
[null,null,"Quantité de l'ATPE fourni par la PEC MAS hospitalière par enfant avec MAS  ","kg","Feuille de calculD15",null,{"$f":"+'D3 Données épi. démo'!F108","v":0.95},null,{"$f":"+'D3 Données épi. démo'!J108","v":0.95},null,{"$f":"+'D3 Données épi. démo'!K108","v":0.95}," ",{"$f":"+'D3 Données épi. démo'!L108","v":0.95}," ",{"$f":"+'D3 Données épi. démo'!M108","v":0.95}," ",{"$f":"+'D3 Données épi. démo'!N108","v":0.95}," ",{"$f":"+'D3 Données épi. démo'!O108","v":0.95}," ",{"$f":"+'D3 Données épi. démo'!P108","v":0.95}," ",{"$f":"+'D3 Données épi. démo'!Q108","v":0.95}," ",{"$f":"+'D3 Données épi. démo'!R108","v":0.95}]
[null,null,"F75 par enfant avec MAS qui est hospitalisé","kg","Feuille de calcul D16",null,{"$f":"+'D3 Données épi. démo'!$F$110","v":2},null,{"$f":"+'D3 Données épi. démo'!$J$110","v":2},null,{"$f":"+'D3 Données épi. démo'!$K$110","v":2},null,{"$f":"+'D3 Données épi. démo'!$L$110","v":2},null,{"$f":"+'D3 Données épi. démo'!$M$110","v":2},null,{"$f":"+'D3 Données épi. démo'!$N$110","v":2},null,{"$f":"+'D3 Données épi. démo'!$O$110","v":2},null,{"$f":"+'D3 Données épi. démo'!$P$110","v":2},null,{"$f":"+'D3 Données épi. démo'!$Q$110","v":2},null,{"$f":"+'D3 Données épi. démo'!$R$110","v":2}]
[null,null,"F100 par enfant avec MAS qui est hospitalisé et y restent jusqu'à la guérisson (sur la base des 5% des cas hospitalisés nécessitant 12 kg)","kg","Feuille de calcul D17",null,{"$f":"+'D3 Données épi. démo'!$F$111","v":0.6},null,{"$f":"+'D3 Données épi. démo'!$J$111","v":0.6},null,{"$f":"+'D3 Données épi. démo'!$K$111","v":0.6},null,{"$f":"+'D3 Données épi. démo'!$L$111","v":0.6},null,{"$f":"+'D3 Données épi. démo'!$M$111","v":0.6},null,{"$f":"+'D3 Données épi. démo'!$N$111","v":0.6},null,{"$f":"+'D3 Données épi. démo'!$O$111","v":0.6},null,{"$f":"+'D3 Données épi. démo'!$P$111","v":0.6},null,{"$f":"+'D3 Données épi. démo'!$Q$111","v":0.6},null,{"$f":"+'D3 Données épi. démo'!$R$111","v":0.6}]
[null,null,"Fiche de suivi de la PEC MAS ambulatoire pour les nouvelles admissions par cas de MAS ambulatoire","fiche","Feuille de calcul D18",null,{"$f":"+'D3 Données épi. démo'!$F$112","v":1},null,{"$f":"+'D3 Données épi. démo'!$J$112","v":1},null,{"$f":"+'D3 Données épi. démo'!$K$112","v":1},null,{"$f":"+'D3 Données épi. démo'!$L$112","v":1},null,{"$f":"+'D3 Données épi. démo'!$M$112","v":1},null,{"$f":"+'D3 Données épi. démo'!$N$112","v":1},null,{"$f":"+'D3 Données épi. démo'!$O$112","v":1},null,{"$f":"+'D3 Données épi. démo'!$P$112","v":1},null,{"$f":"+'D3 Données épi. démo'!$Q$112","v":1},null,{"$f":"+'D3 Données épi. démo'!$R$112","v":1}]
[null,null,"Fiche de suivi de la PEC MAS hospitalière par cas de MAS hospitalisé","paquets de fiches","Feuille de calcul D19",null,{"$f":"+'D3 Données épi. démo'!F113","v":1},null,{"$f":"+'D3 Données épi. démo'!J113","v":1}," ",{"$f":"+'D3 Données épi. démo'!K113","v":1}," ",{"$f":"+'D3 Données épi. démo'!L113","v":1},null,{"$f":"+'D3 Données épi. démo'!M113","v":1}," ",{"$f":"+'D3 Données épi. démo'!N113","v":1}," ",{"$f":"+'D3 Données épi. démo'!O113","v":1}," ",{"$f":"+'D3 Données épi. démo'!P113","v":1}," ",{"$f":"+'D3 Données épi. démo'!Q113","v":1}," ",{"$f":"+'D3 Données épi. démo'!R113","v":1}]
[null,null,"Fiches de ration de l'ATPE pour les nouvelles admissions par cas de MAS ambulatoire","fiche","Feuille de calcul D20",null,{"$f":"+'D3 Données épi. démo'!$F$114","v":1},null,{"$f":"+'D3 Données épi. démo'!$J$114","v":1},null,{"$f":"+'D3 Données épi. démo'!$K$114","v":1},null,{"$f":"+'D3 Données épi. démo'!$L$114","v":1},null,{"$f":"+'D3 Données épi. démo'!$M$114","v":1},null,{"$f":"+'D3 Données épi. démo'!$N$114","v":1},null,{"$f":"+'D3 Données épi. démo'!$O$114","v":1},null,{"$f":"+'D3 Données épi. démo'!$P$114","v":1},null,{"$f":"+'D3 Données épi. démo'!$Q$114","v":1},null,{"$f":"+'D3 Données épi. démo'!$R$114","v":1}]
[null,null,"Bracelets PB par cas de MAS","bracelets","Feuille de calcul D21",null,{"$f":"+'D3 Données épi. démo'!$F$115","v":1},null,{"$f":"+'D3 Données épi. démo'!$J$115","v":1},null,{"$f":"+'D3 Données épi. démo'!$K$115","v":1},null,{"$f":"+'D3 Données épi. démo'!$L$115","v":1},null,{"$f":"+'D3 Données épi. démo'!$M$115","v":1},null,{"$f":"+'D3 Données épi. démo'!$N$115","v":1},null,{"$f":"+'D3 Données épi. démo'!$O$115","v":1},null,{"$f":"+'D3 Données épi. démo'!$P$115","v":1},null,{"$f":"+'D3 Données épi. démo'!$Q$115","v":1},null,{"$f":"+'D3 Données épi. démo'!$R$115","v":1}]
[null,null,"Essuie-main par séance de PEC MAS ambulatoire","rouleaux","Feuille de calcul D22",null,{"$f":"+'D3 Données épi. démo'!$F$116","v":2},null,{"$f":"+'D3 Données épi. démo'!$J$116","v":2},null,{"$f":"+'D3 Données épi. démo'!$K$116","v":2},null,{"$f":"+'D3 Données épi. démo'!$L$116","v":2},null,{"$f":"+'D3 Données épi. démo'!$M$116","v":2},null,{"$f":"+'D3 Données épi. démo'!$N$116","v":2},null,{"$f":"+'D3 Données épi. démo'!$O$116","v":2},null,{"$f":"+'D3 Données épi. démo'!$P$116","v":2},null,{"$f":"+'D3 Données épi. démo'!$Q$116","v":2},null,{"$f":"+'D3 Données épi. démo'!$R$116","v":2}]
[null,null,"Savon par séance de PEC MAS ambulatoire ","pièces","Feuille de calcul D23",null,{"$f":"+'D3 Données épi. démo'!$F$117","v":1},null,{"$f":"+'D3 Données épi. démo'!$J$117","v":1},null,{"$f":"+'D3 Données épi. démo'!$K$117","v":1},null,{"$f":"+'D3 Données épi. démo'!$L$117","v":1},null,{"$f":"+'D3 Données épi. démo'!$M$117","v":1},null,{"$f":"+'D3 Données épi. démo'!$N$117","v":1},null,{"$f":"+'D3 Données épi. démo'!$O$117","v":1},null,{"$f":"+'D3 Données épi. démo'!$P$117","v":1},null,{"$f":"+'D3 Données épi. démo'!$Q$117","v":1},null,{"$f":"+'D3 Données épi. démo'!$R$117","v":1}]
[null,null,"Eau de boisson par séane de PEC MAS ambulatoire","litres","Feuille de calcul D24",null,{"$f":"+'D3 Données épi. démo'!$F$120","v":1},null,{"$f":"+'D3 Données épi. démo'!$J$120","v":1},null,{"$f":"+'D3 Données épi. démo'!$K$120","v":1},null,{"$f":"+'D3 Données épi. démo'!$L$120","v":1},null,{"$f":"+'D3 Données épi. démo'!$M$120","v":1},null,{"$f":"+'D3 Données épi. démo'!$N$120","v":1},null,{"$f":"+'D3 Données épi. démo'!$O$120","v":1},null,{"$f":"+'D3 Données épi. démo'!$P$120","v":1},null,{"$f":"+'D3 Données épi. démo'!$Q$120","v":1},null,{"$f":"+'D3 Données épi. démo'!$R$120","v":1}]

{"sheet":"R11 Logistique approvisionnemen","index":25,"n_rows":147,"n_cols":19,"rows_kept":147,"cut":false,"hidden":false,"merged":[[51,0,56,0],[1,2,1,5],[15,0,21,0],[24,0,47,0],[22,2,22,4],[4,2,4,5],[149,9,149,17],[51,2,51,4],[52,2,52,4],[53,2,53,4],[54,2,54,4],[55,2,55,4],[56,2,56,4]]}
[]
["Retour au sommaire",null,"R11:  Logistique de l'approvisionnement (transport et stockage)"]
[]
[null,null,"Number of Areas included ",{"$f":"+'D2 Echelle'!$I$8","v":1},"  (taken from Worksheet W2)",null,"hide"]
[null,null,"Cette Feuille de calcul montre (pour l'année choisie) les quantités des différents intrants nécessaires pour transporter et stocker l'aliment thérapeutique pour la PCMA (ATPE, F-75, et F-100), et les coûts de ces intrants."]
[]
[null,null,"Voir ci dessous pour la manière dont les chiffres sont calculés"]
[null,null,"EPT= Equivalent Plein Temps"]
[]
[null,null,{"$f":"+IF('D1 Données générales'!$H$11=\"\",\"\",'D1 Données générales'!$H$11)","v":"Ghana"}]
[null,null,{"$f":"+'D9 Variables temps'!$I$6","v":2011},null,null,"Zone 1",null,null,null,"Zone 2","Zone 3","Zone 4","Zone 5","Zone 6","Zone 7","Zone 8","Zone 9","Zone 10"]
[null,null,null,null,{"$f":"'D2 Echelle'!C30","v":"district"},{"$f":"+IF('D2 Echelle'!$C$31=\"\",\"\",'D2 Echelle'!$C$31)","v":"Ashiedu Keteke"},null,null,null,{"$f":"+IF('D2 Echelle'!$C$36=\"\",\"\",'D2 Echelle'!$C$36)","v":""},{"$f":"+IF('D2 Echelle'!$C$41=\"\",\"\",'D2 Echelle'!$C$41)","v":""},{"$f":"+IF('D2 Echelle'!$C$46=\"\",\"\",'D2 Echelle'!$C$46)","v":""},{"$f":"+IF('D2 Echelle'!$C$51=\"\",\"\",'D2 Echelle'!$C$51)","v":""},{"$f":"+IF('D2 Echelle'!$C$56=\"\",\"\",'D2 Echelle'!$C$56)","v":""},{"$f":"+IF('D2 Echelle'!$C$61=\"\",\"\",'D2 Echelle'!$C$61)","v":""},{"$f":"+IF('D2 Echelle'!$C$66=\"\",\"\",'D2 Echelle'!$C$66)","v":""},{"$f":"+IF('D2 Echelle'!$C$71=\"\",\"\",'D2 Echelle'!$C$71)","v":""},{"$f":"+IF('D2 Echelle'!$C$76=\"\",\"\",'D2 Echelle'!$C$76)","v":""}]
[null,null,null,null,{"$f":"+'D2 Echelle'!D30","v":"région"},{"$f":"+IF('D2 Echelle'!$D$31=\"\",\"\",'D2 Echelle'!$D$31)","v":"Greater Accra"},null,null,null,{"$f":"+IF('D2 Echelle'!$D$36=\"\",\"\",'D2 Echelle'!$D$36)","v":""},{"$f":"+IF('D2 Echelle'!$D$41=\"\",\"\",'D2 Echelle'!$D$41)","v":""},{"$f":"+IF('D2 Echelle'!$D$46=\"\",\"\",'D2 Echelle'!$D$46)","v":""},{"$f":"+IF('D2 Echelle'!$D$51=\"\",\"\",'D2 Echelle'!$D$51)","v":""},{"$f":"+IF('D2 Echelle'!$D$56=\"\",\"\",'D2 Echelle'!$D$56)","v":""},{"$f":"+IF('D2 Echelle'!$D$61=\"\",\"\",'D2 Echelle'!$D$61)","v":""},{"$f":"+IF('D2 Echelle'!$D$66=\"\",\"\",'D2 Echelle'!$D$66)","v":""},{"$f":"+IF('D2 Echelle'!$D$71=\"\",\"\",'D2 Echelle'!$D$71)","v":""},{"$f":"+IF('D2 Echelle'!$D$76=\"\",\"\",'D2 Echelle'!$D$76)","v":""}]
[null,null,"Coût annuel total du stockage et des transports"]
[null,null,"Variables","Unités","Commentaires"]
[null,null," - Espace pour l'aliment thérapeutique",{"$f":"+IF('D1 Données générales'!$H$13=\"\",\"\",'D1 Données générales'!$H$13)","v":"Cedi"},null,{"$f":"+F29*F143","v":0},null,null,null,{"$f":"+J29*J143","v":0},0,0,0,0,0,0,0,0]
[null,null," - Transport de l'aliment thérapeutique",{"$f":"+IF('D1 Données générales'!$H$13=\"\",\"\",'D1 Données générales'!$H$13)","v":"Cedi"},null,{"$f":"+F32*F147","v":384},null,null,null,{"$f":"+J32*J147","v":0},0,0,0,0,0,0,0,0]
[null,null," - Fiches de stock",{"$f":"+IF('D1 Données générales'!$H$13=\"\",\"\",'D1 Données générales'!$H$13)","v":"Cedi"},null,{"$f":"+(F42+F43+F44)*F146","v":4.8000000000000007},null,null,null,{"$f":"+(J42+J43+J44)*J146","v":0},0,0,0,0,0,0,0,0]
[null,null," - Gardiens pour les magasins de l'aliment thérapeutique",{"$f":"+IF('D1 Données générales'!$H$13=\"\",\"\",'D1 Données générales'!$H$13)","v":"Cedi"},null,{"$f":"+(F33+F34+F35)*F144","v":4800},null,null,null,{"$f":"+(J33+J34+J35)*J144","v":0},0,0,0,0,0,0,0,0]
[null,null," - Chauffeurs des véhicules",{"$f":"+D19","v":"Cedi"},null,{"$f":"+F41*F145","v":50.36538461538462},null,null,null,{"$f":"+J41*J145","v":0},0,0,0,0,0,0,0,0]
[null,null,"Coût annuel total du stockage et des transports",{"$f":"+IF('D1 Données générales'!$H$13=\"\",\"\",'D1 Données générales'!$H$13)","v":"Cedi"},null,{"$f":"+SUM(F16:F20)","v":5239.1653846153849},null,null,null,{"$f":"+SUM(J16:J20)","v":0},0,0,0,0,0,0,0,0]
[]
[null,null,{"$f":"+message15","v":"Quantities of inputs needed for this activity"}]
[null,null,"Variables","Unités","Commentaires"]
[null,null,"Volume de l'espace nécessaire au siège du Groupe-zones (minimum)","voir R6"]
[null,null,"Volume de l'espace nécessaire au siège de la zone (minimum)","m3",null,{"$f":"+F100","v":0.60902354433593753},null,null,null,{"$f":"+J100","v":0},0,0,0,0,0,0,0,0]
[null,null,"Volume de l'espace nécessaire dans les sites de la PEC MAS ambulatoire (minimum)","m3",null,{"$f":"+F103*F120","v":0.54397131249999997},null,null,null,{"$f":"+J103*J120","v":0},0,0,0,0,0,0,0,0]
[null,null,"Volume de l'espace nécessaire dans le site de la PEC MAS hospitalière (minimum)","m3",null,{"$f":"+F104*F121","v":6.5052231835937502E-2},null,null,null,{"$f":"+J104*J121","v":0},0,0,0,0,0,0,0,0]
[null,null,"Espace total nécessaire pour l'aliment thérapeutique","m3",null,{"$f":"+SUM(F25:F28)","v":1.2180470886718748},null,null,null,{"$f":"+SUM(J25:J28)","v":0},0,0,0,0,0,0,0,0]
[null,null,"Distance parcourue par an pour distribuer l'aliment thérapeutique du siège du groupe-zones au siège de la zone. ","kms",null,{"$f":"+F106","v":12},null,null,null,{"$f":"+J106","v":0},0,0,0,0,0,0,0,0]
[null,null,"Distance parcourue par an pour distribuer l'aliment thérapeutique du siège de la zone aux sites PEC MAS ambulatoire et hospitalière","kms",null,{"$f":"+F107+F108","v":180},null,null,null,{"$f":"+J107+J108","v":0},0,0,0,0,0,0,0,0]
[null,null,"Total Distance parcourue pour distribuer l'aliment thérapeutique ","kms",null,{"$f":"+F30+F31","v":192},null,null,null,{"$f":"+J30+J31","v":0},0,0,0,0,0,0,0,0]
[null,null,"Gardiens pour les magasins de l'aliment thérapeutique (Sites de la PEC MAS ambulatoire)","EPT ",null,{"$f":"+F120","v":2},null,null,null,{"$f":"+J120","v":0},0,0,0,0,0,0,0,0]
[null,null,"Gardiens pour les magasins de l'aliment thérapeutique (Sites de la PEC MAS hospitalière)","EPT ",null,{"$f":"+F121","v":1},null,null,null,{"$f":"+J121","v":0},0,0,0,0,0,0,0,0]
[null,null,"Gardiens pour les magasins de l'aliment thérapeutique (siège de la zone)","EPT ",null,{"$f":"+IF(F116=\"inactive\",0,1)","v":1},null,null,null,{"$f":"+IF(J116=\"inactive\",0,1)","v":0},0,0,0,0,0,0,0,0]
[null,null,"Gardiens pour les magasins de l'aliment thérapeutique (siège du groupe-zones)","EPT ","Voir niveau plus élevé"]
[null,null,"Temps total des gardiens pour les magasins de l'aliment thérapeutique","EPT ",null,{"$f":"+SUM(F33:F36)","v":4},null,null,null,{"$f":"+SUM(J33:J36)","v":0},0,0,0,0,0,0,0,0]
[null,null,"Chauffeurs des véhicules (siège aux sites de la  PEC MAS ambulatoire)","jours",null,{"$f":"+F109/F141","v":3.75},null,null,null,{"$f":"+J109/J141","v":0},0,0,0,0,0,0,0,0]
[null,null,"Chauffeurs des véhicules (siège aux sites de la PEC MAS hospitalière)","jours",null,{"$f":"+F110/F141","v":1.875},null,null,null,{"$f":"+J110/J141","v":0},0,0,0,0,0,0,0,0]
[null,null,"Chauffeurs des véhicules (siège du groupe-zones au siège de la zone)","jours",null,{"$f":"+IF(F116=\"inactive\",0,F111/F141)","v":1.6500000000000001},null,null,null,{"$f":"+IF(J116=\"inactive\",0,J111/J141)","v":0},0,0,0,0,0,0,0,0]
[null,null,"Temps total des chauffeurs distribuant l'aliment thérapeutique ","jours",null,{"$f":"F40+F39+F38","v":7.2750000000000004},null,null,null,{"$f":"J40+J39+J38","v":0},0,0,0,0,0,0,0,0]
[null,null,"Fiches de stock (Sites de la PEC MAS ambulatoire)","fiches",null,{"$f":"+F120*F140","v":24},null,null,null,{"$f":"+J120*J140","v":0},0,0,0,0,0,0,0,0]
[null,null,"Fiches de stock (Sites de la PEC MAS hospitalière)","fiches",null,{"$f":"+F121*F140","v":12},null,null,null,{"$f":"+J121*J140","v":0},0,0,0,0,0,0,0,0]
[null,null,"Fiches de stock du siège de la zone","fiches",null,{"$f":"+IF(F116=\"inactive\",0,F140)","v":12},null,null,null,{"$f":"+IF(J116=\"inactive\",0,J140)","v":0},0,0,0,0,0,0,0,0]
[null,null,"Fiches de stock du siège du groupe-zones","fiches","Voir niveau plus élevé"]
[]
[null,"Données:"]
[null,null,"Fréquence annuelle des livraisons au siège de la zone",null,null,{"$f":"+F126","v":6},null,null,null,{"$f":"+J126","v":0},0,0,0,0,0,0,0,0]
[null,null,"Fréquence annuelle des livraisons aux sites de la PEC MAS ambulatoire",null,null,{"$f":"+F127","v":6},null,null,null,{"$f":"+J127","v":0},0,0,0,0,0,0,0,0]
[null,null,"Fréquence annuelle des livraisons aux sites de la PEC MAS hospitalière",null,null,{"$f":"+F128","v":6},null,null,null,{"$f":"+J128","v":0},0,0,0,0,0,0,0,0]
[]
["HIDE these rows",null,"!!  Indicates a need to increase either frequency of delivery of therapeutic food to Area's HQ or the size  of vehicle transporting it there. ",null,null,{"$f":"IF(F26>F133,\"!!\", \"\")","v":""},null,null,null,{"$f":"IF(J26>J133,\"!!\", \"\")","v":""},"","","","","","",{"$f":"IF(Q26>Q133,\"!!\", \"\")","v":""},{"$f":"IF(R26>R133,\"!!\", \"\")","v":""},{"$f":"+IF(OR(F52=\"!!\",J52=\"!!\",K52=\"!!\",L52=\"!!\",M52=\"!!\",N52=\"!!\",O52=\"!!\",P52=\"!!\",Q52=\"!!\",R52=\"!!\"),\"!!!\",\"\")","v":""}]
[null,null,"!!  indicates a need to increase either frequency of delivery of therapeutic food to Area's HQ or the storage space for it there. ",null,null,{"$f":"IF(F26>F134,\"!!\", \"\")","v":""},null,null,null,{"$f":"IF(J26>J134,\"!!\", \"\")","v":""},"","","","","","","",{"$f":"IF(R26>R134,\"!!\", \"\")","v":""},{"$f":"+IF(OR(F53=\"!!\",J53=\"!!\",K53=\"!!\",L53=\"!!\",M53=\"!!\",N53=\"!!\",O53=\"!!\",P53=\"!!\",Q53=\"!!\",R53=\"!!\"),\"!!!\",\"\")","v":""}]
[null,null,"!! indicates a need to increase either frequency of delivery of therapeutic food to OC sites or the size of vehicle transporting it there.",null,null,{"$f":"IF(F27>F135,\"!!\", \"\")","v":""},null,null,null,{"$f":"IF(J27>J135,\"!!\", \"\")","v":""},"","","","","",{"$f":"IF(P27>P135,\"!!\",\"\")","v":""},{"$f":"IF(Q27>Q135,\"!!\", \"\")","v":""},{"$f":"IF(R27>R135,\"!!\", \"\")","v":""},{"$f":"+IF(OR(F54=\"!!\",J54=\"!!\",K54=\"!!\",L54=\"!!\",M54=\"!!\",N54=\"!!\",O54=\"!!\",P54=\"!!\",Q54=\"!!\",R54=\"!!\"),\"!!!\",\"\")","v":""}]
[null,null,"!! indicates a need to increase either frequency of delivery of therapeutic food to OC sites or the storage space  for it there.  ",null,null,{"$f":"IF(F27>F136,\"!!\", \"\")","v":""},null,null,null,{"$f":"IF(J27>J136,\"!!\", \"\")","v":""},"","","","","","","","",{"$f":"+IF(OR(F55=\"!!\",J55=\"!!\",K55=\"!!\",L55=\"!!\",M55=\"!!\",N55=\"!!\",O55=\"!!\",P55=\"!!\",Q55=\"!!\",R55=\"!!\"),\"!!!\",\"\")","v":""}]
[null,null,"!! indicates a need to increase either frequency of delivery of therapeutic food to IC sites or the size of vehicle transporting it there.",null,null,{"$f":"IF(F28>F137,\"!!\", \"\")","v":""},null,null,null,{"$f":"IF(J28>J137,\"!!\", \"\")","v":""},"","","","","","","","",{"$f":"+IF(OR(F56=\"E!\",J56=\"!!\",K56=\"!!\",L56=\"!!\",M56=\"!!\",N56=\"!!\",O56=\"!!\",P56=\"!!\",Q56=\"!!\",R56=\"!!\"),\"!!!\",\"\")","v":""}]
[null,null,"!! indicates a need to increase either frequency of delivery of therapeutic food to IC sites or the storage space  for it there.",null,null,{"$f":"IF(F28>F138,\"!!\", \"\")","v":""},null,null,null,{"$f":"IF(J28>J138,\"!!\", \"\")","v":""},"","","","","","","","",{"$f":"+IF(OR(F57=\"!!\",J57=\"!!\",K57=\"!!\",L57=\"!!\",M57=\"!!\",N57=\"!!\",O57=\"!!\",P57=\"!!\",Q57=\"!!\",R57=\"!!\"),\"!!!\",\"\")","v":""}]
["Important hidden rows above"]
[]
[]
[]
[]
[]
[]
[]
[]
[]
[]
[]
[]
[]
[]
[]
[]
[]
[]
[]
[]
[]
[]
[]
[]
[]
[]
[]
[]
[null,null,null,null,null,"Zone 1",null,null,null,"Zone 2","Zone 3","Zone 4","Zone 5","Zone 6","Zone 7","Zone 8","Zone 9","Zone 10"]
["Haut de page",null,"CALCULS",null,null,{"$f":"+IF('D2 Echelle'!$C$31=\"\",\"\",'D2 Echelle'!$C$31)","v":"Ashiedu Keteke"},null,null,null,{"$f":"+IF('D2 Echelle'!$C$36=\"\",\"\",'D2 Echelle'!$C$36)","v":""},{"$f":"+IF('D2 Echelle'!$C$41=\"\",\"\",'D2 Echelle'!$C$41)","v":""},{"$f":"+IF('D2 Echelle'!$C$46=\"\",\"\",'D2 Echelle'!$C$46)","v":""},{"$f":"+IF('D2 Echelle'!$C$51=\"\",\"\",'D2 Echelle'!$C$51)","v":""},{"$f":"+IF('D2 Echelle'!$C$56=\"\",\"\",'D2 Echelle'!$C$56)","v":""},{"$f":"+IF('D2 Echelle'!$C$61=\"\",\"\",'D2 Echelle'!$C$61)","v":""},{"$f":"+IF('D2 Echelle'!$C$66=\"\",\"\",'D2 Echelle'!$C$66)","v":""},{"$f":"+IF('D2 Echelle'!$C$71=\"\",\"\",'D2 Echelle'!$C$71)","v":""},{"$f":"+IF('D2 Echelle'!$C$76=\"\",\"\",'D2 Echelle'!$C$76)","v":""}]
[null,null,"Variables","Unités","Commentaires",{"$f":"+IF('D2 Echelle'!$D$31=\"\",\"\",'D2 Echelle'!$D$31)","v":"Greater Accra"},null,null,null,{"$f":"+IF('D2 Echelle'!$D$36=\"\",\"\",'D2 Echelle'!$D$36)","v":""},{"$f":"+IF('D2 Echelle'!$D$41=\"\",\"\",'D2 Echelle'!$D$41)","v":""},{"$f":"+IF('D2 Echelle'!$D$46=\"\",\"\",'D2 Echelle'!$D$46)","v":""},{"$f":"+IF('D2 Echelle'!$D$51=\"\",\"\",'D2 Echelle'!$D$51)","v":""},{"$f":"+IF('D2 Echelle'!$D$56=\"\",\"\",'D2 Echelle'!$D$56)","v":""},{"$f":"+IF('D2 Echelle'!$D$61=\"\",\"\",'D2 Echelle'!$D$61)","v":""},{"$f":"+IF('D2 Echelle'!$D$66=\"\",\"\",'D2 Echelle'!$D$66)","v":""},{"$f":"+IF('D2 Echelle'!$D$71=\"\",\"\",'D2 Echelle'!$D$71)","v":""},{"$f":"+IF('D2 Echelle'!$D$76=\"\",\"\",'D2 Echelle'!$D$76)","v":""}]
[null,null,"Espace nécessaire"]
[null,null,"Quantité de l'ATPE fournie dans les sites de la PEC MAS ambulatoire","kg","Feuille de calcul R10",{"$f":"+'R10 Traitement (fournitures)'!G62+'R10 Traitement (fournitures)'!G63-'R11 Logistique approvisionnemen'!F92","v":1919.8987500000001},null,null,null,{"$f":"+'R10 Traitement (fournitures)'!I62+'R10 Traitement (fournitures)'!I63-'R11 Logistique approvisionnemen'!J92","v":0},{"$f":"+'R10 Traitement (fournitures)'!K62+'R10 Traitement (fournitures)'!K63-'R11 Logistique approvisionnemen'!K92","v":0},{"$f":"+'R10 Traitement (fournitures)'!M62+'R10 Traitement (fournitures)'!M63-'R11 Logistique approvisionnemen'!L92","v":0},{"$f":"+'R10 Traitement (fournitures)'!O62+'R10 Traitement (fournitures)'!O63-'R11 Logistique approvisionnemen'!M92","v":0},{"$f":"+'R10 Traitement (fournitures)'!Q62+'R10 Traitement (fournitures)'!Q63-'R11 Logistique approvisionnemen'!N92","v":0},{"$f":"+'R10 Traitement (fournitures)'!S62+'R10 Traitement (fournitures)'!S63-'R11 Logistique approvisionnemen'!O92","v":0},{"$f":"+'R10 Traitement (fournitures)'!U62+'R10 Traitement (fournitures)'!U63-'R11 Logistique approvisionnemen'!P92","v":0},{"$f":"+'R10 Traitement (fournitures)'!W62+'R10 Traitement (fournitures)'!W63-'R11 Logistique approvisionnemen'!Q92","v":0},{"$f":"+'R10 Traitement (fournitures)'!Y62+'R10 Traitement (fournitures)'!Y63-'R11 Logistique approvisionnemen'!R92","v":0}]
[null,null,"Quantité de l'ATPE fournie dans les sites de la PEC MAS hospitalière","kg","Feuille de calcul R10",{"$f":"+'R10 Traitement (fournitures)'!G64","v":36.836249999999993},null,null,null,{"$f":"+'R10 Traitement (fournitures)'!I64","v":0},{"$f":"+'R10 Traitement (fournitures)'!K64","v":0},{"$f":"+'R10 Traitement (fournitures)'!M64","v":0},{"$f":"+'R10 Traitement (fournitures)'!O64","v":0},{"$f":"+'R10 Traitement (fournitures)'!Q64","v":0},{"$f":"+'R10 Traitement (fournitures)'!S64","v":0},{"$f":"+'R10 Traitement (fournitures)'!U64","v":0},{"$f":"+'R10 Traitement (fournitures)'!W64","v":0},{"$f":"+'R10 Traitement (fournitures)'!Y64","v":0}]
[null,null,"Total annuel besoins en F-75 (de la Feuille de calcul R10)","kg","Feuille de calcul R10",{"$f":"+'R10 Traitement (fournitures)'!G27","v":77.55},null,null,null,{"$f":"+'R10 Traitement (fournitures)'!I27","v":0},{"$f":"+'R10 Traitement (fournitures)'!K27","v":0},{"$f":"+'R10 Traitement (fournitures)'!M27","v":0},{"$f":"+'R10 Traitement (fournitures)'!O27","v":0},{"$f":"+'R10 Traitement (fournitures)'!Q27","v":0},{"$f":"+'R10 Traitement (fournitures)'!S27","v":0},{"$f":"+'R10 Traitement (fournitures)'!U27","v":0},{"$f":"+'R10 Traitement (fournitures)'!W27","v":0},{"$f":"+'R10 Traitement (fournitures)'!Y27","v":0}]
[null,null,"Total annuel en besoins F-100 (de la Feuille de calcul R10)","kg","Feuille de calcul R10",{"$f":"+'R10 Traitement (fournitures)'!G28","v":23.265000000000001},null,null,null,{"$f":"+'R10 Traitement (fournitures)'!I28","v":0},{"$f":"+'R10 Traitement (fournitures)'!K28","v":0},{"$f":"+'R10 Traitement (fournitures)'!M28","v":0},{"$f":"+'R10 Traitement (fournitures)'!O28","v":0},{"$f":"+'R10 Traitement (fournitures)'!Q28","v":0},{"$f":"+'R10 Traitement (fournitures)'!S28","v":0},{"$f":"+'R10 Traitement (fournitures)'!U28","v":0},{"$f":"+'R10 Traitement (fournitures)'!W28","v":0},{"$f":"+'R10 Traitement (fournitures)'!Y28","v":0}]
[null,null,"Espace occupé par les quantités annuelles nécessaires de l'ATPE pour les sites de la PEC MAS ambulatoire dans la zone","m3",null,{"$f":"+F91*F117","v":3.263827875},null,null,null,{"$f":"+J91*J117","v":0},0,0,0,0,0,0,0,0]
[null,null,"Espace occupé par les quantités annuelles nécessaires de l'ATPE pour les sites de la PEC MAS  hospitalière dans la zone","m3",null,{"$f":"+F92*F117","v":6.2621624999999986E-2},null,null,null,{"$f":"+J92*J117","v":0},0,0,0,0,0,0,0,0]
[null,null,"Espace occupé par les quantitiés annuelles nécessaires de F-75 and F-100 pour les sites de la PEC MAS hospitalière dans la zone","m3",null,{"$f":"+F93*F118+F94*F119","v":0.327691766015625},null,null,null,{"$f":"+J93*J118+J94*J119","v":0},0,0,0,0,0,0,0,0]
[null,null,"Espace occupé par les quantités annuelles nécessaires de l'aliment thérapeutique dans les sites PEC MAS hospitalière dans la zone","m3",null,{"$f":"+F96+F97","v":0.39031339101562501},null,null,null,{"$f":"+J96+J97","v":0},0,0,0,0,0,0,0,0]
[null,null,"Espace occupé par les quantités annuelles nécessaires de l'aliment thérapeutique de la zone","m3",null,{"$f":"+F98+F95","v":3.6541412660156252},null,null,null,{"$f":"+J98+J95","v":0},0,0,0,0,0,0,0,0]
[null,null,"Espace occupé par la livraison moyenne de l'aliment thérapeutique au siège de la zone ","m3",null,{"$f":"+IF(F126=0,0,F99/F126)","v":0.60902354433593753},null,null,null,{"$f":"+IF(J126=0,0,J99/J126)","v":0},0,0,0,0,0,0,0,0]
[null,null,"Espace occupé par les quantités annuelles nécessaires de l'aliment thérapeutique dans les PEC MAS ambulatoire par site","m3",null,{"$f":"+IF(F120=0,0,F95/F120)","v":1.6319139375},null,null,null,{"$f":"+IF(J120=0,0,J95/J120)","v":0},0,0,0,0,0,0,0,0]
[null,null,"Espace occupé pa les quantités annuelles nécessaires de l'aliment thérapeutique pour les sites PEC MAS hospitalière par site","m3",null,{"$f":"+IF(F121=0,0,F98/F121)","v":0.39031339101562501},null,null,null,{"$f":"+IF(J121=0,0,J98/J121)","v":0},0,0,0,0,0,0,0,0]
[null,null,"Espace occupé par les quantités nécessaires de l'ATPE par site de PEC MAS ambulatoire par livraison","m3",null,{"$f":"+IF(F127=0,0,F101/F127)","v":0.27198565624999999},null,null,null,{"$f":"+IF(J127=0,0,J101/J127)","v":0},0,0,0,0,0,0,0,0]
[null,null,"Espace occupé par les quantités nécessaires de l'aliment thérapeutique par site PEC MAS hospitalière par livraison","m3",null,{"$f":"+IF(F128=0,0,F102/F128)","v":6.5052231835937502E-2},null,null,null,{"$f":"+IF(J128=0,0,J102/J128)","v":0},0,0,0,0,0,0,0,0]
[null,null,"Besoins en transport"]
[null,null,"Distance parcourue par an pour transporter l'aliment thérapeutique du groupe-zones au siège de la zone","km",null,{"$f":"+IF(F116=\"inactive\",0,F125*2*F126)","v":12},null,null,null,{"$f":"+IF(J116=\"inactive\",0,J125*2*J126)","v":0},0,0,0,0,0,0,0,0]
[null,null,"Distance parcourue par an pour transporter l'aliment thérapeutique du siège de la zone au sites PEC MAS ambulatoire","km",null,{"$f":"+F123*2*F127*F120","v":120},null,null,null,{"$f":"+J123*2*J127*J120","v":0},0,0,0,0,0,0,0,0]
[null,null,"Distance parcourue par an pour transporter l'aliment thérapeutique du siège de la zone aux sites PEC MAS hospitalière","km",null,{"$f":"+F124*2*F128*F121","v":60},null,null,null,{"$f":"+J124*2*J128*J121","v":0},0,0,0,0,0,0,0,0]
[null,null,"Temps de chauffeur pour les livraisons aux sites de la PEC MAS ambulatoire","heures",null,{"$f":"+F120*F127*(F129+F132)*2","v":30},null,null,null,{"$f":"+J120*J127*(J129+J132)*2","v":0},0,0,0,0,0,0,0,0]
[null,null,"Temps de chauffeur pour les livraisons aux sites de la PEC MAS hospitalière","heures",null,{"$f":"+F121*F128*(F130+F132)*2","v":15},null,null,null,{"$f":"+J121*J128*(J130+J132)*2","v":0},0,0,0,0,0,0,0,0]
[null,null,"Temps de chauffeur pour les livraisons au siège de la zone","heures",null,{"$f":"+F126*(F131+F132)*2","v":13.200000000000001},null,null,null,{"$f":"+J126*(J131+J132)*2","v":0},0,0,0,0,0,0,0,0]
[null,null,"Autre"]
[null,null,"Nombre de gardiens du magasin","gardiens",null,{"$f":"+(F120+F121+1)","v":4},null,null,null,{"$f":"+(J120+J121+1)","v":1},1,1,1,1,1,1,1,1]
[null,null,"Nombre  de fiches de contrôle de stock par an","fiches",null,{"$f":"+IF(F120+F121>0,(F120+F121+1)*F140,0)","v":48},null,null,null,{"$f":"+IF(J120+J121>0,(J120+J121+1)*J140,0)","v":0},0,0,0,0,0,0,0,0]
[null,null,"Drivers de base, données de base"]
[null,null,"Cette zone est-elle déjà établie, nouvelle ou ne fonctionne-t-elle pas encore en ce qui concerne la PCMA?",null,"Feuille de calcul D9",{"$f":"+'D9 Variables temps'!F46","v":"établie"},null,null,null,{"$f":"+'D9 Variables temps'!J46","v":"inactive"},{"$f":"+'D9 Variables temps'!K46","v":"inactive"},{"$f":"+'D9 Variables temps'!L46","v":"inactive"},{"$f":"+'D9 Variables temps'!M46","v":"inactive"},{"$f":"+'D9 Variables temps'!N46","v":"inactive"},{"$f":"+'D9 Variables temps'!O46","v":"inactive"},{"$f":"+'D9 Variables temps'!P46","v":"inactive"},{"$f":"+'D9 Variables temps'!Q46","v":"inactive"},{"$f":"+'D9 Variables temps'!R46","v":"inactive"}]
[null,null,"Espace occupé par un 1 kg de l'ATPE","m3","Feuille de calcul D3",{"$f":"+'D3 Données épi. démo'!F140","v":1.6999999999999999E-3},null,null,null,{"$f":"+'D3 Données épi. démo'!J140","v":1.6999999999999999E-3},{"$f":"+'D3 Données épi. démo'!K140","v":1.6999999999999999E-3},{"$f":"+'D3 Données épi. démo'!L140","v":1.6999999999999999E-3},{"$f":"+'D3 Données épi. démo'!M140","v":1.6999999999999999E-3},{"$f":"+'D3 Données épi. démo'!N140","v":1.6999999999999999E-3},{"$f":"+'D3 Données épi. démo'!O140","v":1.6999999999999999E-3},{"$f":"+'D3 Données épi. démo'!P140","v":1.6999999999999999E-3},{"$f":"+'D3 Données épi. démo'!Q140","v":1.6999999999999999E-3},{"$f":"+'D3 Données épi. démo'!R140","v":1.6999999999999999E-3}]
[null,null,"Espace occupé par un 1 kg de F-75","m3","Feuille de calcul D3",{"$f":"+'D3 Données épi. démo'!F147","v":3.2000000000000002E-3},null,null,null,{"$f":"+'D3 Données épi. démo'!J147","v":3.2000000000000002E-3},{"$f":"+'D3 Données épi. démo'!K147","v":3.2000000000000002E-3},{"$f":"+'D3 Données épi. démo'!L147","v":3.2000000000000002E-3},{"$f":"+'D3 Données épi. démo'!M147","v":3.2000000000000002E-3},{"$f":"+'D3 Données épi. démo'!N147","v":3.2000000000000002E-3},{"$f":"+'D3 Données épi. démo'!O147","v":3.2000000000000002E-3},{"$f":"+'D3 Données épi. démo'!P147","v":3.2000000000000002E-3},{"$f":"+'D3 Données épi. démo'!Q147","v":3.2000000000000002E-3},{"$f":"+'D3 Données épi. démo'!R147","v":3.2000000000000002E-3}]
[null,null,"Espace occupé par un 1 kg F-100","m3","Feuille de calcul D3",{"$f":"+'D3 Données épi. démo'!F154","v":3.4185156250000001E-3},null,null,null,{"$f":"+'D3 Données épi. démo'!J154","v":3.4185156250000001E-3},{"$f":"+'D3 Données épi. démo'!K154","v":3.4185156250000001E-3},{"$f":"+'D3 Données épi. démo'!L154","v":3.4185156250000001E-3},{"$f":"+'D3 Données épi. démo'!M154","v":3.4185156250000001E-3},{"$f":"+'D3 Données épi. démo'!N154","v":3.4185156250000001E-3},{"$f":"+'D3 Données épi. démo'!O154","v":3.4185156250000001E-3},{"$f":"+'D3 Données épi. démo'!P154","v":3.4185156250000001E-3},{"$f":"+'D3 Données épi. démo'!Q154","v":3.4185156250000001E-3},{"$f":"+'D3 Données épi. démo'!R154","v":3.4185156250000001E-3}]
[null,null,"Nombre de sites de la PEC MAS ambulatoire dans la zone","sites","Feuille de calcul D9",{"$f":"+'D9 Variables temps'!F29","v":2},null,null,null,{"$f":"+'D9 Variables temps'!J29","v":0},{"$f":"+'D9 Variables temps'!K29","v":0},{"$f":"+'D9 Variables temps'!L29","v":0},{"$f":"+'D9 Variables temps'!M29","v":0},{"$f":"+'D9 Variables temps'!N29","v":0},{"$f":"+'D9 Variables temps'!O29","v":0},{"$f":"+'D9 Variables temps'!P29","v":0},{"$f":"+'D9 Variables temps'!Q29","v":0},{"$f":"+'D9 Variables temps'!R29","v":0}]
[null,null,"Nombre de sites de la PEC MAS hospitalière dans la zone","sites","Feuille de calcul D9",{"$f":"+'D9 Variables temps'!F32","v":1},null,null,null,{"$f":"+'D9 Variables temps'!J32","v":0},{"$f":"+'D9 Variables temps'!K32","v":0},{"$f":"+'D9 Variables temps'!L32","v":0},{"$f":"+'D9 Variables temps'!M32","v":0},{"$f":"+'D9 Variables temps'!N32","v":0},{"$f":"+'D9 Variables temps'!O32","v":0},{"$f":"+'D9 Variables temps'!P32","v":0},{"$f":"+'D9 Variables temps'!Q32","v":0},{"$f":"+'D9 Variables temps'!R32","v":0}]
[null,null,"Nombre de cas de MAS demandant une PEC MAS hospitalière par an","cases","Feuille de calcul D9",{"$f":"+'D9 Variables temps'!F42","v":35.25},null,null,null,{"$f":"+'D9 Variables temps'!J42","v":0},{"$f":"+'D9 Variables temps'!K42","v":0},{"$f":"+'D9 Variables temps'!L42","v":0},{"$f":"+'D9 Variables temps'!M42","v":0},{"$f":"+'D9 Variables temps'!N42","v":0},{"$f":"+'D9 Variables temps'!O42","v":0},{"$f":"+'D9 Variables temps'!P42","v":0},{"$f":"+'D9 Variables temps'!Q42","v":0},{"$f":"+'D9 Variables temps'!R42","v":0}]
[null,null,"Distance moyenne aux sites de la PEC MAS ambulatoire du siège de la zone","km","Feuille de calcul D3",{"$f":"+'D3 Données épi. démo'!F123","v":5},null,null,null,{"$f":"+'D3 Données épi. démo'!J123","v":0},{"$f":"+'D3 Données épi. démo'!K123","v":0},{"$f":"+'D3 Données épi. démo'!L123","v":0},{"$f":"+'D3 Données épi. démo'!M123","v":0},{"$f":"+'D3 Données épi. démo'!N123","v":0},{"$f":"+'D3 Données épi. démo'!O123","v":0},{"$f":"+'D3 Données épi. démo'!P123","v":0},{"$f":"+'D3 Données épi. démo'!Q123","v":0},{"$f":"+'D3 Données épi. démo'!R123","v":0}]
[null,null,"Distance moyenne aux sites de la PEC MAS hospitalière du siège de la zone","heures","Feuille de calcul D3",{"$f":"+'D3 Données épi. démo'!F125","v":5},null,null,null,{"$f":"+'D3 Données épi. démo'!J125","v":0},{"$f":"+'D3 Données épi. démo'!K125","v":0},{"$f":"+'D3 Données épi. démo'!L125","v":0},{"$f":"+'D3 Données épi. démo'!M125","v":0},{"$f":"+'D3 Données épi. démo'!N125","v":0},{"$f":"+'D3 Données épi. démo'!O125","v":0},{"$f":"+'D3 Données épi. démo'!P125","v":0},{"$f":"+'D3 Données épi. démo'!Q125","v":0},{"$f":"+'D3 Données épi. démo'!R125","v":0}]
[null,null,"Distance  du siège de la zone au siège du groupe-zones","km","Feuille de calculD3",{"$f":"+'D3 Données épi. démo'!F127","v":1},null,null,null,{"$f":"+'D3 Données épi. démo'!J127","v":0},{"$f":"+'D3 Données épi. démo'!K127","v":0},{"$f":"+'D3 Données épi. démo'!L127","v":0},{"$f":"+'D3 Données épi. démo'!M127","v":0},{"$f":"+'D3 Données épi. démo'!N127","v":0},{"$f":"+'D3 Données épi. démo'!O127","v":0},{"$f":"+'D3 Données épi. démo'!P127","v":0},{"$f":"+'D3 Données épi. démo'!Q127","v":0},{"$f":"+'D3 Données épi. démo'!R127","v":0}]
[null,null,"Nombre des livraisons de l'aliment thérapeutique au siège de la zone par an","livraisons","Feuille de calculD3",{"$f":"+'D9 Variables temps'!F26","v":6},null,null,null,{"$f":"+'D9 Variables temps'!J26","v":0},{"$f":"+'D9 Variables temps'!K26","v":0},{"$f":"+'D9 Variables temps'!L26","v":0},{"$f":"+'D9 Variables temps'!M26","v":0},{"$f":"+'D9 Variables temps'!N26","v":0},{"$f":"+'D9 Variables temps'!O26","v":0},{"$f":"+'D9 Variables temps'!P26","v":0},{"$f":"+'D9 Variables temps'!Q26","v":0},{"$f":"+'D9 Variables temps'!R26","v":0}]
[null,null,"Nombre de livraisons de l'aliment thérapeutique par an à chaque site PEC MAS ambulatoire du siège de la zone","livraisons","Feuille de calcul D3",{"$f":"+'D9 Variables temps'!F27","v":6},null,null,null,{"$f":"+'D9 Variables temps'!J27","v":0},{"$f":"+'D9 Variables temps'!K27","v":0},{"$f":"+'D9 Variables temps'!L27","v":0},{"$f":"+'D9 Variables temps'!M27","v":0},{"$f":"+'D9 Variables temps'!N27","v":0},{"$f":"+'D9 Variables temps'!O27","v":0},{"$f":"+'D9 Variables temps'!P27","v":0},{"$f":"+'D9 Variables temps'!Q27","v":0},{"$f":"+'D9 Variables temps'!R27","v":0}]
[null,null,"Nombre de livraisons de l'aliment thérapeutique par an à chaque site PEC MAS hospitalière du siège de la zone","livraisons","Feuille de calcul D3",{"$f":"+'D9 Variables temps'!F28","v":6},null,null,null,{"$f":"+'D9 Variables temps'!J28","v":0},{"$f":"+'D9 Variables temps'!K28","v":0},{"$f":"+'D9 Variables temps'!L28","v":0},{"$f":"+'D9 Variables temps'!M28","v":0},{"$f":"+'D9 Variables temps'!N28","v":0},{"$f":"+'D9 Variables temps'!O28","v":0},{"$f":"+'D9 Variables temps'!P28","v":0},{"$f":"+'D9 Variables temps'!Q28","v":0},{"$f":"+'D9 Variables temps'!R28","v":0}]
[null,null,"Temps moyen pour arriver aux sites de la PEC MAS ambulatoire du siège de la zone","heures","Feuille de calcul D3",{"$f":"+'D3 Données épi. démo'!F124","v":0.25},null,null,null,{"$f":"+'D3 Données épi. démo'!J124","v":0},{"$f":"+'D3 Données épi. démo'!K124","v":0},{"$f":"+'D3 Données épi. démo'!L124","v":0},{"$f":"+'D3 Données épi. démo'!M124","v":0},{"$f":"+'D3 Données épi. démo'!N124","v":0},{"$f":"+'D3 Données épi. démo'!O124","v":0},{"$f":"+'D3 Données épi. démo'!P124","v":0},{"$f":"+'D3 Données épi. démo'!Q124","v":0},{"$f":"+'D3 Données épi. démo'!R124","v":0}]
[null,null,"Temps moyen pour arriver aux sites de la PEC MAS hospitalière du siège de la zone","heures","Feuille de calcul D3",{"$f":"+'D3 Données épi. démo'!F126","v":0.25},null,null,null,{"$f":"+'D3 Données épi. démo'!J126","v":0},{"$f":"+'D3 Données épi. démo'!K126","v":0},{"$f":"+'D3 Données épi. démo'!L126","v":0},{"$f":"+'D3 Données épi. démo'!M126","v":0},{"$f":"+'D3 Données épi. démo'!N126","v":0},{"$f":"+'D3 Données épi. démo'!O126","v":0},{"$f":"+'D3 Données épi. démo'!P126","v":0},{"$f":"+'D3 Données épi. démo'!Q126","v":0},{"$f":"+'D3 Données épi. démo'!R126","v":0}]
[null,null,"Temps pour arriver au siège de la zone du siège du groupe-zones","heures","Feuille de calculD3",{"$f":"+'D3 Données épi. démo'!F128","v":0.1},null,null,null,{"$f":"+'D3 Données épi. démo'!J128","v":0},{"$f":"+'D3 Données épi. démo'!K128","v":0},{"$f":"+'D3 Données épi. démo'!L128","v":0},{"$f":"+'D3 Données épi. démo'!M128","v":0},{"$f":"+'D3 Données épi. démo'!N128","v":0},{"$f":"+'D3 Données épi. démo'!O128","v":0},{"$f":"+'D3 Données épi. démo'!P128","v":0},{"$f":"+'D3 Données épi. démo'!Q128","v":0},{"$f":"+'D3 Données épi. démo'!R128","v":0}]
[null,null,"Temps mort (attente, chargement) par voyage de livraison (aller simple) de l'aliment thérapeutique pour les chauffeurs des véhicules ","heures","Feuille de calcul D3",{"$f":"+'D3 Données épi. démo'!F122","v":1},null,null,null,{"$f":"+'D3 Données épi. démo'!J122","v":1},{"$f":"+'D3 Données épi. démo'!K122","v":1},{"$f":"+'D3 Données épi. démo'!L122","v":1},{"$f":"+'D3 Données épi. démo'!M122","v":1},{"$f":"+'D3 Données épi. démo'!N122","v":1},{"$f":"+'D3 Données épi. démo'!O122","v":1},{"$f":"+'D3 Données épi. démo'!P122","v":1},{"$f":"+'D3 Données épi. démo'!Q122","v":1},{"$f":"+'D3 Données épi. démo'!R122","v":1}]
[null,null,"Espace disponible dans le véhicule transportant l'aliment thérapeutique au siège de la zone","m3","Feuille de calcul D3",{"$f":"+'D3 Données épi. démo'!F155","v":3},null,null,null,{"$f":"+'D3 Données épi. démo'!J155","v":0},{"$f":"+'D3 Données épi. démo'!K155","v":0},{"$f":"+'D3 Données épi. démo'!L155","v":0},{"$f":"+'D3 Données épi. démo'!M155","v":0},{"$f":"+'D3 Données épi. démo'!N155","v":0},{"$f":"+'D3 Données épi. démo'!O155","v":0},{"$f":"+'D3 Données épi. démo'!P155","v":0},{"$f":"+'D3 Données épi. démo'!Q155","v":0},{"$f":"+'D3 Données épi. démo'!R155","v":0}]
[null,null,"Espace disponible au siège de la zone pour l'aliment thérapeutique","m3","Feuille de calcul D3",{"$f":"+'D3 Données épi. démo'!F156","v":5},null,null,null,{"$f":"+'D3 Données épi. démo'!J156","v":0},{"$f":"+'D3 Données épi. démo'!K156","v":0},{"$f":"+'D3 Données épi. démo'!L156","v":0},{"$f":"+'D3 Données épi. démo'!M156","v":0},{"$f":"+'D3 Données épi. démo'!N156","v":0},{"$f":"+'D3 Données épi. démo'!O156","v":0},{"$f":"+'D3 Données épi. démo'!P156","v":0},{"$f":"+'D3 Données épi. démo'!Q156","v":0},{"$f":"+'D3 Données épi. démo'!R156","v":0}]
[null,null,"Espace disponible dans les véhicules transportant l'aliment thérapeutique aux sites de la PEC MAS ambulatoire","m3","Feuille de calcul D3",{"$f":"+'D3 Données épi. démo'!F157","v":3},null,null,null,{"$f":"+'D3 Données épi. démo'!J157","v":0},{"$f":"+'D3 Données épi. démo'!K157","v":0},{"$f":"+'D3 Données épi. démo'!L157","v":0},{"$f":"+'D3 Données épi. démo'!M157","v":0},{"$f":"+'D3 Données épi. démo'!N157","v":0},{"$f":"+'D3 Données épi. démo'!O157","v":0},{"$f":"+'D3 Données épi. démo'!P157","v":0},{"$f":"+'D3 Données épi. démo'!Q157","v":0},{"$f":"+'D3 Données épi. démo'!R157","v":0}]
[null,null,"Espace disponible au site moyen PEC MAS ambulatoire pour l'aliment thérapeutique","m3","Feuille de calcul D3",{"$f":"+'D3 Données épi. démo'!F158","v":5},null,null,null,{"$f":"+'D3 Données épi. démo'!J158","v":0},{"$f":"+'D3 Données épi. démo'!K158","v":0},{"$f":"+'D3 Données épi. démo'!L158","v":0},{"$f":"+'D3 Données épi. démo'!M158","v":0},{"$f":"+'D3 Données épi. démo'!N158","v":0},{"$f":"+'D3 Données épi. démo'!O158","v":0},{"$f":"+'D3 Données épi. démo'!P158","v":0},{"$f":"+'D3 Données épi. démo'!Q158","v":0},{"$f":"+'D3 Données épi. démo'!R158","v":0}]
[null,null,"Espace disponible dans les véhicules transportant l'aliment thérapeutique aux sites de la PEC MAS hospitalière","m3","Feuille de calculD3",{"$f":"+'D3 Données épi. démo'!F159","v":3},null,null,null,{"$f":"+'D3 Données épi. démo'!J159","v":0},{"$f":"+'D3 Données épi. démo'!K159","v":0},{"$f":"+'D3 Données épi. démo'!L159","v":0},{"$f":"+'D3 Données épi. démo'!M159","v":0},{"$f":"+'D3 Données épi. démo'!N159","v":0},{"$f":"+'D3 Données épi. démo'!O159","v":0},{"$f":"+'D3 Données épi. démo'!P159","v":0},{"$f":"+'D3 Données épi. démo'!Q159","v":0},{"$f":"+'D3 Données épi. démo'!R159","v":0}]
[null,null,"Espace disponible au site moyen de la PEC MAS hospitalière pour l'aliment thérapeutique","m3","Feuille de calcul D3",{"$f":"+'D3 Données épi. démo'!F160","v":5},null,null,null,{"$f":"+'D3 Données épi. démo'!J160","v":0},{"$f":"+'D3 Données épi. démo'!K160","v":0},{"$f":"+'D3 Données épi. démo'!L160","v":0},{"$f":"+'D3 Données épi. démo'!M160","v":0},{"$f":"+'D3 Données épi. démo'!N160","v":0},{"$f":"+'D3 Données épi. démo'!O160","v":0},{"$f":"+'D3 Données épi. démo'!P160","v":0},{"$f":"+'D3 Données épi. démo'!Q160","v":0},{"$f":"+'D3 Données épi. démo'!R160","v":0}]
[null,null,"Nombre de gardiens des magasins par site de la PCMA","gardiens","Feuille de calcul D3",{"$f":"+'D3 Données épi. démo'!F161","v":1},null,null,null,{"$f":"+'D3 Données épi. démo'!J161","v":1},{"$f":"+'D3 Données épi. démo'!K161","v":1},{"$f":"+'D3 Données épi. démo'!L161","v":1},{"$f":"+'D3 Données épi. démo'!M161","v":1},{"$f":"+'D3 Données épi. démo'!N161","v":1},{"$f":"+'D3 Données épi. démo'!O161","v":1},{"$f":"+'D3 Données épi. démo'!P161","v":1},{"$f":"+'D3 Données épi. démo'!Q161","v":1},{"$f":"+'D3 Données épi. démo'!R161","v":1}]
[null,null,"Nombre de fiches de contrôle des stocks par magasin par an","fiches","Feuille de calcul D3",{"$f":"+'D3 Données épi. démo'!F162","v":12},null,null,null,{"$f":"+'D3 Données épi. démo'!J162","v":12},{"$f":"+'D3 Données épi. démo'!K162","v":12},{"$f":"+'D3 Données épi. démo'!L162","v":12},{"$f":"+'D3 Données épi. démo'!M162","v":12},{"$f":"+'D3 Données épi. démo'!N162","v":12},{"$f":"+'D3 Données épi. démo'!O162","v":12},{"$f":"+'D3 Données épi. démo'!P162","v":12},{"$f":"+'D3 Données épi. démo'!Q162","v":12},{"$f":"+'D3 Données épi. démo'!R162","v":12}]
[null,null,"Heures pendant une journée de travail","heures","Feuille de calcul D3",{"$f":"+'D3 Données épi. démo'!F35","v":8},null,null,null,{"$f":"+'D3 Données épi. démo'!J35","v":8},{"$f":"+'D3 Données épi. démo'!K35","v":8},{"$f":"+'D3 Données épi. démo'!L35","v":8},{"$f":"+'D3 Données épi. démo'!M35","v":8},{"$f":"+'D3 Données épi. démo'!N35","v":8},{"$f":"+'D3 Données épi. démo'!O35","v":8},{"$f":"+'D3 Données épi. démo'!P35","v":8},{"$f":"+'D3 Données épi. démo'!Q35","v":8},{"$f":"+'D3 Données épi. démo'!R35","v":8}]
[null,null,"Prix"]
[null,null,"Prix  de l'espace (par m2)",{"$f":"+'D1 Données générales'!$H$13","v":"Cedi"},"Feuille de calculD4",{"$f":"+'D4 Prix'!F27","v":0},null,null,null,{"$f":"+'D4 Prix'!J27","v":0},{"$f":"+'D4 Prix'!K27","v":0},{"$f":"+'D4 Prix'!L27","v":0},{"$f":"+'D4 Prix'!M27","v":0},{"$f":"+'D4 Prix'!N27","v":0},{"$f":"+'D4 Prix'!O27","v":0},{"$f":"+'D4 Prix'!P27","v":0},{"$f":"+'D4 Prix'!Q27","v":0},{"$f":"+'D4 Prix'!R27","v":0}]
[null,null,"Coût du gardien (par an)",{"$f":"+'D1 Données générales'!$H$13","v":"Cedi"},"Feuille de calcul D5",{"$f":"+'D5 Salaires'!H41","v":1200},null,null,null,{"$f":"+$F$144*'D4 Prix'!J81","v":0},{"$f":"+$F$144*'D4 Prix'!K81","v":0},{"$f":"+$F$144*'D4 Prix'!L81","v":0},{"$f":"+$F$144*'D4 Prix'!M81","v":0},{"$f":"+$F$144*'D4 Prix'!N81","v":0},{"$f":"+$F$144*'D4 Prix'!O81","v":0},{"$f":"+$F$144*'D4 Prix'!P81","v":0},{"$f":"+$F$144*'D4 Prix'!Q81","v":0},{"$f":"+$F$144*'D4 Prix'!R81","v":0}]
[null,null,"Coût du chauffeur (par jour)",{"$f":"+'D1 Données générales'!$H$13","v":"Cedi"},"Feuille de calcul D5",{"$f":"+'D5 Salaires'!J40","v":6.9230769230769234},null,null,null,{"$f":"+$F$145*'D4 Prix'!J81","v":0},{"$f":"+$F$145*'D4 Prix'!K81","v":0},{"$f":"+$F$145*'D4 Prix'!L81","v":0},{"$f":"+$F$145*'D4 Prix'!M81","v":0},{"$f":"+$F$145*'D4 Prix'!N81","v":0},{"$f":"+$F$145*'D4 Prix'!O81","v":0},{"$f":"+$F$145*'D4 Prix'!P81","v":0},{"$f":"+$F$145*'D4 Prix'!Q81","v":0}]
[null,null,"Prix des fiches de contrôle des stocks (par jeu)",{"$f":"+'D1 Données générales'!$H$13","v":"Cedi"},"Feuille de calcul D4",{"$f":"+'D4 Prix'!F60","v":0.1},null,null,null,{"$f":"+'D4 Prix'!J60","v":0.1},{"$f":"+'D4 Prix'!K60","v":0.1},{"$f":"+'D4 Prix'!L60","v":0.1},{"$f":"+'D4 Prix'!M60","v":0.1},{"$f":"+'D4 Prix'!N60","v":0.1},{"$f":"+'D4 Prix'!O60","v":0.1},{"$f":"+'D4 Prix'!P60","v":0.1},{"$f":"+'D4 Prix'!Q60","v":0.1},{"$f":"+'D4 Prix'!R60","v":0.1}]
[null,null,"Prix des transports (par km)",{"$f":"+'D1 Données générales'!$H$13","v":"Cedi"},"Feuille de calcul D4",{"$f":"+'D4 Prix'!F77","v":2},null,null,null,{"$f":"+'D4 Prix'!J77","v":2},{"$f":"+'D4 Prix'!K77","v":2},{"$f":"+'D4 Prix'!L77","v":2},{"$f":"+'D4 Prix'!M77","v":2},{"$f":"+'D4 Prix'!N77","v":2},{"$f":"+'D4 Prix'!O77","v":2},{"$f":"+'D4 Prix'!P77","v":2},{"$f":"+'D4 Prix'!Q77","v":2},{"$f":"+'D4 Prix'!R77","v":2}]

{"sheet":"R12 Formation","index":26,"n_rows":214,"n_cols":18,"rows_kept":214,"cut":false,"hidden":false,"merged":[[21,6,21,8],[3,2,3,8],[56,0,81,0],[15,0,52,0],[5,2,5,5]]}
[]
["Retour au sommaire",null,"R12:  Formation "]
[]
[null,null,"Cette Feuille de calcul montre (pour l'année choisie) les quantités des différents intrants nécessaires à la formation de la PCMA et les coûts de ces intrants. "]
[]
[null,null,"Voir ci-dessous pour la manière dont les chiffres sont calculés"]
[null,null,"Number of Areas included ",{"$f":"+'D2 Echelle'!$I$8","v":1},"  (taken from Worksheet W2)"]
[]
[]
[null,null,{"$f":"+IF('D1 Données générales'!$H$11=\"\",\"\",'D1 Données générales'!$H$11)","v":"Ghana"}]
[null,null,{"$f":"+'D9 Variables temps'!I6","v":2011},null,null,"Zone 1",null,null,null,"Zone 2","Zone 3","Zone 4","Zone 5","Zone 6","Zone 7","Zone 8","Zone 9","Zone 10"]
[null,null,null,null,{"$f":"'D2 Echelle'!C30","v":"district"},{"$f":"+IF('D2 Echelle'!$C$31=\"\",\"\",'D2 Echelle'!$C$31)","v":"Ashiedu Keteke"},null,null,null,{"$f":"+IF('D2 Echelle'!$C$36=\"\",\"\",'D2 Echelle'!$C$36)","v":""},{"$f":"+IF('D2 Echelle'!$C$41=\"\",\"\",'D2 Echelle'!$C$41)","v":""},{"$f":"+IF('D2 Echelle'!$C$46=\"\",\"\",'D2 Echelle'!$C$46)","v":""},{"$f":"+IF('D2 Echelle'!$C$51=\"\",\"\",'D2 Echelle'!$C$51)","v":""},{"$f":"+IF('D2 Echelle'!$C$56=\"\",\"\",'D2 Echelle'!$C$56)","v":""},{"$f":"+IF('D2 Echelle'!$C$61=\"\",\"\",'D2 Echelle'!$C$61)","v":""},{"$f":"+IF('D2 Echelle'!$C$66=\"\",\"\",'D2 Echelle'!$C$66)","v":""},{"$f":"+IF('D2 Echelle'!$C$71=\"\",\"\",'D2 Echelle'!$C$71)","v":""},{"$f":"+IF('D2 Echelle'!$C$76=\"\",\"\",'D2 Echelle'!$C$76)","v":""}]
[null,null,null,null,{"$f":"+'D2 Echelle'!D30","v":"région"},{"$f":"+IF('D2 Echelle'!$D$31=\"\",\"\",'D2 Echelle'!$D$31)","v":"Greater Accra"},null,null,null,{"$f":"+IF('D2 Echelle'!$D$36=\"\",\"\",'D2 Echelle'!$D$36)","v":""},{"$f":"+IF('D2 Echelle'!$D$41=\"\",\"\",'D2 Echelle'!$D$41)","v":""},{"$f":"+IF('D2 Echelle'!$D$46=\"\",\"\",'D2 Echelle'!$D$46)","v":""},{"$f":"+IF('D2 Echelle'!$D$51=\"\",\"\",'D2 Echelle'!$D$51)","v":""},{"$f":"+IF('D2 Echelle'!$D$56=\"\",\"\",'D2 Echelle'!$D$56)","v":""},{"$f":"+IF('D2 Echelle'!$D$61=\"\",\"\",'D2 Echelle'!$D$61)","v":""},{"$f":"+IF('D2 Echelle'!$D$66=\"\",\"\",'D2 Echelle'!$D$66)","v":""},{"$f":"+IF('D2 Echelle'!$D$71=\"\",\"\",'D2 Echelle'!$D$71)","v":""},{"$f":"+IF('D2 Echelle'!$D$76=\"\",\"\",'D2 Echelle'!$D$76)","v":""}]
[null,null,"Coûts annuels pour cette activité"]
[null,null,"Variables","Unités","Commentaires"]
[null,null,"Coût de la formation pour la PEC MAS ambulatoire"]
[null,null," - Temps du formateur",{"$f":"+'D1 Données générales'!$H$13","v":"Cedi"},null,{"$f":"+F59*F198","v":115.38461538461539},null,null,null,{"$f":"+J59*J198","v":0},0,0,0,0,0,0,0,0]
[null,null,"  - Honoraires pour le formateur",{"$f":"+'D1 Données générales'!$H$13","v":"Cedi"},null,{"$f":"+F59*F197","v":200},null,null,null,{"$f":"+J59*J197","v":0},0,0,0,0,0,0,0,0]
[null,null," - Temps des participants",{"$f":"+'D1 Données générales'!$H$13","v":"Cedi"},null,{"$f":"+F64*F198","v":346.15384615384619},null,null,null,{"$f":"+J64*J198","v":0},0,0,0,0,0,0,0,0]
[null,null," - Transport des participants",{"$f":"+'D1 Données générales'!$H$13","v":"Cedi"},null,{"$f":"+F79*F200","v":120},null,null,null,{"$f":"+J79*J200","v":0},0,0,0,0,0,0,0,0]
[null,null," - Rafraîssements pour les participants",{"$f":"+'D1 Données générales'!$H$13","v":"Cedi"},null,{"$f":"+F88*F214","v":2400},null,null,null,{"$f":"+J88*J214","v":0},0,0,0,0,0,0,0,0]
[null,null," - Indemnités journalières des participants",{"$f":"+'D1 Données générales'!$H$13","v":"Cedi"},null,{"$f":"+F84*F203","v":960},null,null,null,{"$f":"+J84*J203","v":0},0,0,0,0,0,0,0,0]
[null,null," - Location salles pour la formation",{"$f":"+'D1 Données générales'!$H$13","v":"Cedi"},null,{"$f":"+F69*F213","v":240},null,null,null,{"$f":"+J69*J213","v":0},0,0,0,0,0,0,0,0]
[null,null," - Jeu de matériels de formation",{"$f":"+'D1 Données générales'!$H$13","v":"Cedi"},null,{"$f":"+F74*F201","v":120},null,null,null,{"$f":"+J74*J201","v":0},0,0,0,0,0,0,0,0]
[null,null,"Sous-total",{"$f":"+'D1 Données générales'!$H$13","v":"Cedi"},null,{"$f":"+SUM(F17:F24)","v":4501.538461538461},null,null,null,{"$f":"+SUM(J17:J24)","v":0},0,0,0,0,0,0,0,0]
[null,null,"Coût de la formation pour la PEC MAS hospitalière "]
[null,null," - Temps du formateur",{"$f":"+'D1 Données générales'!$H$13","v":"Cedi"},null,{"$f":"+F60*F196","v":221.53846153846152},null,null,null,{"$f":"+J60*J196","v":0},0,0,0,0,0,0,0,0]
[null,null,"  - Honoraires pour le formateur",{"$f":"+'D1 Données générales'!$H$13","v":"Cedi"},null,{"$f":"+F60*F197","v":600},null,null,null,{"$f":"+J60*J197","v":0},0,0,0,0,0,0,0,0]
[null,null," - Temps des participants",{"$f":"+'D1 Données générales'!$H$13","v":"Cedi"},null,{"$f":"+F65*F199","v":567.69230769230762},null,null,null,{"$f":"+J65*J199","v":0},0,0,0,0,0,0,0,0]
[null,null," - Transport des participants",{"$f":"+'D1 Données générales'!$H$13","v":"Cedi"},null,{"$f":"+F80*F200","v":40},null,null,null,{"$f":"+J80*J200","v":0},0,0,0,0,0,0,0,0]
[null,null," - Rafraîssements pour les participants",{"$f":"+'D1 Données générales'!$H$13","v":"Cedi"},null,{"$f":"+F65*F214","v":144},null,null,null,{"$f":"+J65*J214","v":0},0,0,0,0,0,0,0,0]
[null,null," - Indemnités journalières des participants",{"$f":"+'D1 Données générales'!$H$13","v":"Cedi"},null,{"$f":"+F65*F203","v":960},null,null,null,{"$f":"+J65*J203","v":0},0,0,0,0,0,0,0,0]
[null,null," - Location salles pour la formation",{"$f":"+'D1 Données générales'!$H$13","v":"Cedi"},null,{"$f":"+F70*F213","v":720},null,null,null,{"$f":"+J70*J213","v":0},0,0,0,0,0,0,0,0]
[null,null," - Jeu de matériels de formation",{"$f":"+'D1 Données générales'!$H$13","v":"Cedi"},null,{"$f":"+F65*F202","v":240},null,null,null,{"$f":"+J65*J202","v":0},0,0,0,0,0,0,0,0]
[null,null,"Sous-total",{"$f":"+'D1 Données générales'!$H$13","v":"Cedi"},null,{"$f":"+SUM(F27:F34)","v":3493.2307692307691},null,null,null,{"$f":"+SUM(J27:J34)","v":0},0,0,0,0,0,0,0,0]
[null,null,"Coût de la formation de l'extension communautaire"]
[null,null," - Temps du formateur",{"$f":"+'D1 Données générales'!$H$13","v":"Cedi"},null,{"$f":"+F58*F204","v":941.53846153846166},null,null,null,{"$f":"+J58*J204","v":0},0,0,0,0,0,0,0,0]
[null,null,"  - Honoraires pour le formateur",{"$f":"+'D1 Données générales'!$H$13","v":"Cedi"},null,{"$f":"+F58*F205","v":1200},null,null,null,{"$f":"+J58*J205","v":0},0,0,0,0,0,0,0,0]
[null,null," - Transport des AEC",{"$f":"+'D1 Données générales'!$H$13","v":"Cedi"},null,{"$f":"+F78*F206","v":2400},null,null,null,{"$f":"+J78*J206","v":0},0,0,0,0,0,0,0,0]
[null,null," - Indemnités des AEC",{"$f":"+'D1 Données générales'!$H$13","v":"Cedi"},null,{"$f":"+F63*F208","v":0},null,null,null,{"$f":"+J63*J208","v":0},0,0,0,0,0,0,0,0]
[null,null," - Rafraîchissements pour les AEC",{"$f":"+'D1 Données générales'!$H$13","v":"Cedi"},null,{"$f":"+F63*F214","v":2400},null,null,null,{"$f":"+J63*J214","v":0},0,0,0,0,0,0,0,0]
[null,null," - Jeu de matériels de formation",{"$f":"+'D1 Données générales'!$H$13","v":"Cedi"},null,{"$f":"+F73*F207","v":100},null,null,null,{"$f":"+J73*J207","v":0},0,0,0,0,0,0,0,0]
[null,null,"Sous-total",{"$f":"+'D1 Données générales'!$H$13","v":"Cedi"},null,{"$f":"+SUM(F37:F42)","v":7041.5384615384619},null,null,null,{"$f":"+SUM(J37:J42)","v":0},0,0,0,0,0,0,0,0]
[null,null,"Coût de la formation du gestionnaire de la zone"]
[null,null," - Temps du formateur et honoraires",null,"Voir R6 (activités au niveau central)"]
[null,null," - Temps des participants",{"$f":"+'D1 Données générales'!$H$13","v":"Cedi"},null,{"$f":"+F66*F209","v":36.92307692307692},null,null,null,{"$f":"+J66*J209","v":0},0,0,0,0,0,0,0,0]
[null,null," - Transport des participants",{"$f":"+'D1 Données générales'!$H$13","v":"Cedi"},null,{"$f":"+F194*F210","v":8},null,null,null,{"$f":"+J194*J210","v":0},0,0,0,0,0,0,0,0]
[null,null," - Indemnités journalières des participants",{"$f":"+'D1 Données générales'!$H$13","v":"Cedi"},null,{"$f":"+F86*F212","v":160},null,null,null,{"$f":"+J86*J212","v":0},0,0,0,0,0,0,0,0]
[null,null," - Rafraîssements pour les participants",{"$f":"+'D1 Données générales'!$H$13","v":"Cedi"},null,{"$f":"+F91*F214","v":24},null,null,null,{"$f":"+J91*J214","v":0},0,0,0,0,0,0,0,0]
[null,null," - Matériel de formation",{"$f":"+'D1 Données générales'!$H$13","v":"Cedi"},null,{"$f":"+F76*F211","v":80},null,null,null,{"$f":"+J76*J211","v":0},0,0,0,0,0,0,0,0]
[null,null,"Sous-total",{"$f":"+'D1 Données générales'!$H$13","v":"Cedi"},null,{"$f":"+SUM(F45:F50)","v":308.92307692307691},null,null,null,{"$f":"+SUM(J45:J50)","v":0},0,0,0,0,0,0,0,0]
[]
[null,null,"Total coût annuel de la  formation dans la Zone",{"$f":"+'D1 Données générales'!$H$13","v":"Cedi"},null,{"$f":"+F51+F43+F35+F25","v":15345.23076923077},null,null,null,{"$f":"+J51+J43+J35+J25","v":0},0,0,0,0,0,0,0,0]
[]
[null,null,"Quantités d'intrants nécessaires pour cette activité"]
[null,null,"Variables","Unités","Commentaires"]
[null,null,"Temps (jours) des formateurs :"]
[null,null,"  + formateur AEC (personnel senior  PEC MAS ambulatoire)","jours-formateur",null,{"$f":"+F172","v":24},null,null,null,{"$f":"+J172","v":0},0,0,0,0,0,0,0,0]
[null,null,"  + formateur PEC MAS ambulatoire (personnel niveau intermédiaire Siège de la zone) ","jours-formateur",null,{"$f":"+F140","v":4},null,null,null,{"$f":"+J140","v":0},0,0,0,0,0,0,0,0]
[null,null,"  + formateur PEC MAS hospitalière (personnel niveau intermédiaire Siège de la zone)","jours-formateur",null,{"$f":"+F141","v":12},null,null,null,{"$f":"+J141","v":0},0,0,0,0,0,0,0,0]
[null,null,"  + formateur gestionnaire niveau intermédiaire (personnel groupe-zones)","See  R6 (Feuille de calcul sur les activités centrales)","Voir R6 (activités au niveau central)"]
[null,null,"Temps (jours) des participants :"]
[null,null,"  + participants AEC","jours-participant",null,{"$f":"+F173","v":200},null,null,null,{"$f":"+J173","v":0},0,0,0,0,0,0,0,0]
[null,null,"  + participants PEC MAS ambulatoire","jours-participant",null,{"$f":"+F142","v":12},null,null,null,{"$f":"+J142","v":0},0,0,0,0,0,0,0,0]
[null,null,"  + participants PEC MAS hospitalière","jours-participant",null,{"$f":"+F143","v":12},null,null,null,{"$f":"+J143","v":0},0,0,0,0,0,0,0,0]
[null,null,"  + participants gestionnaires niveau zones","jours-participant",null,{"$f":"+F192","v":2},null,null,null,{"$f":"+J192","v":0},0,0,0,0,0,0,0,0]
[null,null,"Espace - \"jours-salle\" pour la formation de:"]
[null,null,"  + AEC (dans site PEC MAS ambulatoire)","jours-salle",null,{"$f":"+F171","v":12},null,null,null,{"$f":"+J171","v":0},0,0,0,0,0,0,0,0]
[null,null,"  + PEC MAS ambulatoire(au Siège de la zone)","jours-salle",null,{"$f":"+F138","v":2},null,null,null,{"$f":"+J138","v":0},0,0,0,0,0,0,0,0]
[null,null,"  + PEC MAS hospitalière (au Siège de la zone)","jours-salle",null,{"$f":"+F139","v":6},null,null,null,{"$f":"+J139","v":0},0,0,0,0,0,0,0,0]
[null,null,"  + Gestionnaires de zone (au Siège du groupe-zones)","Feuille de calcul , activités centrales","Voir R6 (activités au niveau central)"]
[null,null,"Jeux de matériel de formation pour :"]
[null,null,"  + participants AEC","jeux",null,{"$f":"+F162+F166+F169","v":100},null,null,null,{"$f":"+J162+J166+J169","v":0},0,0,0,0,0,0,0,0]
[null,null,"  + participants PEC MAS ambulatoire","jeux",null,{"$f":"+F130+F131","v":6},null,null,null,{"$f":"+J130+J131","v":0},0,0,0,0,0,0,0,0]
[null,null,"  + participants PEC MAS hospitalière","jeux",null,{"$f":"+F132+F133","v":2},null,null,null,{"$f":"+J132+J133","v":0},0,0,0,0,0,0,0,0]
[null,null,"  + participants gestionnaires niveau zones","jeux",null,{"$f":"+F187","v":2},null,null,null,{"$f":"+J187","v":0},0,0,0,0,0,0,0,0]
[null,null,"Kilomètres parcourus (pour être formé) pour :"]
[null,null,"  + participants AEC","km",null,{"$f":"+F174","v":1200},null,null,null,{"$f":"+J174","v":0},0,{"$f":"+L174","v":0},0,0,0,0,0,0]
[null,null,"  + participants PEC MAS ambulatoire","km",null,{"$f":"+F146","v":60},null,null,null,{"$f":"+J146","v":0},0,0,0,0,0,0,0,0]
[null,null,"  + participants PEC MAS hospitalière","km",null,{"$f":"+F147","v":20},null,null,null,{"$f":"+J147","v":0},0,0,0,0,0,0,0,0]
[null,null,"  + participants gestionnaires niveau zones","km",null,{"$f":"+F194","v":4},null,null,null,{"$f":"+J194","v":0},0,0,0,0,0,0,0,0]
[null,null,"Indemnités journalières pour :"]
[null,null,"  + participants AEC","indemnités journalières",null,{"$f":"+IF(F158=\"travel each day\",0,F173)","v":200},null,null,null,{"$f":"+IF(J158=\"travel each day\",0,J173)","v":0},0,0,0,0,0,0,0,0]
[null,null,"  + participants PEC MAS ambulatoire","indemnités journalières",null,{"$f":"+IF(F128=\"travel each day\",0,F142)","v":12},null,null,null,{"$f":"+IF(J128=\"travel each day\",0,J142)","v":0},0,0,0,0,0,0,0,0]
[null,null,"  + participants PEC MAS hospitalière","indemnités journalières",null,{"$f":"+IF(F128=\"travel each day\",0,F143)","v":12},null,null,null,{"$f":"+IF(J128=\"travel each day\",0,J143)","v":0},0,0,0,0,0,0,0,0]
[null,null,"  + participants gestionnaires niveau zones","indemnités journalières",null,{"$f":"+IF(F184=\"travel each day\",0,F192)","v":2},null,null,null,{"$f":"+IF(J184=\"travel each day\",0,J192)","v":0},0,0,0,0,0,0,0,0]
[null,null,"Rafraîssements (jours-personne) pour :"]
[null,null,"  + participants AEC","jours-pers.",null,{"$f":"+F173","v":200},null,null,null,{"$f":"+J173","v":0},0,0,0,0,0,0,0,0]
[null,null,"  + participants PEC MAS ambulatoire","jours-pers.",null,{"$f":"+F142","v":12},null,null,null,{"$f":"+J142","v":0},0,0,0,0,0,0,0,0]
[null,null,"  + participants PEC MAS hospitalière","jours-pers.",null,{"$f":"+F143","v":12},null,null,null,{"$f":"+J143","v":0},0,0,0,0,0,0,0,0]
[null,null,"  + participants gestionnaires niveau zones","jours-pers.",null,{"$f":"+F192","v":2},null,null,null,{"$f":"+J192","v":0},0,0,0,0,0,0,0,0]
[]
[]
[]
[]
[]
[]
[]
[]
[]
[]
[]
[]
[]
[]
[]
[]
[null,null,null,null,null,"Zone 1",null,null,null,"Zone 2","Zone 3","Zone 4","Zone 5","Zone 6","Zone 7","Zone 8","Zone 9","Zone 10"]
["Haut de page",null,{"$f":"+message17","v":"CALCULATIONS"},null,null,{"$f":"+IF('D2 Echelle'!$C$31=\"\",\"\",'D2 Echelle'!$C$31)","v":"Ashiedu Keteke"},null,null,null,{"$f":"+IF('D2 Echelle'!$C$36=\"\",\"\",'D2 Echelle'!$C$36)","v":""},{"$f":"+IF('D2 Echelle'!$C$41=\"\",\"\",'D2 Echelle'!$C$41)","v":""},{"$f":"+IF('D2 Echelle'!$C$46=\"\",\"\",'D2 Echelle'!$C$46)","v":""},{"$f":"+IF('D2 Echelle'!$C$51=\"\",\"\",'D2 Echelle'!$C$51)","v":""},{"$f":"+IF('D2 Echelle'!$C$56=\"\",\"\",'D2 Echelle'!$C$56)","v":""},{"$f":"+IF('D2 Echelle'!$C$61=\"\",\"\",'D2 Echelle'!$C$61)","v":""},{"$f":"+IF('D2 Echelle'!$C$66=\"\",\"\",'D2 Echelle'!$C$66)","v":""},{"$f":"+IF('D2 Echelle'!$C$71=\"\",\"\",'D2 Echelle'!$C$71)","v":""},{"$f":"+IF('D2 Echelle'!$C$76=\"\",\"\",'D2 Echelle'!$C$76)","v":""}]
[null,null,"Variables","Unités","Commentaires",{"$f":"+IF('D2 Echelle'!$D$31=\"\",\"\",'D2 Echelle'!$D$31)","v":"Greater Accra"},null,null,null,{"$f":"+IF('D2 Echelle'!$D$36=\"\",\"\",'D2 Echelle'!$D$36)","v":""},{"$f":"+IF('D2 Echelle'!$D$41=\"\",\"\",'D2 Echelle'!$D$41)","v":""},{"$f":"+IF('D2 Echelle'!$D$46=\"\",\"\",'D2 Echelle'!$D$46)","v":""},{"$f":"+IF('D2 Echelle'!$D$51=\"\",\"\",'D2 Echelle'!$D$51)","v":""},{"$f":"+IF('D2 Echelle'!$D$56=\"\",\"\",'D2 Echelle'!$D$56)","v":""},{"$f":"+IF('D2 Echelle'!$D$61=\"\",\"\",'D2 Echelle'!$D$61)","v":""},{"$f":"+IF('D2 Echelle'!$D$66=\"\",\"\",'D2 Echelle'!$D$66)","v":""},{"$f":"+IF('D2 Echelle'!$D$71=\"\",\"\",'D2 Echelle'!$D$71)","v":""},{"$f":"+IF('D2 Echelle'!$D$76=\"\",\"\",'D2 Echelle'!$D$76)","v":""}]
[null,null,"Formation agents de santé des sites PEC MAS ambulatoire et sites PEC MAS hospitalière "]
[null,null,"Drivers de base, données brutes"]
[null,null,"Nombre de nouveaux sites PEC MAS ambulatoire","sites","Feuille de calcul D9",{"$f":"+'D9 Variables temps'!F30","v":0},null,null,null,{"$f":"+'D9 Variables temps'!J30","v":0},{"$f":"+'D9 Variables temps'!K30","v":0},{"$f":"+'D9 Variables temps'!L30","v":0},{"$f":"+'D9 Variables temps'!M30","v":0},{"$f":"+'D9 Variables temps'!N30","v":0},{"$f":"+'D9 Variables temps'!O30","v":0},{"$f":"+'D9 Variables temps'!P30","v":0},{"$f":"+'D9 Variables temps'!Q30","v":0},{"$f":"+'D9 Variables temps'!R30","v":0}]
[null,null,"Nombre de sites établis PEC MAS ambulatoire","sites","Feuille de calcul D9",{"$f":"+'D9 Variables temps'!F31","v":2},null,null,null,{"$f":"+'D9 Variables temps'!J31","v":0},{"$f":"+'D9 Variables temps'!K31","v":0},{"$f":"+'D9 Variables temps'!L31","v":0},{"$f":"+'D9 Variables temps'!M31","v":0},{"$f":"+'D9 Variables temps'!N31","v":0},{"$f":"+'D9 Variables temps'!O31","v":0},{"$f":"+'D9 Variables temps'!P31","v":0},{"$f":"+'D9 Variables temps'!Q31","v":0},{"$f":"+'D9 Variables temps'!R31","v":0}]
[null,null,"Nombre de  nouveaux sites PEC MAS hospitalière ","sites","Feuille de calcul D9",{"$f":"+'D9 Variables temps'!F33","v":0},null,null,null,{"$f":"+'D9 Variables temps'!J33","v":0},{"$f":"+'D9 Variables temps'!K33","v":0},{"$f":"+'D9 Variables temps'!L33","v":0},{"$f":"+'D9 Variables temps'!M33","v":0},{"$f":"+'D9 Variables temps'!N33","v":0},{"$f":"+'D9 Variables temps'!O33","v":0},{"$f":"+'D9 Variables temps'!P33","v":0},{"$f":"+'D9 Variables temps'!Q33","v":0},{"$f":"+'D9 Variables temps'!R33","v":0}]
[null,null,"Nombre de sites établis PEC MAS hospitalière ","sites","Feuille de calcul D9",{"$f":"+'D9 Variables temps'!F34","v":1},null,null,null,{"$f":"+'D9 Variables temps'!J34","v":0},{"$f":"+'D9 Variables temps'!K34","v":0},{"$f":"+'D9 Variables temps'!L34","v":0},{"$f":"+'D9 Variables temps'!M34","v":0},{"$f":"+'D9 Variables temps'!N34","v":0},{"$f":"+'D9 Variables temps'!O34","v":0},{"$f":"+'D9 Variables temps'!P34","v":0},{"$f":"+'D9 Variables temps'!Q34","v":0},{"$f":"+'D9 Variables temps'!R34","v":0}]
[null,null,"Distance moyenne parcourue du site PEC MAS ambulatoire au Siège de la zone","km","Feuille de calcul D3",{"$f":"+'D3 Données épi. démo'!F123","v":5},null,null,null,{"$f":"+'D3 Données épi. démo'!J123","v":0},{"$f":"+'D3 Données épi. démo'!K123","v":0},{"$f":"+'D3 Données épi. démo'!L123","v":0},{"$f":"+'D3 Données épi. démo'!M123","v":0},{"$f":"+'D3 Données épi. démo'!N123","v":0},{"$f":"+'D3 Données épi. démo'!O123","v":0},{"$f":"+'D3 Données épi. démo'!P123","v":0},{"$f":"+'D3 Données épi. démo'!Q123","v":0},{"$f":"+'D3 Données épi. démo'!R123","v":0}]
[null,null,"Distance moyenne parcourue, aller, du site PEC MAS hospitalière au Siège de la zone","km","Feuille de calcul D3",{"$f":"+'D3 Données épi. démo'!F125","v":5},null,null,null,{"$f":"+'D3 Données épi. démo'!J125","v":0},{"$f":"+'D3 Données épi. démo'!K125","v":0},{"$f":"+'D3 Données épi. démo'!L125","v":0},{"$f":"+'D3 Données épi. démo'!M125","v":0},{"$f":"+'D3 Données épi. démo'!N125","v":0},{"$f":"+'D3 Données épi. démo'!O125","v":0},{"$f":"+'D3 Données épi. démo'!P125","v":0},{"$f":"+'D3 Données épi. démo'!Q125","v":0},{"$f":"+'D3 Données épi. démo'!R125","v":0}]
[null,null,"Nombre d'agents de santé par nouveau site PEC MAS ambulatoire à former par an ","agents de santé","Feuille de calcul D3",{"$f":"+'D3 Données épi. démo'!F170","v":3},null,null,null,{"$f":"+'D3 Données épi. démo'!J170","v":3},{"$f":"+'D3 Données épi. démo'!K170","v":3},{"$f":"+'D3 Données épi. démo'!L170","v":3},{"$f":"+'D3 Données épi. démo'!M170","v":3},{"$f":"+'D3 Données épi. démo'!N170","v":3},{"$f":"+'D3 Données épi. démo'!O170","v":3},{"$f":"+'D3 Données épi. démo'!P170","v":3},{"$f":"+'D3 Données épi. démo'!Q170","v":3},{"$f":"+'D3 Données épi. démo'!R170","v":3}]
[null,null,"Nombre d'agents de santé par site établi PEC MAS ambulatoire à former par an","agents de santé","Feuille de calcul D3",{"$f":"+'D3 Données épi. démo'!F171","v":3},null,null,null,{"$f":"+'D3 Données épi. démo'!J171","v":3},{"$f":"+'D3 Données épi. démo'!K171","v":3},{"$f":"+'D3 Données épi. démo'!L171","v":3},{"$f":"+'D3 Données épi. démo'!M171","v":3},{"$f":"+'D3 Données épi. démo'!N171","v":3},{"$f":"+'D3 Données épi. démo'!O171","v":3},{"$f":"+'D3 Données épi. démo'!P171","v":3},{"$f":"+'D3 Données épi. démo'!Q171","v":3},{"$f":"+'D3 Données épi. démo'!R171","v":3}]
[null,null,"Nombre d'agents de santé par nouveau site PEC MAS hospitalière à former par an","agents de santé","Feuille de calcul D3",{"$f":"+'D3 Données épi. démo'!F172","v":4},null,null,null,{"$f":"+'D3 Données épi. démo'!J172","v":4},{"$f":"+'D3 Données épi. démo'!K172","v":4},{"$f":"+'D3 Données épi. démo'!L172","v":4},{"$f":"+'D3 Données épi. démo'!M172","v":4},{"$f":"+'D3 Données épi. démo'!N172","v":4},{"$f":"+'D3 Données épi. démo'!O172","v":4},{"$f":"+'D3 Données épi. démo'!P172","v":4},{"$f":"+'D3 Données épi. démo'!Q172","v":4},{"$f":"+'D3 Données épi. démo'!R172","v":4}]
[null,null,"Nombre d'agents de santé par site établi PEC MAS hospitalière à former par an","agents de santé","Feuille de calcul D3",{"$f":"+'D3 Données épi. démo'!F173","v":2},null,null,null,{"$f":"+'D3 Données épi. démo'!J173","v":2},{"$f":"+'D3 Données épi. démo'!K173","v":2},{"$f":"+'D3 Données épi. démo'!L173","v":2},{"$f":"+'D3 Données épi. démo'!M173","v":2},{"$f":"+'D3 Données épi. démo'!N173","v":2},{"$f":"+'D3 Données épi. démo'!O173","v":2},{"$f":"+'D3 Données épi. démo'!P173","v":2},{"$f":"+'D3 Données épi. démo'!Q173","v":2},{"$f":"+'D3 Données épi. démo'!R173","v":2}]
[null,null,"Journées de formation par participant par an dans un nouveau site PEC MAS ambulatoire ","jours","Feuille de calcul D3",{"$f":"+'D3 Données épi. démo'!F174","v":5},null,null,null,{"$f":"+'D3 Données épi. démo'!J174","v":5},{"$f":"+'D3 Données épi. démo'!K174","v":5},{"$f":"+'D3 Données épi. démo'!L174","v":5},{"$f":"+'D3 Données épi. démo'!M174","v":5},{"$f":"+'D3 Données épi. démo'!N174","v":5},{"$f":"+'D3 Données épi. démo'!O174","v":5},{"$f":"+'D3 Données épi. démo'!P174","v":5},{"$f":"+'D3 Données épi. démo'!Q174","v":5},{"$f":"+'D3 Données épi. démo'!R174","v":5}]
[null,null,"Journées de formation par participant par an dans un site établi PEC MAS ambulatoire ","jours","Feuille de calcul D3",{"$f":"+'D3 Données épi. démo'!F175","v":2},null,null,null,{"$f":"+'D3 Données épi. démo'!J175","v":2},{"$f":"+'D3 Données épi. démo'!K175","v":2},{"$f":"+'D3 Données épi. démo'!L175","v":2},{"$f":"+'D3 Données épi. démo'!M175","v":2},{"$f":"+'D3 Données épi. démo'!N175","v":2},{"$f":"+'D3 Données épi. démo'!O175","v":2},{"$f":"+'D3 Données épi. démo'!P175","v":2},{"$f":"+'D3 Données épi. démo'!Q175","v":2},{"$f":"+'D3 Données épi. démo'!R175","v":2}]
[null,null,"Journées de formation par participant par an dans un nouveau site PEC MAS hospitalière","jours","Feuille de calcul D3",{"$f":"+'D3 Données épi. démo'!F176","v":7},null,null,null,{"$f":"+'D3 Données épi. démo'!J176","v":7},{"$f":"+'D3 Données épi. démo'!K176","v":7},{"$f":"+'D3 Données épi. démo'!L176","v":7},{"$f":"+'D3 Données épi. démo'!M176","v":7},{"$f":"+'D3 Données épi. démo'!N176","v":7},{"$f":"+'D3 Données épi. démo'!O176","v":7},{"$f":"+'D3 Données épi. démo'!P176","v":7},{"$f":"+'D3 Données épi. démo'!Q176","v":7},{"$f":"+'D3 Données épi. démo'!R176","v":7}]
[null,null,"Journées de formation par participant par an dans un site établi PEC MAS hospitalière","jours","Feuille de calcul D3",{"$f":"+'D3 Données épi. démo'!F177","v":6},null,null,null,{"$f":"+'D3 Données épi. démo'!J177","v":6},{"$f":"+'D3 Données épi. démo'!K177","v":6},{"$f":"+'D3 Données épi. démo'!L177","v":6},{"$f":"+'D3 Données épi. démo'!M177","v":6},{"$f":"+'D3 Données épi. démo'!N177","v":6},{"$f":"+'D3 Données épi. démo'!O177","v":6},{"$f":"+'D3 Données épi. démo'!P177","v":6},{"$f":"+'D3 Données épi. démo'!Q177","v":6},{"$f":"+'D3 Données épi. démo'!R177","v":6}]
[null,null,"Taille maximum par classe","participants","Feuille de calcul D3",{"$f":"+'D3 Données épi. démo'!F178","v":20},null,null,null,{"$f":"+'D3 Données épi. démo'!J178","v":20},{"$f":"+'D3 Données épi. démo'!K178","v":20},{"$f":"+'D3 Données épi. démo'!L178","v":20},{"$f":"+'D3 Données épi. démo'!M178","v":20},{"$f":"+'D3 Données épi. démo'!N178","v":20},{"$f":"+'D3 Données épi. démo'!O178","v":20},{"$f":"+'D3 Données épi. démo'!P178","v":20},{"$f":"+'D3 Données épi. démo'!Q178","v":20},{"$f":"+'D3 Données épi. démo'!R178","v":20}]
[null,null,"Pour la formation de plus d'un jour, est-ce que les participants des PEC MAS ambulatoire et PEC MAS hospitalière restent pendant la nuit au Siège de la zone ou s'y déplacent chaque jour ?  ",null,"Feuille de calculD3",{"$f":"+'D3 Données épi. démo'!F179","v":"restent la nuit"},null,null,null,{"$f":"+'D3 Données épi. démo'!J179","v":0},{"$f":"+'D3 Données épi. démo'!K179","v":0},{"$f":"+'D3 Données épi. démo'!L179","v":0},{"$f":"+'D3 Données épi. démo'!M179","v":0},{"$f":"+'D3 Données épi. démo'!N179","v":0},{"$f":"+'D3 Données épi. démo'!O179","v":0},{"$f":"+'D3 Données épi. démo'!P179","v":0},{"$f":"+'D3 Données épi. démo'!Q179","v":0},{"$f":"+'D3 Données épi. démo'!R179","v":0}]
[null,null,"CALCULS"]
[null,null,"Nombre d'agents de santé du nouveau site PEC MAS ambulatoire à former ","agents de santé",null,{"$f":"+F113*F119","v":0},null,null,null,{"$f":"+J113*J119","v":0},0,0,0,0,0,0,0,0]
[null,null,"Nombre d'agents de santé du site établi PEC MAS ambulatoire à former  ","agents de santé",null,{"$f":"+F114*F120","v":6},null,null,null,{"$f":"+J114*J120","v":0},0,0,0,0,0,0,0,0]
[null,null,"Nombre d'agents de santé des nouveaux sites PEC MAS hospitalière à former ","agents de santé",null,{"$f":"+F115*F121","v":0},null,null,null,{"$f":"+J115*J121","v":0},0,0,0,0,0,0,0,0]
[null,null,"Nombre d'agents de santé des sites établis PEC MAS hospitalière à former ","agents de santé",null,{"$f":"+F116*F122","v":2},null,null,null,{"$f":"+J116*J122","v":0},0,0,0,0,0,0,0,0]
[null,null,"Nombre de  groupes d'agents de santé du nouveau site PEC MAS ambulatoire à former (vu la taille maximum de la classe)","groupes","Arrondi au chiffre entier le plus proche",{"$f":"ROUNDUP(F130/F127,0)","v":0},null,null,null,{"$f":"ROUNDUP(J130/J127,0)","v":0},0,0,0,0,0,0,0,0]
[null,null,"Nombre de  groupes d'agents de santé du site établi PEC MAS ambulatoire à former (vu la taille maximum de la classe)","groupes",null,{"$f":"ROUNDUP(F131/F127,0)","v":1},null,null,null,{"$f":"ROUNDUP(J131/J127,0)","v":0},0,0,0,0,0,0,0,0]
[null,null,"Nombre de  groupes d'agents de santé des nouveaux sites PEC MAS hospitalière à former (vu la taille maximum de la classe)","groupes","Arrondi au chiffre entier le plus proche",{"$f":"ROUNDUP(F132/F127,0)","v":0},null,null,null,{"$f":"ROUNDUP(J132/J127,0)","v":0},0,0,0,0,0,0,0,0]
[null,null,"Nombre de  groupes d'agents de santé des sites établis PEC MAS hospitalière à former (vu la taille maximum de la classe)","groupes",null,{"$f":"ROUNDUP(F133/F127,0)","v":1},null,null,null,{"$f":"ROUNDUP(J133/J127,0)","v":0},0,0,0,0,0,0,0,0]
[null,null,"Nombre de  jours pendant lesquels se tient la formation PEC MAS ambulatoire ","jours"," ",{"$f":"+F134*F123+F135*F124","v":2},null,null,null,{"$f":"+J134*J123+J135*J124","v":0},0,0,0,0,0,0,0,0]
[null,null,"Nombre de  jours pendant lesquels se tient la PEC MAS hospitalière ","jours"," ",{"$f":"+F125*F136+F126*F137","v":6},null,null,null,{"$f":"+J125*J136+J126*J137","v":0},0,0,0,0,0,0,0,0]
[null,null,"Nombre de  jours de formateurs par an --des agents de santé de PEC MAS ambulatoire","jours","jours de formation x 2 (pour la préparation)",{"$f":"2*F138","v":4},null,null,null,{"$f":"2*J138","v":0},0,0,0,0,0,0,0,0]
[null,null,"Nombre de  jours de formateur par an --des agents de santé de PEC MAS hospitalière","jours","jours de formation x 2 (pour la préparation)",{"$f":"2*F139","v":12},null,null,null,{"$f":"2*J139","v":0},0,0,0,0,0,0,0,0]
[null,null,"Total  jours de formation pour les  participants PEC MAS ambulatoire par an","jours",null,{"$f":"+F130*F123+F131*F124","v":12},null,null,null,{"$f":"+J130*J123+J131*J124","v":0},0,0,0,0,0,0,0,0]
[null,null,"Total jours de formation pour les participants PEC MAS hospitalière par an","jours",null,{"$f":"+F132*F125+F133*F126","v":12},null,null,null,{"$f":"+J132*J125+J133*J126","v":0},0,0,0,0,0,0,0,0]
[null,null,"Total nombre de voyages retour faits par tous les participants de la PEC MAS ambulatoire au Siège de la zone","voyages",null,{"$f":"+IF(F128=\"voyagent chaque jour\",F130*F123+F131*F124,F130+F131)","v":6},null,null,null,{"$f":"+IF(J128=\"voyagent chaque jour\",J130*J123+J131*J124,J130+J131)","v":0},0,0,0,0,0,0,0,0]
[null,null,"Total nombre de voyages retour faits par tous les participants de la PEC MAS hospitalière au Siège de la zone","voyages",null,{"$f":"+IF(F128=\"voyagent chaque jour\",F133*F126+F132*F125,F133+F132)","v":2},null,null,null,{"$f":"+IF(J128=\"voyagent chaque jour\",J133*J126+J132*J125,J133+J132)","v":0},0,0,0,0,0,0,0,0]
[null,null,"Distance parcourue par les participants de la PEC MAS ambulatoire par an","km",null,{"$f":"2*F117*F144","v":60},null,null,null,{"$f":"2*J117*J144","v":0},0,0,0,0,0,0,0,0]
[null,null,"Distance parcourue par les participants de la PEC MAS hospitalière par an","km",null,{"$f":"2*F118*F145","v":20},null,null,null,{"$f":"2*J118*J145","v":0},0,0,0,0,0,0,0,0]
[null,null,"Formation des AEC"]
[null,null,"Drivers de base, données brutes"]
[null,null,"Distance moyenne parcourue aux villages des AEC du site PEC MAS ambulatoire ","km","Feuille de calcul D3",{"$f":"+'D3 Données épi. démo'!F131","v":3},null,null,null,{"$f":"+'D3 Données épi. démo'!J131","v":0},{"$f":"+'D3 Données épi. démo'!K131","v":0},{"$f":"+'D3 Données épi. démo'!L131","v":0},{"$f":"+'D3 Données épi. démo'!M131","v":0},{"$f":"+'D3 Données épi. démo'!N131","v":0},{"$f":"+'D3 Données épi. démo'!O131","v":0},{"$f":"+'D3 Données épi. démo'!P131","v":0},{"$f":"+'D3 Données épi. démo'!Q131","v":0},{"$f":"+'D3 Données épi. démo'!R131","v":0}]
[null,null,"Nombre minimum des  AEC nécessaires pour chaque site d'extension communautaire","AEC","Feuille de calcul D3",{"$f":"+'D3 Données épi. démo'!F80","v":1},null,null,null,{"$f":"+'D3 Données épi. démo'!J80","v":0.19230769230769232},{"$f":"+'D3 Données épi. démo'!K80","v":0.19230769230769232},{"$f":"+'D3 Données épi. démo'!L80","v":0.19230769230769232},{"$f":"+'D3 Données épi. démo'!M80","v":0.19230769230769232},{"$f":"+'D3 Données épi. démo'!N80","v":0.19230769230769232},{"$f":"+'D3 Données épi. démo'!O80","v":0.19230769230769232},{"$f":"+'D3 Données épi. démo'!P80","v":0.19230769230769232},{"$f":"+'D3 Données épi. démo'!Q80","v":0.19230769230769232},{"$f":"+'D3 Données épi. démo'!R80","v":0.19230769230769232}]
[null,null,"Nombre des nouveaux sites d'extension communautaire",null,"Feuille de calcul D3",{"$f":"+'D9 Variables temps'!F36","v":100},null,null,null,{"$f":"+'D9 Variables temps'!J36","v":0},{"$f":"+'D9 Variables temps'!K36","v":0},{"$f":"+'D9 Variables temps'!L36","v":0},{"$f":"+'D9 Variables temps'!M36","v":0},{"$f":"+'D9 Variables temps'!N36","v":0},{"$f":"+'D9 Variables temps'!O36","v":0},{"$f":"+'D9 Variables temps'!P36","v":0},{"$f":"+'D9 Variables temps'!Q36","v":0},{"$f":"+'D9 Variables temps'!R36","v":0}]
[null,null,"Nombre des sites établis d'extension communautaire",null,"Feuille de calcul D3",{"$f":"+'D9 Variables temps'!F37","v":0},null,null,null,{"$f":"+'D9 Variables temps'!J37","v":0},{"$f":"+'D9 Variables temps'!K37","v":0},{"$f":"+'D9 Variables temps'!L37","v":0},{"$f":"+'D9 Variables temps'!M37","v":0},{"$f":"+'D9 Variables temps'!N37","v":0},{"$f":"+'D9 Variables temps'!O37","v":0},{"$f":"+'D9 Variables temps'!P37","v":0},{"$f":"+'D9 Variables temps'!Q37","v":0},{"$f":"+'D9 Variables temps'!R37","v":0}]
[null,null,"Jours de formation pour les nouveaux participants AEC par an  ","jours","Feuille de calcul D3",{"$f":"+'D3 Données épi. démo'!F180","v":2},null,null,null,{"$f":"+'D3 Données épi. démo'!J180","v":2},{"$f":"+'D3 Données épi. démo'!K180","v":2},{"$f":"+'D3 Données épi. démo'!L180","v":2},{"$f":"+'D3 Données épi. démo'!M180","v":2},{"$f":"+'D3 Données épi. démo'!N180","v":2},{"$f":"+'D3 Données épi. démo'!O180","v":2},{"$f":"+'D3 Données épi. démo'!P180","v":2},{"$f":"+'D3 Données épi. démo'!Q180","v":2},{"$f":"+'D3 Données épi. démo'!R180","v":2}]
[null,null,"Jours de formation pour les participants  AEC établis par an ","jours","Feuille de calcul D3",{"$f":"+'D3 Données épi. démo'!F181","v":1},null,null,null,{"$f":"+'D3 Données épi. démo'!J181","v":1},{"$f":"+'D3 Données épi. démo'!K181","v":1},{"$f":"+'D3 Données épi. démo'!L181","v":1},{"$f":"+'D3 Données épi. démo'!M181","v":1},{"$f":"+'D3 Données épi. démo'!N181","v":1},{"$f":"+'D3 Données épi. démo'!O181","v":1},{"$f":"+'D3 Données épi. démo'!P181","v":1},{"$f":"+'D3 Données épi. démo'!Q181","v":1},{"$f":"+'D3 Données épi. démo'!R181","v":1}]
[null,null,"Taux d'abandon (% des AEC qui arrêtent de travailler pour la PCMA par an)","%","Feuille de calcul D3",{"$f":"+'D3 Données épi. démo'!F182","v":25},null,null,null,{"$f":"+'D3 Données épi. démo'!J182","v":25},{"$f":"+'D3 Données épi. démo'!K182","v":25},{"$f":"+'D3 Données épi. démo'!L182","v":25},{"$f":"+'D3 Données épi. démo'!M182","v":25},{"$f":"+'D3 Données épi. démo'!N182","v":25},{"$f":"+'D3 Données épi. démo'!O182","v":25},{"$f":"+'D3 Données épi. démo'!P182","v":25},{"$f":"+'D3 Données épi. démo'!Q182","v":25},{"$f":"+'D3 Données épi. démo'!R182","v":25}]
[null,null,"Taille maximum de la classe de  formation des AEC","AEC","Feuille de calcul D3",{"$f":"+'D3 Données épi. démo'!F183","v":20},null,null,null,{"$f":"+'D3 Données épi. démo'!J183","v":20},{"$f":"+'D3 Données épi. démo'!K183","v":20},{"$f":"+'D3 Données épi. démo'!L183","v":20},{"$f":"+'D3 Données épi. démo'!M183","v":20},{"$f":"+'D3 Données épi. démo'!N183","v":20},{"$f":"+'D3 Données épi. démo'!O183","v":20},{"$f":"+'D3 Données épi. démo'!P183","v":20},{"$f":"+'D3 Données épi. démo'!Q183","v":20},{"$f":"+'D3 Données épi. démo'!R183","v":20}]
[null,null,"Pour la formation de plus d'une journée, est-ce que les participants AEC restent pendant la nuit au site PEC MAS ambulatoire ou s'y déplacent chaque jour ? ",null,"Feuille de calcul D3",{"$f":"+'D3 Données épi. démo'!F184","v":"voyagent chaque jour"},null,null,null,{"$f":"+'D3 Données épi. démo'!J184","v":0},{"$f":"+'D3 Données épi. démo'!K184","v":0},{"$f":"+'D3 Données épi. démo'!L184","v":0},{"$f":"+'D3 Données épi. démo'!M184","v":0},{"$f":"+'D3 Données épi. démo'!N184","v":0},{"$f":"+'D3 Données épi. démo'!O184","v":0},{"$f":"+'D3 Données épi. démo'!P184","v":0},{"$f":"+'D3 Données épi. démo'!Q184","v":0},{"$f":"+'D3 Données épi. démo'!R184","v":0}]
[null,null,"CALCULS"]
[null,null,"Nombre de  sites établis d'activités d'extension communautaire par site établi PEC MAS ambulatoire ",null,"Sites établis d'activités d'extension communautaire par site établi PEC MAS ambulatoire ",{"$f":"+IF(F114=0,0,F153/F114)","v":0},null,null,null,{"$f":"+IF(J114=0,0,J153/J114)","v":0},0,0,0,0,0,0,0,0]
[null,null,"Nombre d'AEC établis par site établi PEC MAS ambulatoire  (en tenant compte des abandons)",null,"(Sites établis d'extension communautaire par site établi PEC MAS ambulatoire ) * minimum d'AEC par site d'extension communautaire (moins les abandons)",{"$f":"+F160*F151*(100-F156)/100","v":0},null,null,null,{"$f":"+J160*J151*(100-J156)/100","v":0},0,0,0,0,0,0,0,0]
[null,null,"Nombre d'AEC nécessitant un recyclage ",null,"Si sites établis d'activités d'extension communautaire < sites établis PEC MAS ambulatoire, alors sites établis d'activités d'extension communautaire, sinon : \n(no. d'AEC établis par site établi PEC MAS ambulatoire) * no. de sites établis PEC MAS ambulatoire ",{"$f":"+IF(F153<F114,F153,ROUNDUP(F161,0)*F114)","v":0},null,null,null,{"$f":"+IF(J153<J114,J153,ROUNDUP(J161,0)*J114)","v":0},0,0,0,0,0,0,0,0]
[null,null,"Nombre de  classes de recyclage nécessaires",null,"Si recyclage AEC est moins que site établi PEC MAS ambulatoire, alors pas de recyclage, sinon: \n(no. d'AEC de recyclage par site établi PEC MAS ambulatoire  /taille maximum de la classe ) * no. de sites établis PEC MAS ambulatoire ",{"$f":"+IF(F153<F114,F153,F114*ROUNDUP(ROUNDUP(F161,0)/F157,0))","v":0},null,null,null,{"$f":"+IF(J153<J114,J153,J114*ROUNDUP(ROUNDUP(J161,0)/J157,0))","v":0},0,0,0,0,0,0,0,0]
[null,null,"Nombre de tous les sites d'activités d'extension communautaire par site PEC MAS ambulatoire (le cas échéant) ",null,null,{"$f":"+IF(F113+F114=0,0,(F152+F153)/(F113+F114))","v":50},null,null,null,{"$f":"+IF(J113+J114=0,0,(J152+J153)/(J113+J114))","v":0},0,0,0,0,0,0,0,0]
[null,null,"Pour nouveau site PEC MAS ambulatoire, nombre de nouveaux AEC nécessaires par nouveau site PEC MAS ambulatoire ",null,null,{"$f":"+F164*F151","v":50},null,null,null,{"$f":"+J164*J151","v":0},0,0,0,0,0,0,0,0]
[null,null,"Nombre d'AEC demandant une nouvelle formation (pour les nouveaux sites PEC MAS ambulatoire)",null,"(No. de nouveaux AEC par nouveau site PEC MAS ambulatoire s) * no. de nouveaux sites PEC MAS ambulatoire ",{"$f":"+IF(F164<1,F164*F113,ROUNDUP(F165,0)*F113)","v":0},null,null,null,{"$f":"+IF(J164<1,J164*J113,ROUNDUP(J165,0)*J113)","v":0},0,0,0,0,0,0,0,0]
[null,null,"Nombre de  classes de formation complète nécessaires dans les nouveaux sites PEC MAS ambulatoire (total pour tous les nouveaux sites PEC MAS ambulatoire)",null,"S'il y a moins de nouveaux sites PEC MAS ambulatoire que les nouveaux sites d'activités d'extension communautaire, alors,  nouveau site PEC MAS ambulatoire, sinon: \n(nouveau AEC par nouveau site PEC MAS ambulatoire /taille maximum de la classe) * no. de nouveaux sites PEC MAS ambulatoire ",{"$f":"+IF(F152<F113,F152,F113*ROUNDUP(ROUNDUP(F165,0)/F157,0))","v":0},null,null,null,{"$f":"+IF(J152<J113,J152,J113*ROUNDUP(ROUNDUP(J165,0)/J157,0))","v":0},0,0,0,0,0,0,0,0]
[null,null,"Nombre d'AEC nécessitant une nouvelle formation (pour site établi PEC MAS ambulatoire) par site établi PEC MAS ambulatoire ",null,null,{"$f":"+(F164-F160)*F151+F156/100*F160*F151","v":50},null,null,null,{"$f":"+(J164-J160)*J151+J156/100*J160*J151","v":0},0,0,0,0,0,0,0,0]
[null,null,"Nombre d'AEC nécessitant une nouvelle formation (pour site établi PEC MAS ambulatoire) pour tous les sites établis PEC MAS ambulatoire (arrondi)",null,null,{"$f":"+ROUNDUP(F168,0)*F114","v":100},null,null,null,{"$f":"+ROUNDUP(J168,0)*J114","v":0},0,0,0,0,0,0,0,0]
[null,null,"Nombre de  classes de formation complète nécessaires dans site établi PEC MAS ambulatoire (total pour tous les sites établis).",null,"{(No. de tous les sites d'activités d'extension communautaire par tous les sites PEC MAS ambulatoire  - no. de sites établis d'extension communautaire par site établi PEC MAS ambulatoire ) * no. minimum d'AEC par site d'extension communautaire / taille minimum de la classe} * no. de site établi PEC MAS ambulatoire ",{"$f":"+ROUNDUP(ROUNDUP((F164-F160)*F151,0)/F157,0)*F114","v":6},null,null,null,{"$f":"+ROUNDUP(ROUNDUP((J164-J160)*J151,0)/J157,0)*J114","v":0},0,0,0,0,0,0,0,0]
[null,null,"Nombre de  jours de formation par anr","jours","No. de groupes de formation complète * no. de jours+ no. de groupes de formation de recyclage * no. de jours",{"$f":"+F163*F155+F154*(F167+F170)","v":12},null,null,null,{"$f":"+J163*J155+J154*(J167+J170)","v":0},0,0,0,0,0,0,0,0]
[null,null,"Nombre de  jours de formation des formateurs pour les AEC","jours","No. de jours de formation *2 (1 jour de préparation pour chaque jour de formation)",{"$f":"2*F171","v":24},null,null,null,{"$f":"2*J171","v":0},0,0,0,0,0,0,0,0]
[null,null,"Total jours-participants AEC par an (jour-participant est un jour passé par un AEC en formation)","jours","No. de nouveaux AEC * formation complète + no. d'anciens AEC * recyclage",{"$f":"+F162*F155+F154*(F166+F169)","v":200},null,null,null,{"$f":"+J162*J155+J154*(J166+J169)","v":0},0,0,0,0,0,0,0,0]
[null,null,"Distance parcourue pour la formation par tous les AEC par an","km",null,{"$f":"+F150*2*F173","v":1200},null,null,null,{"$f":"+J150*2*J173","v":0},0,0,0,0,0,0,0,0]
[null,null,"Formation des gestionnaires"]
[null,null,"Drivers de base"]
[null,null,"Nombre de personnel par nouveau Siège de la zone à former par an","personnel","Feuille de calcul D3",{"$f":"+'D3 Données épi. démo'!F164","v":4},null,null,null,{"$f":"+'D3 Données épi. démo'!J164","v":4},{"$f":"+'D3 Données épi. démo'!K164","v":4},{"$f":"+'D3 Données épi. démo'!L164","v":4},{"$f":"+'D3 Données épi. démo'!M164","v":4},{"$f":"+'D3 Données épi. démo'!N164","v":4},{"$f":"+'D3 Données épi. démo'!O164","v":4},{"$f":"+'D3 Données épi. démo'!P164","v":4},{"$f":"+'D3 Données épi. démo'!Q164","v":4},{"$f":"+'D3 Données épi. démo'!R164","v":4}]
[null,null," Nombre de personnel par Siège établi à former par an","personnel","Feuille de calcul D3",{"$f":"+'D3 Données épi. démo'!F165","v":2},null,null,null,{"$f":"+'D3 Données épi. démo'!J165","v":2},{"$f":"+'D3 Données épi. démo'!K165","v":2},{"$f":"+'D3 Données épi. démo'!L165","v":2},{"$f":"+'D3 Données épi. démo'!M165","v":2},{"$f":"+'D3 Données épi. démo'!N165","v":2},{"$f":"+'D3 Données épi. démo'!O165","v":2},{"$f":"+'D3 Données épi. démo'!P165","v":2},{"$f":"+'D3 Données épi. démo'!Q165","v":2},{"$f":"+'D3 Données épi. démo'!R165","v":2}]
[null,null,"Jours de formation pour le personnel du nouveau Siège de la zone par an","jours","Feuille de calcul D3",{"$f":"+'D3 Données épi. démo'!F166","v":5},null,null,null,{"$f":"+'D3 Données épi. démo'!J166","v":5},{"$f":"+'D3 Données épi. démo'!K166","v":5},{"$f":"+'D3 Données épi. démo'!L166","v":5},{"$f":"+'D3 Données épi. démo'!M166","v":5},{"$f":"+'D3 Données épi. démo'!N166","v":5},{"$f":"+'D3 Données épi. démo'!O166","v":5},{"$f":"+'D3 Données épi. démo'!P166","v":5},{"$f":"+'D3 Données épi. démo'!Q166","v":5},{"$f":"+'D3 Données épi. démo'!R166","v":5}]
[null,null,"Jours de formation pour le personnel du Siège établi de la zone par an","jours","Feuille de calcul D3",{"$f":"+'D3 Données épi. démo'!F167","v":1},null,null,null,{"$f":"+'D3 Données épi. démo'!J167","v":1},{"$f":"+'D3 Données épi. démo'!K167","v":1},{"$f":"+'D3 Données épi. démo'!L167","v":1},{"$f":"+'D3 Données épi. démo'!M167","v":1},{"$f":"+'D3 Données épi. démo'!N167","v":1},{"$f":"+'D3 Données épi. démo'!O167","v":1},{"$f":"+'D3 Données épi. démo'!P167","v":1},{"$f":"+'D3 Données épi. démo'!Q167","v":1},{"$f":"+'D3 Données épi. démo'!R167","v":1}]
[null,null,"Taille maximum de la classe de formation pour le personnel du Siège de la zone ","personnel","Feuille de calcul D3",{"$f":"+'D3 Données épi. démo'!F168","v":20},null,null,null,{"$f":"+'D3 Données épi. démo'!J168","v":20},{"$f":"+'D3 Données épi. démo'!K168","v":20},{"$f":"+'D3 Données épi. démo'!L168","v":20},{"$f":"+'D3 Données épi. démo'!M168","v":20},{"$f":"+'D3 Données épi. démo'!N168","v":20},{"$f":"+'D3 Données épi. démo'!O168","v":20},{"$f":"+'D3 Données épi. démo'!P168","v":20},{"$f":"+'D3 Données épi. démo'!Q168","v":20},{"$f":"+'D3 Données épi. démo'!R168","v":20}]
[null,null,"Distance du Siège de la zone au Siège du groupe-zones","km","Feuille de calcul D3",{"$f":"+'D3 Données épi. démo'!F127","v":1},null,null,null,{"$f":"+'D3 Données épi. démo'!J127","v":0},{"$f":"+'D3 Données épi. démo'!K127","v":0},{"$f":"+'D3 Données épi. démo'!L127","v":0},{"$f":"+'D3 Données épi. démo'!M127","v":0},{"$f":"+'D3 Données épi. démo'!N127","v":0},{"$f":"+'D3 Données épi. démo'!O127","v":0},{"$f":"+'D3 Données épi. démo'!P127","v":0},{"$f":"+'D3 Données épi. démo'!Q127","v":0},{"$f":"+'D3 Données épi. démo'!R127","v":0}]
[null,null,"Temps pour arriver au Siège de la zone du Siège du groupe-zones","heures","Feuille de calcul D3",{"$f":"+'D3 Données épi. démo'!F128","v":0.1},null,null,null,{"$f":"+'D3 Données épi. démo'!J128","v":0},{"$f":"+'D3 Données épi. démo'!K128","v":0},{"$f":"+'D3 Données épi. démo'!L128","v":0},{"$f":"+'D3 Données épi. démo'!M128","v":0},{"$f":"+'D3 Données épi. démo'!N128","v":0},{"$f":"+'D3 Données épi. démo'!O128","v":0},{"$f":"+'D3 Données épi. démo'!P128","v":0},{"$f":"+'D3 Données épi. démo'!Q128","v":0},{"$f":"+'D3 Données épi. démo'!R128","v":0}]
[null,null,"Pour une formation de plus d'une journée,  est-ce que les participants restent pendant la nuit au Siège du Groupe-zones ou s'y déplacent chaque jour ? ",null,"Feuille de calcul D3",{"$f":"+'D3 Données épi. démo'!F169","v":"restent la nuit"},null,null,null,{"$f":"+'D3 Données épi. démo'!J169","v":0},{"$f":"+'D3 Données épi. démo'!K169","v":0},{"$f":"+'D3 Données épi. démo'!L169","v":0},{"$f":"+'D3 Données épi. démo'!M169","v":0},{"$f":"+'D3 Données épi. démo'!N169","v":0},{"$f":"+'D3 Données épi. démo'!O169","v":0},{"$f":"+'D3 Données épi. démo'!P169","v":0},{"$f":"+'D3 Données épi. démo'!Q169","v":0},{"$f":"+'D3 Données épi. démo'!R169","v":0}]
[null,null,"Drivers intermédiaires"]
[null,null,"Cette zone est-elle nouvelle (ou compte-t-elle au moins un site établi PEC MAS ambulatoire ou site PEC MAS hospitalière) ou est-elle non fonctionnelle ?",null,"Feuille de calcul D9",{"$f":"+'D9 Variables temps'!F46","v":"établie"},null,null,null,{"$f":"+'D9 Variables temps'!J46","v":"inactive"},{"$f":"+'D9 Variables temps'!K46","v":"inactive"},{"$f":"+'D9 Variables temps'!L46","v":"inactive"},{"$f":"+'D9 Variables temps'!M46","v":"inactive"},{"$f":"+'D9 Variables temps'!N46","v":"inactive"},{"$f":"+'D9 Variables temps'!O46","v":"inactive"},{"$f":"+'D9 Variables temps'!P46","v":"inactive"},{"$f":"+'D9 Variables temps'!Q46","v":"inactive"},{"$f":"+'D9 Variables temps'!R46","v":"inactive"}]
[null,null,"Nombre de personnel du Siège de la zone à former ","personnel",null,{"$f":"IF(F186=\"établie\",F178,IF(F186=\"nouvelle\",F177,0))","v":2},null,null,null,{"$f":"IF(J186=\"établie\",J178,IF(J186=\"nouvelle\",J177,0))","v":0},0,0,0,0,0,0,0,0]
[null,null,"Nombre de personnel des nouvellez zones à former ","personnel",null,{"$f":"+IF(F186=\"nouvelle\",F187,0)","v":0},null,null,null,{"$f":"+IF(J186=\"nouvelle\",J187,0)","v":0},0,0,0,0,0,0,0,0]
[null,null,"Nombre de personnel des zones établies à former ","personnel",null,{"$f":"+IF(F186=\"établie\",F178,0)","v":2},null,null,null,{"$f":"+IF(J186=\"établie\",J178,0)","v":0},0,0,0,0,0,0,0,0]
[null,null,"Nombre de  jours de formation par an","jours","voir R6"]
[null,null,"Nombre de  jours de participants","jours","voir R6"]
[null,null,"Total jours de formation jours par participant et par an","jours",null,{"$f":"+IF(F186=\"établie\",F187*F180,F187*F179)","v":2},null,null,null,{"$f":"+IF(J186=\"établie\",J187*J180,J187*J179)","v":0},0,0,0,0,0,0,0,0]
[null,null,"Total nombre de voyages de retour faits par tous les gestionnaires de zones au Siège du Groupe-zones pour la formation","voyages",null,{"$f":"+IF(F184=\"voyagent chaque jour\",F188*F179+F189*F180,F188+F189)","v":2},null,null,null,{"$f":"+IF(J184=\"voyagent chaque jour\",J188*J179+J189*J180,J188+J189)","v":0},0,0,0,0,0,0,0,0]
[null,null,"Distance parcourue par tous les participants par an","km",null,{"$f":"+F193*F182*2","v":4},null,null,null,{"$f":"+J193*J182*2","v":0},0,0,0,0,0,0,0,0]
[null,null,"Prix"]
[null,null,"Coût du salaire du formateur des agents des sites de la PEC MAS ambulatoire ou site PEC MAS hospitalière par jour  (niveau intermédiaire Siège de la zone)",{"$f":"+'D1 Données générales'!$H$13","v":"Cedi"},"Feuille de calcul D5",{"$f":"+'D5 Salaires'!J29","v":18.46153846153846},null,null,null,{"$f":"+$F196*'D4 Prix'!J81","v":0},{"$f":"+$F196*'D4 Prix'!K81","v":0},{"$f":"+$F196*'D4 Prix'!L81","v":0},{"$f":"+$F196*'D4 Prix'!M81","v":0},{"$f":"+$F196*'D4 Prix'!N81","v":0},{"$f":"+$F196*'D4 Prix'!O81","v":0},{"$f":"+$F196*'D4 Prix'!P81","v":0},{"$f":"+$F196*'D4 Prix'!Q81","v":0},{"$f":"+$F196*'D4 Prix'!R81","v":0}]
[null,null,"Honoraires journaliers pour le formateur des agents de santé de la PEC MAS ambulatoire ou PEC MAS hospitalière (agent de niveau intermédiaire du Siège de la zone)",{"$f":"+'D1 Données générales'!$H$13","v":"Cedi"},"Feuille de calcul D5",{"$f":"+'D5 Salaires'!K29","v":50},null,null,null,{"$f":"+$F$197","v":50},{"$f":"+$F$197","v":50},50,50,50,50,50,50,50]
[null,null,"Coût du temps des participants ( site PEC MAS ambulatoire ) par jour",{"$f":"+'D1 Données générales'!$H$13","v":"Cedi"},"Feuille de calcul D5 (average of senior and junior PEC MAS ambulatoire staff)",{"$f":"+('D5 Salaires'!J32+'D5 Salaires'!J33)/2","v":28.846153846153847},null,null,null,{"$f":"+$F$198*'D4 Prix'!J81","v":0},{"$f":"+$F$198*'D4 Prix'!K81","v":0},{"$f":"+$F$198*'D4 Prix'!L81","v":0},{"$f":"+$F$198*'D4 Prix'!M81","v":0},{"$f":"+$F$198*'D4 Prix'!N81","v":0},{"$f":"+$F$198*'D4 Prix'!O81","v":0},{"$f":"+$F$198*'D4 Prix'!P81","v":0},{"$f":"+$F$198*'D4 Prix'!Q81","v":0},{"$f":"+$F$198*'D4 Prix'!R81","v":0}]
[null,null,"Coût du temps des participants ( site PEC MAS hospitalière) par jour",{"$f":"+'D1 Données générales'!$H$13","v":"Cedi"},"Feuille de calcul D5",{"$f":"+('D5 Salaires'!J36+'D5 Salaires'!J38)/2","v":47.307692307692307},null,null,null,{"$f":"+$F$199*'D4 Prix'!J81","v":0},{"$f":"+$F$199*'D4 Prix'!K81","v":0},{"$f":"+$F$199*'D4 Prix'!L81","v":0},{"$f":"+$F$199*'D4 Prix'!M81","v":0},{"$f":"+$F$199*'D4 Prix'!N81","v":0},{"$f":"+$F$199*'D4 Prix'!O81","v":0},{"$f":"+$F$199*'D4 Prix'!P81","v":0},{"$f":"+$F$199*'D4 Prix'!Q81","v":0},{"$f":"+$F$199*'D4 Prix'!R81","v":0}]
[null,null,"Coût par km de transport du site PEC MAS ambulatoire ou site PEC MAS hospitalière",{"$f":"+'D1 Données générales'!$H$13","v":"Cedi"},"Feuille de calcul D4",{"$f":"+'D4 Prix'!F74","v":2},null,null,null,{"$f":"+'D4 Prix'!J74","v":2},{"$f":"+'D4 Prix'!K74","v":2},{"$f":"+'D4 Prix'!L74","v":2},{"$f":"+'D4 Prix'!M74","v":2},{"$f":"+'D4 Prix'!N74","v":2},{"$f":"+'D4 Prix'!O74","v":2},{"$f":"+'D4 Prix'!P74","v":2},{"$f":"+'D4 Prix'!Q74","v":2},{"$f":"+'D4 Prix'!R74","v":2}]
[null,null,"Coût du matériel de formation par participant de la PEC MAS ambulatoire ",{"$f":"+'D1 Données générales'!$H$13","v":"Cedi"},"Feuille de calcul D4",{"$f":"+'D4 Prix'!F66","v":20},null,null,null,{"$f":"+'D4 Prix'!J66","v":20},{"$f":"+'D4 Prix'!K66","v":20},{"$f":"+'D4 Prix'!L66","v":20},{"$f":"+'D4 Prix'!M66","v":20},{"$f":"+'D4 Prix'!N66","v":20},{"$f":"+'D4 Prix'!O66","v":20},{"$f":"+'D4 Prix'!P66","v":20},{"$f":"+'D4 Prix'!Q66","v":20},{"$f":"+'D4 Prix'!R66","v":20}]
[null,null,"Coût du matériel de formation par participant de la PEC MAS hospitalière ",{"$f":"+'D1 Données générales'!$H$13","v":"Cedi"},"Feuille de calcul D4",{"$f":"+'D4 Prix'!F67","v":20},null,null,null,{"$f":"+'D4 Prix'!J67","v":20},{"$f":"+'D4 Prix'!K67","v":20},{"$f":"+'D4 Prix'!L67","v":20},{"$f":"+'D4 Prix'!M67","v":20},{"$f":"+'D4 Prix'!N67","v":20},{"$f":"+'D4 Prix'!O67","v":20},{"$f":"+'D4 Prix'!P67","v":20},{"$f":"+'D4 Prix'!Q67","v":20},{"$f":"+'D4 Prix'!R67","v":20}]
[null,null,"Indemnités journalières (nourriture et hébergement) (par personne par jour) pour la PEC MAS ambulatoire ou la PEC MAS hospitalière, pour assister à la formation",{"$f":"+'D1 Données générales'!$H$13","v":"Cedi"},"Feuille de calcul D4",{"$f":"+'D4 Prix'!F31","v":80},null,null,null,{"$f":"+'D4 Prix'!J31","v":80},{"$f":"+'D4 Prix'!K31","v":80},{"$f":"+'D4 Prix'!L31","v":80},{"$f":"+'D4 Prix'!M31","v":80},{"$f":"+'D4 Prix'!N31","v":80},{"$f":"+'D4 Prix'!O31","v":80},{"$f":"+'D4 Prix'!P31","v":80},{"$f":"+'D4 Prix'!Q31","v":80},{"$f":"+'D4 Prix'!R31","v":80}]
[null,null,"Coût salarial du formateur des AEC par jour (agent senior PEC MAS ambulatoire)",{"$f":"+'D1 Données générales'!$H$13","v":"Cedi"},"Feuille de calcul D5",{"$f":"+'D5 Salaires'!J32","v":39.230769230769234},null,null,null,{"$f":"+$F$204*'D4 Prix'!J81","v":0},{"$f":"+$F$204*'D4 Prix'!K81","v":0},{"$f":"+$F$204*'D4 Prix'!L81","v":0},{"$f":"+$F$204*'D4 Prix'!M81","v":0},{"$f":"+$F$204*'D4 Prix'!N81","v":0},{"$f":"+$F$204*'D4 Prix'!O81","v":0},{"$f":"+$F$204*'D4 Prix'!P81","v":0},{"$f":"+$F$204*'D4 Prix'!Q81","v":0},{"$f":"+$F$204*'D4 Prix'!R81","v":0}]
[null,null,"Honoraires quotidiens pour le participant AEC (agent senior PEC MAS ambulatoire)",{"$f":"+'D1 Données générales'!$H$13","v":"Cedi"},"Feuille de calcul D5",{"$f":"+'D5 Salaires'!K32","v":50},null,null,null,{"$f":"+$F$205","v":50},{"$f":"+$F$205","v":50},50,50,50,50,50,50,50]
[null,null,"Coût par km de transport du village (pour l'AEC)",{"$f":"+'D1 Données générales'!$H$13","v":"Cedi"},"Feuille de calcul D4",{"$f":"+'D4 Prix'!F75","v":2},null,null,null,{"$f":"+'D4 Prix'!J75","v":2},{"$f":"+'D4 Prix'!K75","v":2},{"$f":"+'D4 Prix'!L75","v":2},{"$f":"+'D4 Prix'!M75","v":2},{"$f":"+'D4 Prix'!N75","v":2},{"$f":"+'D4 Prix'!O75","v":2},{"$f":"+'D4 Prix'!P75","v":2},{"$f":"+'D4 Prix'!Q75","v":2},{"$f":"+'D4 Prix'!R75","v":2}]
[null,null,"Coût du matériel de formation par AEC",{"$f":"+'D1 Données générales'!$H$13","v":"Cedi"},"Feuille de calcul D4",{"$f":"+'D4 Prix'!F65","v":1},null,null,null,{"$f":"+'D4 Prix'!J65","v":1},{"$f":"+'D4 Prix'!K65","v":1},{"$f":"+'D4 Prix'!L65","v":1},{"$f":"+'D4 Prix'!M65","v":1},{"$f":"+'D4 Prix'!N65","v":1},{"$f":"+'D4 Prix'!O65","v":1},{"$f":"+'D4 Prix'!P65","v":1},{"$f":"+'D4 Prix'!Q65","v":1},{"$f":"+'D4 Prix'!R65","v":1}]
[null,null,"Indemnités journalières (y compris la nourriture et l'hébergement) (par personne par jour) pour l'AEC qui vient assister à la formation",{"$f":"+'D1 Données générales'!$H$13","v":"Cedi"},"Feuille de calcul D4",{"$f":"+'D4 Prix'!F32","v":0},null,null,null,{"$f":"+'D4 Prix'!J30","v":80},{"$f":"+'D4 Prix'!K30","v":80},{"$f":"+'D4 Prix'!L30","v":80},{"$f":"+'D4 Prix'!M30","v":80},{"$f":"+'D4 Prix'!N30","v":80},{"$f":"+'D4 Prix'!O30","v":80},{"$f":"+'D4 Prix'!P30","v":80},{"$f":"+'D4 Prix'!Q30","v":80},{"$f":"+'D4 Prix'!R30","v":80}]
[null,null,"Coût du temps du participant (Siège de la zone) par jour",{"$f":"+'D1 Données générales'!$H$13","v":"Cedi"},"Feuille de calcul D5",{"$f":"+('D5 Salaires'!J29)","v":18.46153846153846},null,null,null,{"$f":"+$F$209*'D4 Prix'!J81","v":0},{"$f":"+$F$209*'D4 Prix'!K81","v":0},{"$f":"+$F$209*'D4 Prix'!L81","v":0},{"$f":"+$F$209*'D4 Prix'!M81","v":0},{"$f":"+$F$209*'D4 Prix'!N81","v":0},{"$f":"+$F$209*'D4 Prix'!O81","v":0},{"$f":"+$F$209*'D4 Prix'!P81","v":0},{"$f":"+$F$209*'D4 Prix'!Q81","v":0},{"$f":"+$F$209*'D4 Prix'!R81","v":0}]
[null,null,"Coût par km de transport du Siège de la zone",{"$f":"+'D1 Données générales'!$H$13","v":"Cedi"},"Feuille de calcul D5",{"$f":"+'D4 Prix'!F73","v":2},null,null,null,{"$f":"+'D4 Prix'!J73","v":2},{"$f":"+'D4 Prix'!K73","v":2},{"$f":"+'D4 Prix'!L73","v":2},{"$f":"+'D4 Prix'!M73","v":2},{"$f":"+'D4 Prix'!N73","v":2},{"$f":"+'D4 Prix'!O73","v":2},{"$f":"+'D4 Prix'!P73","v":2},{"$f":"+'D4 Prix'!Q73","v":2},{"$f":"+'D4 Prix'!R73","v":2}]
[null,null,"Coût du matériel de formation par participant du  Siège de la zone ",{"$f":"+'D1 Données générales'!$H$13","v":"Cedi"},"Feuille de calcul D4",{"$f":"+'D4 Prix'!F68","v":40},null,null,null,{"$f":"+'D4 Prix'!J68","v":40},{"$f":"+'D4 Prix'!K68","v":40},{"$f":"+'D4 Prix'!L68","v":40},{"$f":"+'D4 Prix'!M68","v":40},{"$f":"+'D4 Prix'!N68","v":40},{"$f":"+'D4 Prix'!O68","v":40},{"$f":"+'D4 Prix'!P68","v":40},{"$f":"+'D4 Prix'!Q68","v":40},{"$f":"+'D4 Prix'!R68","v":40}]
[null,null,"indemnités journalières (y compris nourriture et hébergement) (par personne par jour) pour le personnel du Siège de la zone qui vient assister à la formation",{"$f":"+'D1 Données générales'!$H$13","v":"Cedi"},"Feuille de calcul D4",{"$f":"+'D4 Prix'!F30","v":80},null,null,null,{"$f":"+'D4 Prix'!J32","v":0},{"$f":"+'D4 Prix'!K32","v":0},{"$f":"+'D4 Prix'!L32","v":0},{"$f":"+'D4 Prix'!M32","v":0},{"$f":"+'D4 Prix'!N32","v":0},{"$f":"+'D4 Prix'!O32","v":0},{"$f":"+'D4 Prix'!P32","v":0},{"$f":"+'D4 Prix'!Q32","v":0},{"$f":"+'D4 Prix'!R32","v":0}]
[null,null,"Coût de location des salles par jour",{"$f":"+'D1 Données générales'!$H$13","v":"Cedi"},"Feuille de calcul D4",{"$f":"+'D4 Prix'!F23","v":120},null,null,null,{"$f":"+'D4 Prix'!J23","v":120},{"$f":"+'D4 Prix'!K23","v":120},{"$f":"+'D4 Prix'!L23","v":120},{"$f":"+'D4 Prix'!M23","v":120},{"$f":"+'D4 Prix'!N23","v":120},{"$f":"+'D4 Prix'!O23","v":120},{"$f":"+'D4 Prix'!P23","v":120},{"$f":"+'D4 Prix'!Q23","v":120},{"$f":"+'D4 Prix'!R23","v":120}]
[null,null,"Coût des rafraîchissement par personne par jour",{"$f":"+'D1 Données générales'!$H$13","v":"Cedi"},"Feuille de calcul D4",{"$f":"+'D4 Prix'!F26","v":12},null,null,null,{"$f":"+'D4 Prix'!J26","v":12},{"$f":"+'D4 Prix'!K26","v":12},{"$f":"+'D4 Prix'!L26","v":12},{"$f":"+'D4 Prix'!M26","v":12},{"$f":"+'D4 Prix'!N26","v":12},{"$f":"+'D4 Prix'!O26","v":12},{"$f":"+'D4 Prix'!P26","v":12},{"$f":"+'D4 Prix'!Q26","v":12},{"$f":"+'D4 Prix'!R26","v":12}]

{"sheet":"R13 Supervision","index":27,"n_rows":155,"n_cols":18,"rows_kept":155,"cut":false,"hidden":false,"merged":[[15,9,15,13],[15,14,15,17],[3,2,3,5],[15,0,29,0],[163,3,164,3],[32,0,49,0],[98,4,101,4],[5,2,5,5]]}
[]
["Retour au sommaire",null,"R13:   Supervision "]
[]
[null,null,"Cette Feuille de calcul indique (pour l'année choisie) les quantités des différents intrants nécessaires pour la supervision de la PCMA et les coûts de ces intrants. "]
[]
[null,null,"Voir ci-dessous pour la manière dont les chiffres sont calculés"]
["Hide",null,"Number of Areas included ",{"$f":"+'D2 Echelle'!$I$8","v":1},"  (taken from Worksheet 2)"]
[]
[]
[null,null,{"$f":"+IF('D1 Données générales'!$H$11=\"\",\"\",'D1 Données générales'!$H$11)","v":"Ghana"}]
[null,null,{"$f":"+'D9 Variables temps'!I6","v":2011},null,null,"Zone 1",null,null,null,"Zone 2","Zone 3","Zone 4","Zone 5","Zone 6","Zone 7","Zone 8","Zone 9","Zone 10"]
[null,null,null,null,{"$f":"'D2 Echelle'!C30","v":"district"},{"$f":"+IF('D2 Echelle'!$C$31=\"\",\"\",'D2 Echelle'!$C$31)","v":"Ashiedu Keteke"},null,null,null,{"$f":"+IF('D2 Echelle'!$C$36=\"\",\"\",'D2 Echelle'!$C$36)","v":""},{"$f":"+IF('D2 Echelle'!$C$41=\"\",\"\",'D2 Echelle'!$C$41)","v":""},{"$f":"+IF('D2 Echelle'!$C$46=\"\",\"\",'D2 Echelle'!$C$46)","v":""},{"$f":"+IF('D2 Echelle'!$C$51=\"\",\"\",'D2 Echelle'!$C$51)","v":""},{"$f":"+IF('D2 Echelle'!$C$56=\"\",\"\",'D2 Echelle'!$C$56)","v":""},{"$f":"+IF('D2 Echelle'!$C$61=\"\",\"\",'D2 Echelle'!$C$61)","v":""},{"$f":"+IF('D2 Echelle'!$C$66=\"\",\"\",'D2 Echelle'!$C$66)","v":""},{"$f":"+IF('D2 Echelle'!$C$71=\"\",\"\",'D2 Echelle'!$C$71)","v":""},{"$f":"+IF('D2 Echelle'!$C$76=\"\",\"\",'D2 Echelle'!$C$76)","v":""}]
[null,null,null,null,{"$f":"+'D2 Echelle'!D30","v":"région"},{"$f":"+IF('D2 Echelle'!$D$31=\"\",\"\",'D2 Echelle'!$D$31)","v":"Greater Accra"},null,null,null,{"$f":"+IF('D2 Echelle'!$D$36=\"\",\"\",'D2 Echelle'!$D$36)","v":""},{"$f":"+IF('D2 Echelle'!$D$41=\"\",\"\",'D2 Echelle'!$D$41)","v":""},{"$f":"+IF('D2 Echelle'!$D$46=\"\",\"\",'D2 Echelle'!$D$46)","v":""},{"$f":"+IF('D2 Echelle'!$D$51=\"\",\"\",'D2 Echelle'!$D$51)","v":""},{"$f":"+IF('D2 Echelle'!$D$56=\"\",\"\",'D2 Echelle'!$D$56)","v":""},{"$f":"+IF('D2 Echelle'!$D$61=\"\",\"\",'D2 Echelle'!$D$61)","v":""},{"$f":"+IF('D2 Echelle'!$D$66=\"\",\"\",'D2 Echelle'!$D$66)","v":""},{"$f":"+IF('D2 Echelle'!$D$71=\"\",\"\",'D2 Echelle'!$D$71)","v":""},{"$f":"+IF('D2 Echelle'!$D$76=\"\",\"\",'D2 Echelle'!$D$76)","v":""}]
[null,null,"Coûts annuels pour cette activité"]
[null,null,"Variables","Unités","Commentaires"]
[null,null,"Supervision de la PEC MAS ambulatoire et/ou PEC MAS hospitalière (par siège de la zone)"]
[null,null," - Temps du superviseur",{"$f":"+IF('D1 Données générales'!$H$13=\"\",\"\",'D1 Données générales'!$H$13)","v":"Cedi"},null,{"$f":"+F36*F148","v":207.69230769230768},null,null,null,{"$f":"+J36*J148","v":0},0,0,0,0,0,0,0,0]
[null,null," - Transport du superviseur",{"$f":"+IF('D1 Données générales'!$H$13=\"\",\"\",'D1 Données générales'!$H$13)","v":"Cedi"},null,{"$f":"+F38*F155","v":192},null,null,null,{"$f":"+J38*J155","v":0},0,0,0,0,0,0,0,0]
[null,null," - Matériel de supervision",{"$f":"+IF('D1 Données générales'!$H$13=\"\",\"\",'D1 Données générales'!$H$13)","v":"Cedi"},null,{"$f":"+F39*F151","v":18},null,null,null,{"$f":"+J39*J151","v":0},0,0,0,0,0,0,0,0]
[null,null,"Supervision interne de la PEC MAS ambulatoire ou PEC MAS hospitalière par agent de santé senior "]
[null,null,"  - Temps de l'agent de santé senior  ",{"$f":"+D19","v":"Cedi"},null,{"$f":"+F41*F149","v":765},null,null,null,{"$f":"+J41*J149","v":0},0,0,0,0,0,0,0,0]
[null,null,"Supervision de l'AEC (par PEC MAS ambulatoire)"]
[null,null," - Temps du superviseur",{"$f":"+IF('D1 Données générales'!$H$13=\"\",\"\",'D1 Données générales'!$H$13)","v":"Cedi"},null,{"$f":"+F43*F149","v":14711.538461538463},null,null,null,{"$f":"+J43*J149","v":0},0,0,0,0,0,0,0,0]
[null,null," - Transport du superviseur",{"$f":"+IF('D1 Données générales'!$H$13=\"\",\"\",'D1 Données générales'!$H$13)","v":"Cedi"},null,{"$f":"+F154*F44","v":14400},null,null,null,{"$f":"+J154*J44","v":0},0,0,0,0,0,0,0,0]
[null,null," - Matériel de supervision",{"$f":"+IF('D1 Données générales'!$H$13=\"\",\"\",'D1 Données générales'!$H$13)","v":"Cedi"},null,{"$f":"+F45*F152","v":240},null,null,null,{"$f":"+J45*J152","v":0},0,0,0,0,0,0,0,0]
[null,null,"Supervision du personnel du siège de la zone (par siège du groupe-zones)"]
[null,null," - Temps du superviseur (niveau intermédiaire du groupe-zones)",{"$f":"+IF('D1 Données générales'!$H$13=\"\",\"\",'D1 Données générales'!$H$13)","v":"Cedi"},null,{"$f":"+F47*F147","v":40.615384615384613},null,null,null,{"$f":"+J47*J147","v":0},0,0,0,0,0,0,0,0]
[null,null," - Transport du superviseur",{"$f":"+IF('D1 Données générales'!$H$13=\"\",\"\",'D1 Données générales'!$H$13)","v":"Cedi"},null,{"$f":"+F48*F153","v":16},null,null,null,{"$f":"+J48*J153","v":0},0,0,0,0,0,0,0,0]
[null,null," - Matériel de supervision",{"$f":"+IF('D1 Données générales'!$H$13=\"\",\"\",'D1 Données générales'!$H$13)","v":"Cedi"},null,{"$f":"+F50*F150","v":2},null,null,null,{"$f":"+J50*J150","v":0},0,0,0,0,0,0,0,0]
[]
[null,null,"Coût total de la supervision par an",{"$f":"+IF('D1 Données générales'!$H$13=\"\",\"\",'D1 Données générales'!$H$13)","v":"Cedi"}," ",{"$f":"+SUM(F17:F29)","v":30592.846153846152},null,null,null,{"$f":"+SUM(J17:J29)","v":0},0,0,0,0,0,0,0,0]
[]
[null,null,"Quantités d'intrants nécessaires pour cette activité"]
[null,null,"Variables","Unités","Commentaires"]
[null,null,"Supervision de la PEC MAS ambulatoire et/ou PEC MAS hospitalière (par siège de la zone)"]
[null,null," - Temps du superviseur (niveau intermédiaire siège de la zone)","jours",null,{"$f":"+F104","v":11.25},null,null,null,{"$f":"+J104","v":0},0,0,0,0,0,0,0,0]
[null,null," - Transport ","km-pers.",null,{"$f":"+F105","v":360},null,null,null,{"$f":"+J105","v":0},0,0,0,0,0,0,0,0]
[null,null,"    - (Montant de transport attribué à la PCMA)","km-pers.",null,{"$f":"+F106","v":96},null,null,null,{"$f":"+J106","v":0},0,0,0,0,0,0,0,0]
[null,null," - Matériel de supervision","outils",null,{"$f":"+F107","v":36},null,null,null,{"$f":"+J107","v":0},0,0,0,0,0,0,0,0]
[null,null,"Supervision interne de la PEC MAS ambulatoire et/ou PEC MAS hospitalière par agent de santé senior "]
[null,null,"  - Temps de l'agent de santé senior  ","jours",null,{"$f":"+F103","v":19.5},null,null,null,{"$f":"+J103","v":0},0,0,0,0,0,0,0,0]
[null,null,"Supervision de l'AEC (par site PEC MAS ambulatoire)"]
[null,null," - Temps du superviseur (agent de santé senior)","jours",null,{"$f":"+F125","v":375},null,null,null,{"$f":"+J125","v":0},0,0,0,0,0,0,0,0]
[null,null," - Transport du superviseur","km",null,{"$f":"+F126","v":7200},null,null,null,{"$f":"+J126","v":0},0,0,0,0,0,0,0,0]
[null,null," - Matériel de supervision","outils",null,{"$f":"+F127","v":1200},null,null,null,{"$f":"+J127","v":0},0,0,0,0,0,0,0,0]
[null,null,"Supervision du personnel du siège de la zone (par siège du groupe-zones)"]
[null,null," - Temps du superviseur (niveau intermédiaire du groupe-zones)","jours",null,{"$f":"+F141","v":1.1000000000000001},null,null,null,{"$f":"+J141","v":0},0,0,0,0,0,0,0,0]
[null,null," - Transport du superviseur","km",null,{"$f":"+F142","v":8},null,null,null,{"$f":"+J142","v":0},0,0,0,0,0,0,0,0]
[null,null,"    - (Montant de transport attribué à la PCMA)","km-pers.",null,{"$f":"+F144","v":2.0512820512820515},null,null,null,{"$f":"+J144","v":0},0,0,0,0,0,0,0,0]
[null,null," - Matériel de supervision","outils",null,{"$f":"+F145","v":4},null,null,null,{"$f":"+J145","v":0},0,0,0,0,0,0,0,0]
[null,null,null," "]
[]
[]
[]
[]
[]
[]
[]
[]
[]
[]
[]
[null,null,null,null,null,"Zone 1",null,null,null,"Zone 2","Zone 3","Zone 4","Zone 5","Zone 6","Zone 7","Zone 8","Zone 9","Zone 10"]
["Haut de page",null,"CALCULS",null,null,{"$f":"+IF('D2 Echelle'!$C$31=\"\",\"\",'D2 Echelle'!$C$31)","v":"Ashiedu Keteke"},null,null,null,{"$f":"+IF('D2 Echelle'!$C$36=\"\",\"\",'D2 Echelle'!$C$36)","v":""},{"$f":"+IF('D2 Echelle'!$C$41=\"\",\"\",'D2 Echelle'!$C$41)","v":""},{"$f":"+IF('D2 Echelle'!$C$46=\"\",\"\",'D2 Echelle'!$C$46)","v":""},{"$f":"+IF('D2 Echelle'!$C$51=\"\",\"\",'D2 Echelle'!$C$51)","v":""},{"$f":"+IF('D2 Echelle'!$C$56=\"\",\"\",'D2 Echelle'!$C$56)","v":""},{"$f":"+IF('D2 Echelle'!$C$61=\"\",\"\",'D2 Echelle'!$C$61)","v":""},{"$f":"+IF('D2 Echelle'!$C$66=\"\",\"\",'D2 Echelle'!$C$66)","v":""},{"$f":"+IF('D2 Echelle'!$C$71=\"\",\"\",'D2 Echelle'!$C$71)","v":""},{"$f":"+IF('D2 Echelle'!$C$76=\"\",\"\",'D2 Echelle'!$C$76)","v":""}]
[null,null,"Variables","Unités","Commentaires",{"$f":"+IF('D2 Echelle'!$D$31=\"\",\"\",'D2 Echelle'!$D$31)","v":"Greater Accra"},null,null,null,{"$f":"+IF('D2 Echelle'!$D$36=\"\",\"\",'D2 Echelle'!$D$36)","v":""},{"$f":"+IF('D2 Echelle'!$D$41=\"\",\"\",'D2 Echelle'!$D$41)","v":""},{"$f":"+IF('D2 Echelle'!$D$46=\"\",\"\",'D2 Echelle'!$D$46)","v":""},{"$f":"+IF('D2 Echelle'!$D$51=\"\",\"\",'D2 Echelle'!$D$51)","v":""},{"$f":"+IF('D2 Echelle'!$D$56=\"\",\"\",'D2 Echelle'!$D$56)","v":""},{"$f":"+IF('D2 Echelle'!$D$61=\"\",\"\",'D2 Echelle'!$D$61)","v":""},{"$f":"+IF('D2 Echelle'!$D$66=\"\",\"\",'D2 Echelle'!$D$66)","v":""},{"$f":"+IF('D2 Echelle'!$D$71=\"\",\"\",'D2 Echelle'!$D$71)","v":""},{"$f":"+IF('D2 Echelle'!$D$76=\"\",\"\",'D2 Echelle'!$D$76)","v":""}]
[null,null,"Supervision des sites PEC MAS ambulatoire et hospitalière"]
[null,null,"Drivers de base, données brutes"]
[null,null,"Nombre de nouveaux sites PEC MAS ambulatoire","sites","Feuille de calcul D9",{"$f":"+'D9 Variables temps'!F30","v":0},null,null,null,{"$f":"+'D9 Variables temps'!J30","v":0},{"$f":"+'D9 Variables temps'!K30","v":0},{"$f":"+'D9 Variables temps'!L30","v":0},{"$f":"+'D9 Variables temps'!M30","v":0},{"$f":"+'D9 Variables temps'!N30","v":0},{"$f":"+'D9 Variables temps'!O30","v":0},{"$f":"+'D9 Variables temps'!P30","v":0},{"$f":"+'D9 Variables temps'!Q30","v":0},{"$f":"+'D9 Variables temps'!R30","v":0}]
[null,null,"Nombre de sites établis PEC MAS ambulatoire","sites","Feuille de calcul D9",{"$f":"+'D9 Variables temps'!F31","v":2},null,null,null,{"$f":"+'D9 Variables temps'!J31","v":0},{"$f":"+'D9 Variables temps'!K31","v":0},{"$f":"+'D9 Variables temps'!L31","v":0},{"$f":"+'D9 Variables temps'!M31","v":0},{"$f":"+'D9 Variables temps'!N31","v":0},{"$f":"+'D9 Variables temps'!O31","v":0},{"$f":"+'D9 Variables temps'!P31","v":0},{"$f":"+'D9 Variables temps'!Q31","v":0},{"$f":"+'D9 Variables temps'!R31","v":0}]
[null,null,"Nombre de nouveaux sites PEC MAS hospitalière","sites","Feuille de calcul D9",{"$f":"+'D9 Variables temps'!F33","v":0},null,null,null,{"$f":"+'D9 Variables temps'!J33","v":0},{"$f":"+'D9 Variables temps'!K33","v":0},{"$f":"+'D9 Variables temps'!L33","v":0},{"$f":"+'D9 Variables temps'!M33","v":0},{"$f":"+'D9 Variables temps'!N33","v":0},{"$f":"+'D9 Variables temps'!O33","v":0},{"$f":"+'D9 Variables temps'!P33","v":0},{"$f":"+'D9 Variables temps'!Q33","v":0},{"$f":"+'D9 Variables temps'!R33","v":0}]
[null,null,"Nombre de sites établis PEC MAS hospitalière","sites","Feuille de calcul D9",{"$f":"+'D9 Variables temps'!F34","v":1},null,null,null,{"$f":"+'D9 Variables temps'!J34","v":0},{"$f":"+'D9 Variables temps'!K34","v":0},{"$f":"+'D9 Variables temps'!L34","v":0},{"$f":"+'D9 Variables temps'!M34","v":0},{"$f":"+'D9 Variables temps'!N34","v":0},{"$f":"+'D9 Variables temps'!O34","v":0},{"$f":"+'D9 Variables temps'!P34","v":0},{"$f":"+'D9 Variables temps'!Q34","v":0},{"$f":"+'D9 Variables temps'!R34","v":0}]
[null,null,"Nombre de visites de supervision du siège de la zone par an pour chaque nouveau site PEC MAS ambulatoire ou site PEC MAS hospitalière","visites","Feuille de calcul D3",{"$f":"+'D3 Données épi. démo'!F186","v":20},null,null,null,{"$f":"+'D3 Données épi. démo'!J186","v":20},{"$f":"+'D3 Données épi. démo'!K186","v":20},{"$f":"+'D3 Données épi. démo'!L186","v":20},{"$f":"+'D3 Données épi. démo'!M186","v":20},{"$f":"+'D3 Données épi. démo'!N186","v":20},{"$f":"+'D3 Données épi. démo'!O186","v":20},{"$f":"+'D3 Données épi. démo'!P186","v":20},{"$f":"+'D3 Données épi. démo'!Q186","v":20},{"$f":"+'D3 Données épi. démo'!R186","v":20}]
[null,null,"Nombre de visites de supervision du siège de la zone par an pour chaque site établi PEC MAS ambulatoire ou site PEC MAS hospitalière","visites","Feuille de calcul D3",{"$f":"+'D3 Données épi. démo'!F187","v":12},null,null,null,{"$f":"+'D3 Données épi. démo'!J187","v":12},{"$f":"+'D3 Données épi. démo'!K187","v":12},{"$f":"+'D3 Données épi. démo'!L187","v":12},{"$f":"+'D3 Données épi. démo'!M187","v":12},{"$f":"+'D3 Données épi. démo'!N187","v":12},{"$f":"+'D3 Données épi. démo'!O187","v":12},{"$f":"+'D3 Données épi. démo'!P187","v":12},{"$f":"+'D3 Données épi. démo'!Q187","v":12},{"$f":"+'D3 Données épi. démo'!R187","v":12}]
[null,null,"Temps passé par le superviseur pour chaque visite de supervision à chaque nouveau site PEC MAS ambulatoire ou site PEC MAS hospitalière","heures","Feuille de calcul D3",{"$f":"+'D3 Données épi. démo'!F188","v":2},null,null,null,{"$f":"+'D3 Données épi. démo'!J188","v":2},{"$f":"+'D3 Données épi. démo'!K188","v":2},{"$f":"+'D3 Données épi. démo'!L188","v":2},{"$f":"+'D3 Données épi. démo'!M188","v":2},{"$f":"+'D3 Données épi. démo'!N188","v":2},{"$f":"+'D3 Données épi. démo'!O188","v":2},{"$f":"+'D3 Données épi. démo'!P188","v":2},{"$f":"+'D3 Données épi. démo'!Q188","v":2},{"$f":"+'D3 Données épi. démo'!R188","v":2}]
[null,null,"Temps passé par le superviseur pour chaque visite de supervision à chaque site établi PEC MAS ambulatoire ou site PEC MAS hospitalière","heures","Feuille de calcul D3",{"$f":"+'D3 Données épi. démo'!F189","v":2},null,null,null,{"$f":"+'D3 Données épi. démo'!J189","v":2},{"$f":"+'D3 Données épi. démo'!K189","v":2},{"$f":"+'D3 Données épi. démo'!L189","v":2},{"$f":"+'D3 Données épi. démo'!M189","v":2},{"$f":"+'D3 Données épi. démo'!N189","v":2},{"$f":"+'D3 Données épi. démo'!O189","v":2},{"$f":"+'D3 Données épi. démo'!P189","v":2},{"$f":"+'D3 Données épi. démo'!Q189","v":2},{"$f":"+'D3 Données épi. démo'!R189","v":2}]
[null,null,"Temps passé à la supervision interne par l'agent de santé senior à chaque site PEC MAS ambulatoire ou site PEC MAS hospitalière par semaine","heures","Feuille de calcul D3",{"$f":"+'D3 Données épi. démo'!F190","v":1},null,null,null,{"$f":"+'D3 Données épi. démo'!J190","v":1},{"$f":"+'D3 Données épi. démo'!K190","v":1},{"$f":"+'D3 Données épi. démo'!L190","v":1},{"$f":"+'D3 Données épi. démo'!M190","v":1},{"$f":"+'D3 Données épi. démo'!N190","v":1},{"$f":"+'D3 Données épi. démo'!O190","v":1},{"$f":"+'D3 Données épi. démo'!P190","v":1},{"$f":"+'D3 Données épi. démo'!Q190","v":1},{"$f":"+'D3 Données épi. démo'!R190","v":1}]
[null,null,"Distance moyenne aux sites PEC MAS ambulatoire du siège de la zone","km","Feuille de calcul D3",{"$f":"+'D3 Données épi. démo'!F123","v":5},null,null,null,{"$f":"+'D3 Données épi. démo'!J123","v":0},{"$f":"+'D3 Données épi. démo'!K123","v":0},{"$f":"+'D3 Données épi. démo'!L123","v":0},{"$f":"+'D3 Données épi. démo'!M123","v":0},{"$f":"+'D3 Données épi. démo'!N123","v":0},{"$f":"+'D3 Données épi. démo'!O123","v":0},{"$f":"+'D3 Données épi. démo'!P123","v":0},{"$f":"+'D3 Données épi. démo'!Q123","v":0},{"$f":"+'D3 Données épi. démo'!R123","v":0}]
[null,null,"Distance moyenne au site PEC MAS hospitalière du siège de la zone","km","Feuille de calcul D3",{"$f":"+'D3 Données épi. démo'!F125","v":5},null,null,null,{"$f":"+'D3 Données épi. démo'!J125","v":0},{"$f":"+'D3 Données épi. démo'!K125","v":0},{"$f":"+'D3 Données épi. démo'!L125","v":0},{"$f":"+'D3 Données épi. démo'!M125","v":0},{"$f":"+'D3 Données épi. démo'!N125","v":0},{"$f":"+'D3 Données épi. démo'!O125","v":0},{"$f":"+'D3 Données épi. démo'!P125","v":0},{"$f":"+'D3 Données épi. démo'!Q125","v":0},{"$f":"+'D3 Données épi. démo'!R125","v":0}]
[null,null,"Temps moyen pour arriver aux sites PEC MAS ambulatoire à partir du siège de la zone","heures","Feuille de calcul D3",{"$f":"+'D3 Données épi. démo'!F124","v":0.25},null,null,null,{"$f":"+'D3 Données épi. démo'!J124","v":0},{"$f":"+'D3 Données épi. démo'!K124","v":0},{"$f":"+'D3 Données épi. démo'!L124","v":0},{"$f":"+'D3 Données épi. démo'!M124","v":0},{"$f":"+'D3 Données épi. démo'!N124","v":0},{"$f":"+'D3 Données épi. démo'!O124","v":0},{"$f":"+'D3 Données épi. démo'!P124","v":0},{"$f":"+'D3 Données épi. démo'!Q124","v":0},{"$f":"+'D3 Données épi. démo'!R124","v":0}]
[null,null,"Temps moyen pour arriver au site PEC MAS hospitalière à partir du siège de la zone","heures","Feuille de calcul D3",{"$f":"+'D3 Données épi. démo'!F126","v":0.25},null,null,null,{"$f":"+'D3 Données épi. démo'!J126","v":0},{"$f":"+'D3 Données épi. démo'!K126","v":0},{"$f":"+'D3 Données épi. démo'!L126","v":0},{"$f":"+'D3 Données épi. démo'!M126","v":0},{"$f":"+'D3 Données épi. démo'!N126","v":0},{"$f":"+'D3 Données épi. démo'!O126","v":0},{"$f":"+'D3 Données épi. démo'!P126","v":0},{"$f":"+'D3 Données épi. démo'!Q126","v":0},{"$f":"+'D3 Données épi. démo'!R126","v":0}]
[null,null,"Heures dans une journée de travail","heures",null,{"$f":"+'D3 Données épi. démo'!F35","v":8},null,null,null,{"$f":"+'D3 Données épi. démo'!J35","v":8},{"$f":"+'D3 Données épi. démo'!K35","v":8},{"$f":"+'D3 Données épi. démo'!L35","v":8},{"$f":"+'D3 Données épi. démo'!M35","v":8},{"$f":"+'D3 Données épi. démo'!N35","v":8},{"$f":"+'D3 Données épi. démo'!O35","v":8},{"$f":"+'D3 Données épi. démo'!P35","v":8},{"$f":"+'D3 Données épi. démo'!Q35","v":8},{"$f":"+'D3 Données épi. démo'!R35","v":8}]
[null,null,"CALCULS"]
[null,null,"Nombre de visites de supervision externe :\n                                              - nouveaux sites PEC MAS ambulatoire par an","visites",null,{"$f":"+F68*F72","v":0},null,null,null,{"$f":"+J68*J72","v":0},0,0,0,0,0,0,0,0]
[null,null," - sites PEC MAS ambulatoire établis par an","visites",null,{"$f":"+F69*F73","v":24},null,null,null,{"$f":"+J69*J73","v":0},0,0,0,0,0,0,0,0]
[null,null," - nouveaux sites PEC MAS hospitalière par an","visites",null,{"$f":"+F70*F72","v":0},null,null,null,{"$f":"+J70*J72","v":0},0,0,0,0,0,0,0,0]
[null,null," - site établi PEC MAS hospitalière par an",null,null,{"$f":"+F71*F73","v":12},null,null,null,{"$f":"+J71*J73","v":0},0,0,0,0,0,0,0,0]
[null,null,"Temps pour la supervision externe de : \n                                              -  nouveaux sites PEC MAS ambulatoire par an","heures",null,{"$f":"+F74*F83","v":0},null,null,null,{"$f":"+J74*J83","v":0},0,0,0,0,0,0,0,0]
[null,null," - site établi PEC MAS ambulatoire par an","heures",null,{"$f":"+F75*F84","v":48},null,null,null,{"$f":"+J75*J84","v":0},0,0,0,0,0,0,0,0]
[null,null," - nouveau site PEC MAS hospitalière par an","heures",null,{"$f":"+F74*F85","v":0},null,null,null,{"$f":"+J74*J85","v":0},0,0,0,0,0,0,0,0]
[null,null," - site établi PEC MAS hospitalière par an","heures",null,{"$f":"+F75*F86","v":24},null,null,null,{"$f":"+J75*J86","v":0},0,0,0,0,0,0,0,0]
[null,null,"Temps passé aux déplacements du/au: \n                                              - nouveaux sites PEC MAS ambulatoire par an","heures",null,{"$f":"2*F83*F79","v":0},null,null,null,{"$f":"2*J83*J79","v":0},0,0,0,0,0,0,0,0]
[null,null," - site établi PEC MAS ambulatoire par an","heures",null,{"$f":"+F84*2*F79","v":12},null,null,null,{"$f":"+J84*2*J79","v":0},0,0,0,0,0,0,0,0]
[null,null," -  nouveau site PEC MAS hospitalière par an","heures",null,{"$f":"+F85*2*F80","v":0},null,null,null,{"$f":"+J85*2*J80","v":0},0,0,0,0,0,0,0,0]
[null,null," - site établi PEC MAS hospitalière par an","heures",null,{"$f":"+F86*2*F80","v":6},null,null,null,{"$f":"+J86*2*J80","v":0},0,0,0,0,0,0,0,0]
[null,null,"Distance parcourue pour la supervision des:  \n                                             - nouveaux sites PEC MAS ambulatoire par an","km ",null,{"$f":"+F83*2*F77","v":0},null,null,null,{"$f":"+J83*2*J77","v":0},0,0,0,0,0,0,0,0]
[null,null," - site établis PEC MAS ambulatoire par an","km ",null,{"$f":"+F84*2*F77","v":240},null,null,null,{"$f":"+J84*2*J77","v":0},0,0,0,0,0,0,0,0]
[null,null," - nouveaux sites PEC MAS ambulatoire par an","km ",null,{"$f":"+F85*2*F78","v":0},null,null,null,{"$f":"+J85*2*J78","v":0},0,0,0,0,0,0,0,0]
[null,null," - sites établis PEC MAS hospitalière par an","km ",null,{"$f":"+F86*2*F78","v":120},null,null,null,{"$f":"+J86*2*J78","v":0},0,0,0,0,0,0,0,0]
[null,null,"% de km de supervision alloués à la PCMA : \n                                               - nouveaux sites PEC MAS ambulatoire par an","%","Nombre d'heures de supervision / (Nombre d'heures dans une journée de travail -temps de déplacement) * 100",{"$f":"+F74/(F81-2*F79)*100","v":26.666666666666668},null,null,null,{"$f":"+J74/(J81-2*J79)*100","v":25},25,25,25,25,25,25,25,25]
[null,null," - sites établis PEC MAS ambulatoire par an","%",null,{"$f":"+F75/(F81-2*F79)*100","v":26.666666666666668},null,null,null,{"$f":"+J75/(J81-2*J79)*100","v":25},25,25,25,25,25,25,25,25]
[null,null," - nouveaux sites PEC MAS hospitalière par an","%",null,{"$f":"+F74/(F81-2*F80)*100","v":26.666666666666668},null,null,null,{"$f":"+J74/(J81-2*J80)*100","v":25},25,25,25,25,25,25,25,25]
[null,null," - sites établis PEC MAS hospitalière par an","%",null,{"$f":"+F75/(F81-2*F80)*100","v":26.666666666666668},null,null,null,{"$f":"+J75/(J81-2*J80)*100","v":25},25,25,25,25,25,25,25,25]
[null,null,"Temps passé à la supervision interne par l'agent de santé senior à tous les sites PEC MAS ambulatoire ou sites PEC MAS hospitalière par an","jours",null,{"$f":"+(F68+F69+F70+F71)*F76*52/F81","v":19.5},null,null,null,{"$f":"+(J68+J69+J70+J71)*J76*52/J81","v":0},0,0,0,0,0,0,0,0]
[null,null,"Temps total passé en voyage et en supervision externe par an","jours",null,{"$f":"+SUM(F87:F94)/F81","v":11.25},null,null,null,{"$f":"+SUM(J87:J94)/J81","v":0},0,0,0,0,0,0,0,0]
[null,null,"Distance totale parcourue pour la supervision de tous les sites par an","km ",null,{"$f":"+F95 +F97+F96+F98","v":360},null,null,null,{"$f":"+J95 +J97+J96+J98","v":0},0,0,0,0,0,0,0,0]
[null,null,"Distance attribuée à la supervision de la PCMA à tous les sites par an","km ",null,{"$f":"+(F95*F99+F96*F100+F97*F101+F98*F102)/100","v":96},null,null,null,{"$f":"+(J95*J99+J96*J100+J97*J101+J98*J102)/100","v":0},0,0,0,0,0,0,0,0]
[null,null,"Nombre de listes de pointage pour la supervision par an (supervision externe)","jeux",null,{"$f":"+F83+F84+F85+F86","v":36},null,null,null,{"$f":"+J83+J84+J85+J86","v":0},0,0,0,0,0,0,0,0]
[null,null,"Supervision des AEC"]
[null,null,"Drivers de base, données brutes"]
[null,null,"Nombre de nouveaux AEC","AEC","Feuille de calcul (R12)",{"$f":"+'R12 Formation'!F166+'R12 Formation'!F169","v":100},null,null,null,{"$f":"+'R12 Formation'!J166+'R12 Formation'!J169","v":0},{"$f":"+'R12 Formation'!K166+'R12 Formation'!K169","v":0},{"$f":"+'R12 Formation'!L166+'R12 Formation'!L169","v":0},{"$f":"+'R12 Formation'!M166+'R12 Formation'!M169","v":0},{"$f":"+'R12 Formation'!N166+'R12 Formation'!N169","v":0},{"$f":"+'R12 Formation'!O166+'R12 Formation'!O169","v":0},{"$f":"+'R12 Formation'!P166+'R12 Formation'!P169","v":0},{"$f":"+'R12 Formation'!Q166+'R12 Formation'!Q169","v":0},{"$f":"+'R12 Formation'!R166+'R12 Formation'!R169","v":0}]
[null,null,"Nombre d'AEC établis ","AEC","Feuille de calcul (R12)",{"$f":"+'R12 Formation'!F162","v":0},null,null,null,{"$f":"+'R12 Formation'!J162","v":0},{"$f":"+'R12 Formation'!K162","v":0},{"$f":"+'R12 Formation'!L162","v":0},{"$f":"+'R12 Formation'!M162","v":0},{"$f":"+'R12 Formation'!N162","v":0},{"$f":"+'R12 Formation'!O162","v":0},{"$f":"+'R12 Formation'!P162","v":0},{"$f":"+'R12 Formation'!Q162","v":0},{"$f":"+'R12 Formation'!R162","v":0}]
[null,null,"Nombre de visites de supervisions par an pour chaque nouveau AEC ","visites","Feuille de calcul D3",{"$f":"+'D3 Données épi. démo'!F191","v":12},null,null,null,{"$f":"+'D3 Données épi. démo'!J191","v":12},{"$f":"+'D3 Données épi. démo'!K191","v":12},{"$f":"+'D3 Données épi. démo'!L191","v":12},{"$f":"+'D3 Données épi. démo'!M191","v":12},{"$f":"+'D3 Données épi. démo'!N191","v":12},{"$f":"+'D3 Données épi. démo'!O191","v":12},{"$f":"+'D3 Données épi. démo'!P191","v":12},{"$f":"+'D3 Données épi. démo'!Q191","v":12},{"$f":"+'D3 Données épi. démo'!R191","v":12}]
[null,null,"Nombre de visites de supervision par an pour chaque AEC établi","visites","Feuille de calcul D3",{"$f":"+'D3 Données épi. démo'!F192","v":4},null,null,null,{"$f":"+'D3 Données épi. démo'!J192","v":4},{"$f":"+'D3 Données épi. démo'!K192","v":4},{"$f":"+'D3 Données épi. démo'!L192","v":4},{"$f":"+'D3 Données épi. démo'!M192","v":4},{"$f":"+'D3 Données épi. démo'!N192","v":4},{"$f":"+'D3 Données épi. démo'!O192","v":4},{"$f":"+'D3 Données épi. démo'!P192","v":4},{"$f":"+'D3 Données épi. démo'!Q192","v":4},{"$f":"+'D3 Données épi. démo'!R192","v":4}]
[null,null,"Temps passé par le superviseur pour chaque visite de supervision d'un nouvel AEC ","heures","Feuille de calcul D3",{"$f":"+'D3 Données épi. démo'!F193","v":2},null,null,null,{"$f":"+'D3 Données épi. démo'!J193","v":2},{"$f":"+'D3 Données épi. démo'!K193","v":2},{"$f":"+'D3 Données épi. démo'!L193","v":2},{"$f":"+'D3 Données épi. démo'!M193","v":2},{"$f":"+'D3 Données épi. démo'!N193","v":2},{"$f":"+'D3 Données épi. démo'!O193","v":2},{"$f":"+'D3 Données épi. démo'!P193","v":2},{"$f":"+'D3 Données épi. démo'!Q193","v":2},{"$f":"+'D3 Données épi. démo'!R193","v":2}]
[null,null,"Temps passé par le superviseur pour chaque visite de supervision d'un AEC établi","heures","Feuille de calcul D3",{"$f":"+'D3 Données épi. démo'!F194","v":2},null,null,null,{"$f":"+'D3 Données épi. démo'!J194","v":2},{"$f":"+'D3 Données épi. démo'!K194","v":2},{"$f":"+'D3 Données épi. démo'!L194","v":2},{"$f":"+'D3 Données épi. démo'!M194","v":2},{"$f":"+'D3 Données épi. démo'!N194","v":2},{"$f":"+'D3 Données épi. démo'!O194","v":2},{"$f":"+'D3 Données épi. démo'!P194","v":2},{"$f":"+'D3 Données épi. démo'!Q194","v":2},{"$f":"+'D3 Données épi. démo'!R194","v":2}]
[null,null,"Distance moyenne au site PEC MAS ambulatoire des villages de l'AEC ","km","Feuille de calcul D3",{"$f":"+'D3 Données épi. démo'!F131","v":3},null,null,null,{"$f":"+'D3 Données épi. démo'!J131","v":0},{"$f":"+'D3 Données épi. démo'!K131","v":0},{"$f":"+'D3 Données épi. démo'!L131","v":0},{"$f":"+'D3 Données épi. démo'!M131","v":0},{"$f":"+'D3 Données épi. démo'!N131","v":0},{"$f":"+'D3 Données épi. démo'!O131","v":0},{"$f":"+'D3 Données épi. démo'!P131","v":0},{"$f":"+'D3 Données épi. démo'!Q131","v":0},{"$f":"+'D3 Données épi. démo'!R131","v":0}]
[null,null,"Temps moyen pour atteindre le village de l'AEC du site PEC MAS ambulatoire ","heures","Feuille de calcul D3",{"$f":"+'D3 Données épi. démo'!F132","v":0.25},null,null,null,{"$f":"+'D3 Données épi. démo'!J132","v":0},{"$f":"+'D3 Données épi. démo'!K132","v":0},{"$f":"+'D3 Données épi. démo'!L132","v":0},{"$f":"+'D3 Données épi. démo'!M132","v":0},{"$f":"+'D3 Données épi. démo'!N132","v":0},{"$f":"+'D3 Données épi. démo'!O132","v":0},{"$f":"+'D3 Données épi. démo'!P132","v":0},{"$f":"+'D3 Données épi. démo'!Q132","v":0},{"$f":"+'D3 Données épi. démo'!R132","v":0}]
[null,null,{"$f":"+'D3 Données épi. démo'!C77","v":"Est-ce que ceux qui font l'extension communautaire (agent d'extension communautaire [AEC]) font partie du personnel rémunéré (agent de santé communautaire [ASC])ou sont-ils des volontaires ?"},null,null,{"$f":"+'D3 Données épi. démo'!F77","v":"Volontaire"},null,null,null,{"$f":"+'D3 Données épi. démo'!J77","v":0},{"$f":"+'D3 Données épi. démo'!K77","v":0},{"$f":"+'D3 Données épi. démo'!L77","v":0},{"$f":"+'D3 Données épi. démo'!M77","v":0},{"$f":"+'D3 Données épi. démo'!N77","v":0},{"$f":"+'D3 Données épi. démo'!O77","v":0},{"$f":"+'D3 Données épi. démo'!P77","v":0},{"$f":"+'D3 Données épi. démo'!Q77","v":0},{"$f":"+'D3 Données épi. démo'!R77","v":0}]
[null,null,"CALCULS"]
[null,null,"Nombre de visites de supervision aux nouveaux AEC par an","visites",null,{"$f":"+F110*F112","v":1200},null,null,null,{"$f":"+J110*J112","v":0},0,0,0,0,0,0,0,0]
[null,null,"Nombre de visites de supervision aux AEC établis par an","jours",null,{"$f":"+F111*F113","v":0},null,null,null,{"$f":"+J111*J113","v":0},0,0,0,0,0,0,0,0]
[null,null,"Nombre de heures de supervision de tous les nouveaux AEC par an","heures",null,{"$f":"+F120*F114","v":2400},null,null,null,{"$f":"+J120*J114","v":0},0,0,0,0,0,0,0,0]
[null,null,"Nombre d'heures de supervision des AEC établis","heures",null,{"$f":"+F121*F115","v":0},null,null,null,{"$f":"+J121*J115","v":0},0,0,0,0,0,0,0,0]
[null,null,"Nombre d'heures de déplacement pour les supervisions des AEC ","heures",null,{"$f":"+(F120+F121)*F117*2","v":600},null,null,null,{"$f":"+(J120+J121)*J117*2","v":0},0,0,0,0,0,0,0,0]
[null,null,"Temps total des superviseurs de la PEC MAS ambulatoire pour la supervision des AEC ","jours",null,{"$f":"+(F122+F123+F124)/8","v":375},null,null,null,{"$f":"+(J122+J123+J124)/8","v":0},0,0,0,0,0,0,0,0]
[null,null,"Distance par le personnel de la PEC MAS ambulatoire pour la supervision des AEC ","km",null,{"$f":"+(F116*2*(F120+F121))","v":7200},null,null,null,{"$f":"+(J116*2*(J120+J121))","v":0},0,0,0,0,0,0,0,0]
[null,null,"Supervision des listes de pointage des AEC ","jeux",null,{"$f":"+(F120+F121)","v":1200},null,null,null,{"$f":"+(J120+J121)","v":0},0,0,0,0,0,0,0,0]
[null,null,"Supervision du siège de la zone"]
[null,null,"Drivers de base, données brutes"]
[null,null,"La PCMA est-elle nouvelle dans cette zone ou existe-t-il déjà une activité établie ?",null,"Feuille de calcul D9",{"$f":"+'D9 Variables temps'!F46","v":"établie"},null,null,null,{"$f":"+'D9 Variables temps'!J46","v":"inactive"},{"$f":"+'D9 Variables temps'!K46","v":"inactive"},{"$f":"+'D9 Variables temps'!L46","v":"inactive"},{"$f":"+'D9 Variables temps'!M46","v":"inactive"},{"$f":"+'D9 Variables temps'!N46","v":"inactive"},{"$f":"+'D9 Variables temps'!O46","v":"inactive"},{"$f":"+'D9 Variables temps'!P46","v":"inactive"},{"$f":"+'D9 Variables temps'!Q46","v":"inactive"},{"$f":"+'D9 Variables temps'!R46","v":"inactive"}]
[null,null,"Nombre de visites de supervision du siège du groupe-zones à chaque siège de zone établi par an","visites","Feuille de calcul D3",{"$f":"+'D3 Données épi. démo'!F195","v":12},null,null,null,{"$f":"+'D3 Données épi. démo'!J195","v":12},{"$f":"+'D3 Données épi. démo'!K195","v":12},{"$f":"+'D3 Données épi. démo'!L195","v":12},{"$f":"+'D3 Données épi. démo'!M195","v":12},{"$f":"+'D3 Données épi. démo'!N195","v":12},{"$f":"+'D3 Données épi. démo'!O195","v":12},{"$f":"+'D3 Données épi. démo'!P195","v":12},{"$f":"+'D3 Données épi. démo'!Q195","v":12},{"$f":"+'D3 Données épi. démo'!R195","v":12}]
[null,null,"Nombre de visites de supervision du siège du groupe-zones à chaque nouveau siège de zone  par an","visites","Feuille de calcul D3",{"$f":"+'D3 Données épi. démo'!F196","v":4},null,null,null,{"$f":"+'D3 Données épi. démo'!J196","v":4},{"$f":"+'D3 Données épi. démo'!K196","v":4},{"$f":"+'D3 Données épi. démo'!L196","v":4},{"$f":"+'D3 Données épi. démo'!M196","v":4},{"$f":"+'D3 Données épi. démo'!N196","v":4},{"$f":"+'D3 Données épi. démo'!O196","v":4},{"$f":"+'D3 Données épi. démo'!P196","v":4},{"$f":"+'D3 Données épi. démo'!Q196","v":4},{"$f":"+'D3 Données épi. démo'!R196","v":4}]
[null,null,"Temps passé par le superviseur du groupe-zones pour chaque visite de supervision à un nouveau siège de zone","heures","Feuille de calcul D3",{"$f":"+'D3 Données épi. démo'!F197","v":4},null,null,null,{"$f":"+'D3 Données épi. démo'!J197","v":4},{"$f":"+'D3 Données épi. démo'!K197","v":4},{"$f":"+'D3 Données épi. démo'!L197","v":4},{"$f":"+'D3 Données épi. démo'!M197","v":4},{"$f":"+'D3 Données épi. démo'!N197","v":4},{"$f":"+'D3 Données épi. démo'!O197","v":4},{"$f":"+'D3 Données épi. démo'!P197","v":4},{"$f":"+'D3 Données épi. démo'!Q197","v":4},{"$f":"+'D3 Données épi. démo'!R197","v":4}]
[null,null,"Temps passé par le superviseur du groupe-zones pour chaque visite de supervision à un siège de zone établi","heures","Feuille de calcul D3",{"$f":"+'D3 Données épi. démo'!F198","v":2},null,null,null,{"$f":"+'D3 Données épi. démo'!J198","v":2},{"$f":"+'D3 Données épi. démo'!K198","v":2},{"$f":"+'D3 Données épi. démo'!L198","v":2},{"$f":"+'D3 Données épi. démo'!M198","v":2},{"$f":"+'D3 Données épi. démo'!N198","v":2},{"$f":"+'D3 Données épi. démo'!O198","v":2},{"$f":"+'D3 Données épi. démo'!P198","v":2},{"$f":"+'D3 Données épi. démo'!Q198","v":2},{"$f":"+'D3 Données épi. démo'!R198","v":2}]
[null,null,"Distance entre le siège de zone et le siège du groupe-zones","km","Feuille de calcul D3",{"$f":"+'D3 Données épi. démo'!F127","v":1},null,null,null,{"$f":"+'D3 Données épi. démo'!J127","v":0},{"$f":"+'D3 Données épi. démo'!K127","v":0},{"$f":"+'D3 Données épi. démo'!L127","v":0},{"$f":"+'D3 Données épi. démo'!M127","v":0},{"$f":"+'D3 Données épi. démo'!N127","v":0},{"$f":"+'D3 Données épi. démo'!O127","v":0},{"$f":"+'D3 Données épi. démo'!P127","v":0},{"$f":"+'D3 Données épi. démo'!Q127","v":0},{"$f":"+'D3 Données épi. démo'!R127","v":0}]
[null,null,"Temps pour arriver au siège de zone à partir du siège du groupe-zones","heures","Feuille de calcul D3",{"$f":"+'D3 Données épi. démo'!F128","v":0.1},null,null,null,{"$f":"+'D3 Données épi. démo'!J128","v":0},{"$f":"+'D3 Données épi. démo'!K128","v":0},{"$f":"+'D3 Données épi. démo'!L128","v":0},{"$f":"+'D3 Données épi. démo'!M128","v":0},{"$f":"+'D3 Données épi. démo'!N128","v":0},{"$f":"+'D3 Données épi. démo'!O128","v":0},{"$f":"+'D3 Données épi. démo'!P128","v":0},{"$f":"+'D3 Données épi. démo'!Q128","v":0},{"$f":"+'D3 Données épi. démo'!R128","v":0}]
[null,null,"CALCULS"]
[null,null,"Nombre de visites de supervision au siège de zone","visites","Coût du superviseur du groupe-zones (niveau intermédiaire) pour le siège de la zone",{"$f":"+IF(F130=\"établie\",F132,IF(F130=\"nouvelle\",F131,0))","v":4},null,null,null,{"$f":"+IF(J130=\"établie\",J132,IF(J130=\"nouvelle\",J131,0))","v":0},0,0,0,0,0,0,0,0]
[null,null,"Heures de supervision du siège de la zone","heures",null,{"$f":"+IF(F130=\"établie\",F132*F134,IF(F130=\"nouvelle\",F131*F133,0))","v":8},null,null,null,{"$f":"+IF(J130=\"établie\",J132*J134,IF(J130=\"nouvelle\",J131*J133,0))","v":0},0,0,0,0,0,0,0,0]
[null,null,"Heures de voyage pour se rendre au siège de la zone et revenir","heures",null,{"$f":"+F138*F136*2","v":0.8},null,null,null,{"$f":"+J138*J136*2","v":0},0,0,0,0,0,0,0,0]
[null,null,"Temps total du superviseur du groupe-zones pour la supervision du siège de la zone","jours",null,{"$f":"+(F140+F139)/F81","v":1.1000000000000001},null,null,null,{"$f":"+(J140+J139)/J81","v":0},0,0,0,0,0,0,0,0]
[null,null,"Distance parcourue par le superviseur du groupe-zones pour la supervision du siège de zone","km",null,{"$f":"2*F135*F138","v":8},null,null,null,{"$f":"2*J135*J138","v":0},0,0,0,0,0,0,0,0]
[null,null,"% des km de supervision attribués à la PCMA","%",null,{"$f":"+IF(F81-2*F136<=0,100,IF(F138=0,0,F139/F138/(F81-2*F136)*100))","v":25.641025641025646},null,null,null,{"$f":"+IF(J81-2*J136<=0,100,IF(J138=0,0,J139/J138/(J81-2*J136)*100))","v":0},0,0,0,0,0,0,0,0]
[null,null,"Distance attribuée à la supervision de la PCMA par an","km",null,{"$f":"+F142*F143/100","v":2.0512820512820515},null,null,null,{"$f":"+J142*J143/100","v":0},0,0,0,0,0,0,0,0]
[null,null,"Supervision des  listes de pointage du siège de la zone ",null,null,{"$f":"+F138","v":4},null,null,null,{"$f":"+J138","v":0},0,0,0,0,0,0,0,0]
[null,null,"Prix"]
[null,null,"Coût du superviseur du groupe-zones (niveau intermédiaire) du siège de la zone",{"$f":"+'D1 Données générales'!$H$13","v":"Cedi"},"Feuille de calcul D5",{"$f":"+'D5 Salaires'!J25","v":36.92307692307692},null,null,null,{"$f":"+$F$147*'D4 Prix'!J81","v":0},{"$f":"+$F$147*'D4 Prix'!K81","v":0},{"$f":"+$F$147*'D4 Prix'!L81","v":0},{"$f":"+$F$147*'D4 Prix'!M81","v":0},{"$f":"+$F$147*'D4 Prix'!N81","v":0},{"$f":"+$F$147*'D4 Prix'!O81","v":0},{"$f":"+$F$147*'D4 Prix'!P81","v":0},{"$f":"+$F$147*'D4 Prix'!Q81","v":0},{"$f":"+$F$147*'D4 Prix'!R81","v":0}]
[null,null,"Coût du superviseur de la zone (niveau intermédiaire) pour les sites PEC MAS ambulatoire par jour",{"$f":"+'D1 Données générales'!$H$13","v":"Cedi"},"Feuille de calcul D5",{"$f":"+'D5 Salaires'!J29","v":18.46153846153846},null,null,null,{"$f":"+$F$148*'D4 Prix'!J81","v":0},{"$f":"+$F$148*'D4 Prix'!K81","v":0},{"$f":"+$F$148*'D4 Prix'!L81","v":0},{"$f":"+$F$148*'D4 Prix'!M81","v":0},{"$f":"+$F$148*'D4 Prix'!N81","v":0},{"$f":"+$F$148*'D4 Prix'!O81","v":0},{"$f":"+$F$148*'D4 Prix'!P81","v":0},{"$f":"+$F$148*'D4 Prix'!Q81","v":0},{"$f":"+$F$148*'D4 Prix'!R81","v":0}]
[null,null,"Coût du superviseur du site PEC MAS ambulatoire (senior) pour les AEC par jour",{"$f":"+'D1 Données générales'!$H$13","v":"Cedi"},"Feuille de calcul D5",{"$f":"+'D5 Salaires'!J32","v":39.230769230769234},null,null,null,{"$f":"+$F$149*'D4 Prix'!J81","v":0},{"$f":"+$F$149*'D4 Prix'!K81","v":0},{"$f":"+$F$149*'D4 Prix'!L81","v":0},{"$f":"+$F$149*'D4 Prix'!M81","v":0},{"$f":"+$F$149*'D4 Prix'!N81","v":0},{"$f":"+$F$149*'D4 Prix'!O81","v":0},{"$f":"+$F$149*'D4 Prix'!P81","v":0},{"$f":"+$F$149*'D4 Prix'!Q81","v":0},{"$f":"+$F$149*'D4 Prix'!R81","v":0}]
[null,null,"Coût d'un ensemble du matériel de supervision du siège de la zone",{"$f":"+'D1 Données générales'!$H$13","v":"Cedi"},"Feuille de calcul D4",{"$f":"+'D4 Prix'!F62","v":0.5},null,null,null,{"$f":"+'D4 Prix'!J62","v":0.5},{"$f":"+'D4 Prix'!K62","v":0.5},{"$f":"+'D4 Prix'!L62","v":0.5},{"$f":"+'D4 Prix'!M62","v":0.5},{"$f":"+'D4 Prix'!N62","v":0.5},{"$f":"+'D4 Prix'!O62","v":0.5},{"$f":"+'D4 Prix'!P62","v":0.5},{"$f":"+'D4 Prix'!Q62","v":0.5},{"$f":"+'D4 Prix'!R62","v":0.5}]
[null,null,"Coût d'un ensemble de matériel de supervision de la  PEC MAS ambulatoire ou PEC MAS hospitalière ",{"$f":"+'D1 Données générales'!$H$13","v":"Cedi"},"Feuille de calcul D4",{"$f":"'D4 Prix'!F63","v":0.5},null,null,null,{"$f":"'D4 Prix'!J63","v":0.5},{"$f":"'D4 Prix'!K63","v":0.5},{"$f":"'D4 Prix'!L63","v":0.5},{"$f":"'D4 Prix'!M63","v":0.5},{"$f":"'D4 Prix'!N63","v":0.5},{"$f":"'D4 Prix'!O63","v":0.5},{"$f":"'D4 Prix'!P63","v":0.5},{"$f":"'D4 Prix'!Q63","v":0.5},{"$f":"'D4 Prix'!R63","v":0.5}]
[null,null,"Coût d'un ensemble de matériel de supervision de l'AEC",{"$f":"+'D1 Données générales'!$H$13","v":"Cedi"},"Feuille de calcul D4",{"$f":"+'D4 Prix'!F64","v":0.2},null,null,null,{"$f":"+'D4 Prix'!J64","v":0.2},{"$f":"+'D4 Prix'!K64","v":0.2},{"$f":"+'D4 Prix'!L64","v":0.2},{"$f":"+'D4 Prix'!M64","v":0.2},{"$f":"+'D4 Prix'!N64","v":0.2},{"$f":"+'D4 Prix'!O64","v":0.2},{"$f":"+'D4 Prix'!P64","v":0.2},{"$f":"+'D4 Prix'!Q64","v":0.2},{"$f":"+'D4 Prix'!R64","v":0.2}]
[null,null,"Coût par km (pour le personnel du groupe-zones) par personne",{"$f":"+'D1 Données générales'!$H$13","v":"Cedi"},"Feuille de calcul D4",{"$f":"+'D4 Prix'!F73","v":2},null,null,null,{"$f":"+'D4 Prix'!J73","v":2},{"$f":"+'D4 Prix'!K73","v":2},{"$f":"+'D4 Prix'!L73","v":2},{"$f":"+'D4 Prix'!M73","v":2},{"$f":"+'D4 Prix'!N73","v":2},{"$f":"+'D4 Prix'!O73","v":2},{"$f":"+'D4 Prix'!P73","v":2},{"$f":"+'D4 Prix'!Q73","v":2},{"$f":"+'D4 Prix'!R73","v":2}]
[null,null,"Coût par km (pour le personnel du site de la PEC MAS ambulatoire) par personne",{"$f":"+'D1 Données générales'!$H$13","v":"Cedi"},"Feuille de calcul D4",{"$f":"+'D4 Prix'!F74","v":2},null,null,null,{"$f":"+'D4 Prix'!J74","v":2},{"$f":"+'D4 Prix'!K74","v":2},{"$f":"+'D4 Prix'!L74","v":2},{"$f":"+'D4 Prix'!M74","v":2},{"$f":"+'D4 Prix'!N74","v":2},{"$f":"+'D4 Prix'!O74","v":2},{"$f":"+'D4 Prix'!P74","v":2},{"$f":"+'D4 Prix'!Q74","v":2},{"$f":"+'D4 Prix'!R74","v":2}]
[null,null,"Coût par km (pour le personnel du siège de la zone) par personne",{"$f":"+'D1 Données générales'!$H$13","v":"Cedi"},"Feuille de calcul D4",{"$f":"+'D4 Prix'!F73","v":2},null,null,null,{"$f":"+'D4 Prix'!J73","v":2},{"$f":"+'D4 Prix'!K73","v":2},{"$f":"+'D4 Prix'!L73","v":2},{"$f":"+'D4 Prix'!M73","v":2},{"$f":"+'D4 Prix'!N73","v":2},{"$f":"+'D4 Prix'!O73","v":2},{"$f":"+'D4 Prix'!P73","v":2},{"$f":"+'D4 Prix'!Q73","v":2},{"$f":"+'D4 Prix'!R73","v":2}]

{"sheet":"R14 Extension communautaire","index":28,"n_rows":98,"n_cols":18,"rows_kept":98,"cut":false,"hidden":false,"merged":[[5,2,5,4],[14,0,23,0],[28,0,38,0],[3,2,3,5]]}
[]
["Retour au sommaire",null,"R14:  Extension communautaire",null,null,null,null,null,null,null,null,null,null,null,null," "]
[]
[null,null,"Cette Feuille de calcul montre (pour l'année choisie) les quantités des différents intrants nécessaires pour faire l'extension communautaire pour la PCMA ainsi que les coûts de ces intrants. "]
[]
[null,null,"Voir ci-dessous pour la manière dont les chiffres sont calculés"]
[null,null,"Number of Areas included ",{"$f":"+'D2 Echelle'!$I$8","v":1},"  (taken from Worksheet W2)"]
[]
[]
[null,null,{"$f":"+IF('D1 Données générales'!$H$11=\"\",\"\",'D1 Données générales'!$H$11)","v":"Ghana"}]
[null,null,{"$f":"+'D9 Variables temps'!I6","v":2011},null,null,"Zone 1",null,null,null,"Zone 2","Zone 3","Zone 4","Zone 5","Zone 6","Zone 7","Zone 8","Zone 9","Zone 10"]
[null,null,null,null,{"$f":"'D2 Echelle'!C30","v":"district"},{"$f":"+IF('D2 Echelle'!$C$31=\"\",\"\",'D2 Echelle'!$C$31)","v":"Ashiedu Keteke"},null,null,null,{"$f":"+IF('D2 Echelle'!$C$36=\"\",\"\",'D2 Echelle'!$C$36)","v":""},{"$f":"+IF('D2 Echelle'!$C$41=\"\",\"\",'D2 Echelle'!$C$41)","v":""},{"$f":"+IF('D2 Echelle'!$C$46=\"\",\"\",'D2 Echelle'!$C$46)","v":""},{"$f":"+IF('D2 Echelle'!$C$51=\"\",\"\",'D2 Echelle'!$C$51)","v":""},{"$f":"+IF('D2 Echelle'!$C$56=\"\",\"\",'D2 Echelle'!$C$56)","v":""},{"$f":"+IF('D2 Echelle'!$C$61=\"\",\"\",'D2 Echelle'!$C$61)","v":""},{"$f":"+IF('D2 Echelle'!$C$66=\"\",\"\",'D2 Echelle'!$C$66)","v":""},{"$f":"+IF('D2 Echelle'!$C$71=\"\",\"\",'D2 Echelle'!$C$71)","v":""},{"$f":"+IF('D2 Echelle'!$C$76=\"\",\"\",'D2 Echelle'!$C$76)","v":""}]
[null,null,null,null,{"$f":"+'D2 Echelle'!D30","v":"région"},{"$f":"+IF('D2 Echelle'!$D$31=\"\",\"\",'D2 Echelle'!$D$31)","v":"Greater Accra"},null,null,null,{"$f":"+IF('D2 Echelle'!$D$36=\"\",\"\",'D2 Echelle'!$D$36)","v":""},{"$f":"+IF('D2 Echelle'!$D$41=\"\",\"\",'D2 Echelle'!$D$41)","v":""},{"$f":"+IF('D2 Echelle'!$D$46=\"\",\"\",'D2 Echelle'!$D$46)","v":""},{"$f":"+IF('D2 Echelle'!$D$51=\"\",\"\",'D2 Echelle'!$D$51)","v":""},{"$f":"+IF('D2 Echelle'!$D$56=\"\",\"\",'D2 Echelle'!$D$56)","v":""},{"$f":"+IF('D2 Echelle'!$D$61=\"\",\"\",'D2 Echelle'!$D$61)","v":""},{"$f":"+IF('D2 Echelle'!$D$66=\"\",\"\",'D2 Echelle'!$D$66)","v":""},{"$f":"+IF('D2 Echelle'!$D$71=\"\",\"\",'D2 Echelle'!$D$71)","v":""},{"$f":"+IF('D2 Echelle'!$D$76=\"\",\"\",'D2 Echelle'!$D$76)","v":""}]
[null,null,"Coûts annuels pour cette activité"]
[null,null,"Variables","Unités","Commentaires"]
[null,null,"Etablir l'extension communautaire"]
[null,null,"Temps du personnel senior de la PEC MAS ambulatoire",{"$f":"+'D1 Données générales'!$H$13","v":"Cedi"},null,{"$f":"+F31*F94","v":7846.1538461538466},null,null,null,{"$f":"+J31*J94","v":0},0,0,0,0,0,0,0,0]
[null,null,"Temps du personnel junior de la PEC MAS ambulatoire",{"$f":"+'D1 Données générales'!$H$13","v":"Cedi"},null,{"$f":"+F32*F95","v":3692.3076923076919},null,null,null,{"$f":"+J32*J95","v":0},0,0,0,0,0,0,0,0]
[null,null,"Transport",{"$f":"+'D1 Données générales'!$H$13","v":"Cedi"},null,{"$f":"+F33*F97+F98*F34","v":4800},null,null,null,{"$f":"+J33*J97+J98*J34","v":0},0,0,0,0,0,0,0,0]
[null,null,"Exécuter l'extension communautaire"]
[null,null,"Temps de l'AEC",{"$f":"+'D1 Données générales'!$H$13","v":"Cedi"},null,{"$f":"+F36*F96","v":0},null,null,null,{"$f":"+J36*J96","v":0},0,0,0,0,0,0,0,0]
[null,null,"Transport (PEC MAS ambulatoire vers site extension communautaire)",{"$f":"+'D1 Données générales'!$H$13","v":"Cedi"},null,{"$f":"+F37*F97","v":14400},null,null,null,{"$f":"+J37*J97","v":0},0,0,0,0,0,0,0,0]
[null,null,"Supervision de l'AEC",{"$f":"+'D1 Données générales'!$H$13","v":"Cedi"},"(Voir R13 Feuille de calcul supervision)"]
[null,null,"Formation de l'AEC ",{"$f":"+'D1 Données générales'!$H$13","v":"Cedi"},"(Voir R12 Feuille de calcul formation)"]
[null,null,"Total coûts",{"$f":"+'D1 Données générales'!$H$13","v":"Cedi"},null,{"$f":"+SUM(F17:F22)","v":30738.461538461539},null,null,null,{"$f":"+SUM(J17:J22)","v":0},0,0,0,0,0,0,0,0]
[]
[null,null,"Quantités d'intrants nécessaires à cette activité"]
[null,null,"Variables","Unités","Commentaires"]
[null,null,"Etablir l'extension communautaire"]
[null,null,"Temps du responsable intermédiaire de la zone","jours",null,{"$f":"+F53","v":0},null,null,null,{"$f":"+J53","v":0},0,0,0,0,0,0,0,0]
[null,null,"Temps du personnel senior de la PEC MAS ambulatoire","jours",null,{"$f":"+F54","v":200},null,null,null,{"$f":"+J54","v":0},0,0,0,0,0,0,0,0]
[null,null,"Temps du personnel junior de la PEC MAS ambulatoire","jours",null,{"$f":"+F55","v":200},null,null,null,{"$f":"+J55","v":0},0,0,0,0,0,0,0,0]
[null,null,"Distance parcourue (site PEC MAS ambulatoire vers village)","kilomètres",null,{"$f":"+F60","v":2400},null,null,null,{"$f":"+J60","v":0},0,0,0,0,0,0,0,0]
[null,null,"Distance parcourue (siège de la zone vers site PEC MAS ambulatoire)","kilomètres",null,{"$f":"+F62","v":0},null,null,null,{"$f":"+J62","v":0},0,0,0,0,0,0,0,0]
[null,null,"Exécuter l'extension communautaire"]
[null,null,"Temps de l'AEC","jours",null,{"$f":"+F56","v":5000},null,null,null,{"$f":"+J56","v":0},0,0,0,0,0,0,0,0]
[null,null,"Distance parcourue par l'AEC","kilomètres",null,{"$f":"+F61","v":7200},null,null,null,{"$f":"+J61","v":0},0,0,0,0,0,0,0,0]
[null,null,"Supervision de l'AEC",null,"(Voir R13 Feuille de calcul supervision)",null,null,null,null,null,null,"(Voir R12 Feuille de calcul formation)"]
[null,null,"Formation de l'AEC",null,"(Voir R12 Feuille de calcul formation)",null,null,null,null,null,null,"(Voir R12 Feuille de calcul formation)"]
[]
[]
[]
[]
[]
[]
[]
[]
[]
[]
[null,null,null,null,null,"Zone 1",null,null,null,"Zone 2","Zone 3","Zone 4","Zone 5","Zone 6","Zone 7","Zone 8","Zone 9","Zone 10"]
["Haut de page",null,"CALCULS",null,null,{"$f":"+IF('D2 Echelle'!$C$31=\"\",\"\",'D2 Echelle'!$C$31)","v":"Ashiedu Keteke"},null,null,null,{"$f":"+IF('D2 Echelle'!$C$36=\"\",\"\",'D2 Echelle'!$C$36)","v":""},{"$f":"+IF('D2 Echelle'!$C$41=\"\",\"\",'D2 Echelle'!$C$41)","v":""},{"$f":"+IF('D2 Echelle'!$C$46=\"\",\"\",'D2 Echelle'!$C$46)","v":""},{"$f":"+IF('D2 Echelle'!$C$51=\"\",\"\",'D2 Echelle'!$C$51)","v":""},{"$f":"+IF('D2 Echelle'!$C$56=\"\",\"\",'D2 Echelle'!$C$56)","v":""},{"$f":"+IF('D2 Echelle'!$C$61=\"\",\"\",'D2 Echelle'!$C$61)","v":""},{"$f":"+IF('D2 Echelle'!$C$66=\"\",\"\",'D2 Echelle'!$C$66)","v":""},{"$f":"+IF('D2 Echelle'!$C$71=\"\",\"\",'D2 Echelle'!$C$71)","v":""},{"$f":"+IF('D2 Echelle'!$C$76=\"\",\"\",'D2 Echelle'!$C$76)","v":""}]
[null,null,"Variables","Unités","Commentaires",{"$f":"+IF('D2 Echelle'!$D$31=\"\",\"\",'D2 Echelle'!$D$31)","v":"Greater Accra"},null,null,null,{"$f":"+IF('D2 Echelle'!$D$36=\"\",\"\",'D2 Echelle'!$D$36)","v":""},{"$f":"+IF('D2 Echelle'!$D$41=\"\",\"\",'D2 Echelle'!$D$41)","v":""},{"$f":"+IF('D2 Echelle'!$D$46=\"\",\"\",'D2 Echelle'!$D$46)","v":""},{"$f":"+IF('D2 Echelle'!$D$51=\"\",\"\",'D2 Echelle'!$D$51)","v":""},{"$f":"+IF('D2 Echelle'!$D$56=\"\",\"\",'D2 Echelle'!$D$56)","v":""},{"$f":"+IF('D2 Echelle'!$D$61=\"\",\"\",'D2 Echelle'!$D$61)","v":""},{"$f":"+IF('D2 Echelle'!$D$66=\"\",\"\",'D2 Echelle'!$D$66)","v":""},{"$f":"+IF('D2 Echelle'!$D$71=\"\",\"\",'D2 Echelle'!$D$71)","v":""},{"$f":"+IF('D2 Echelle'!$D$76=\"\",\"\",'D2 Echelle'!$D$76)","v":""}]
[null,null,"Total jours du temps du responsable intermédiaire de la zone","jours",null,{"$f":"+F67*F86","v":0},null,null,null,{"$f":"+J67*J86","v":0},0,0,0,0,0,0,0,0]
[null,null,"Total jours du temps du personnel senior PEC MAS ambulatoire","jours",null,{"$f":"+F70*F86+F88*F71","v":200},null,null,null,{"$f":"+J70*J86+J88*J71","v":0},0,0,0,0,0,0,0,0]
[null,null,"Total jours du temps du personnel junior PEC MAS ambulatoire","jours",null,{"$f":"+F74*F86+F88*F75","v":200},null,null,null,{"$f":"+J74*J86+J88*J75","v":0},0,0,0,0,0,0,0,0]
[null,null,"Total jours du temps de l'AEC","jours",null,{"$f":"+(F88+F89)*(F79+F80)","v":5000},null,null,null,{"$f":"+(J88+J89)*(J79+J80)","v":0},0,0,0,0,0,0,0,0]
[null,null,"Nombre de voyages retour au site de la PEC MAS ambulatoire","voyages",null,{"$f":"+F68*F86","v":0},null,null,null,{"$f":"+J68*J86","v":0},0,0,0,0,0,0,0,0]
[null,null,"Nombre de voyages retour par le personnel de la PEC MAS ambulatoire au nouveau site d'extension communautaire","voyages",null,{"$f":"+(F72+F76)*F88","v":400},null,null,null,{"$f":"+(J72+J76)*J88","v":0},0,0,0,0,0,0,0,0]
[null,null,"Nombre de voyages retour du site PEC MAS ambulatoire à la communauté par l'AEC","voyages",null,{"$f":"+F82*(F88+F89)","v":1200},null,null,null,{"$f":"+J82*(J88+J89)","v":0},0,0,0,0,0,0,0,0]
[null,null,"Distance parcourue entre le site PEC MAS ambulatoire et la communauté établissant l'activité d'extension communautaire","kilomètres",null,{"$f":"+F84*2*(F58)","v":2400},null,null,null,{"$f":"+J84*2*(J58)","v":0},0,0,0,0,0,0,0,0]
[null,null,"Distance parcourue par l'AEC/volontaire entre la PEC MAS ambulatoire et la communauté exécutant l'activité d'extension communautaire","kilomètres",null,{"$f":"2*F84*F59","v":7200},null,null,null,{"$f":"2*J84*J59","v":0},0,0,0,0,0,0,0,0]
[null,null,"Distance parcourue entre le site de la PEC MAS ambulatoire et le siège de la zone","kilomètres",null,{"$f":"+F57*2*F85","v":0},null,null,null,{"$f":"+J57*2*J85","v":0},0,0,0,0,0,0,0,0]
[null,null,"Nombre de sites d'extension communautaire par site de PEC MAS ambulatoire","sites"," ",{"$f":"+IF((F86+F89)=0,0,(F88+F89)/(F86+F87))","v":0},null,null,null,{"$f":"+IF((J86+J89)=0,0,(J88+J89)/(J86+J87))","v":0},0,0,0,0,0,0,0,0]
[null,null,"Nombre de cas de MAS par site d'extension communautaire","cas",null,{"$f":"+IF((F86+F87)*F63=0,0,F90/(F63*(F86+F87)))","v":0},null,null,null,{"$f":"+IF((J86+J87)*J63=0,0,J90/(J63*(J86+J87)))","v":0},0,0,0,0,0,0,0,0]
[null,null,"Drivers de base, données brutes"]
[null,null,"Responsable intermédiaire de la zone"]
[null,null,"Pour aider le personnel dans un nouveau site PEC MAS, pour concevoir matériel d'extension communautaire, préparer les directives sur les stratégies, faire la cartographie communautaire et choisir les communautés  (par nouveau site PEC MAS ambulatoire)","jours","Feuille de calcul D3",{"$f":"+'D3 Données épi. démo'!F66","v":1},null,null,null,{"$f":"+'D3 Données épi. démo'!J66","v":1},{"$f":"+'D3 Données épi. démo'!K66","v":1},{"$f":"+'D3 Données épi. démo'!L66","v":1},{"$f":"+'D3 Données épi. démo'!M66","v":1},{"$f":"+'D3 Données épi. démo'!N66","v":1},{"$f":"+'D3 Données épi. démo'!O66","v":1},{"$f":"+'D3 Données épi. démo'!P66","v":1},{"$f":"+'D3 Données épi. démo'!Q66","v":1},{"$f":"+'D3 Données épi. démo'!R66","v":1}]
[null,null,"Nombre de  voyages retour de la zone au site PEC MAS ambulatoire (par nouveau site PEC MAS ambulatoire)","voyages","Feuille de calcul D3",{"$f":"+'D3 Données épi. démo'!F67","v":1},null,null,null,{"$f":"+'D3 Données épi. démo'!J67","v":1},{"$f":"+'D3 Données épi. démo'!K67","v":1},{"$f":"+'D3 Données épi. démo'!L67","v":1},{"$f":"+'D3 Données épi. démo'!M67","v":1},{"$f":"+'D3 Données épi. démo'!N67","v":1},{"$f":"+'D3 Données épi. démo'!O67","v":1},{"$f":"+'D3 Données épi. démo'!P67","v":1},{"$f":"+'D3 Données épi. démo'!Q67","v":1},{"$f":"+'D3 Données épi. démo'!R67","v":1}]
[null,null,"Personnel senior PEC MAS ambulatoire ",null,null," ",null,null,null," "," "," "," "," "," "," "," "," "]
[null,null,"Dans un nouveau site PEC MAS ambulatoire, pour concevoir du matériel d'extension communautaire, préparer des directives sur les stratégies, faire une cartographie communautaire et choisir les communautés  (par nouveau site PEC MAS ambulatoire)","jours","Feuille de calcul D3",{"$f":"+'D3 Données épi. démo'!F69","v":5},null,null,null,{"$f":"+'D3 Données épi. démo'!J69","v":5},{"$f":"+'D3 Données épi. démo'!K69","v":5},{"$f":"+'D3 Données épi. démo'!L69","v":5},{"$f":"+'D3 Données épi. démo'!M69","v":5},{"$f":"+'D3 Données épi. démo'!N69","v":5},{"$f":"+'D3 Données épi. démo'!O69","v":5},{"$f":"+'D3 Données épi. démo'!P69","v":5},{"$f":"+'D3 Données épi. démo'!Q69","v":5},{"$f":"+'D3 Données épi. démo'!R69","v":5}]
[null,null,"Dans un nouveau site d'extension communautaire, réaliser les réunions de sensibilisation communautaire (et sélection des volontaires le cas échéant)","jours","Feuille de calcul D3",{"$f":"+'D3 Données épi. démo'!F70","v":2},null,null,null,{"$f":"+'D3 Données épi. démo'!J70","v":2},{"$f":"+'D3 Données épi. démo'!K70","v":2},{"$f":"+'D3 Données épi. démo'!L70","v":2},{"$f":"+'D3 Données épi. démo'!M70","v":2},{"$f":"+'D3 Données épi. démo'!N70","v":2},{"$f":"+'D3 Données épi. démo'!O70","v":2},{"$f":"+'D3 Données épi. démo'!P70","v":2},{"$f":"+'D3 Données épi. démo'!Q70","v":2},{"$f":"+'D3 Données épi. démo'!R70","v":2}]
[null,null," Nombre de voyages retour au site d'extension communautaire (par nouveau site d'extension communautaire)","voyages","Feuille de calcul D3",{"$f":"+'D3 Données épi. démo'!F71","v":2},null,null,null,{"$f":"+'D3 Données épi. démo'!J71","v":2},{"$f":"+'D3 Données épi. démo'!K71","v":2},{"$f":"+'D3 Données épi. démo'!L71","v":2},{"$f":"+'D3 Données épi. démo'!M71","v":2},{"$f":"+'D3 Données épi. démo'!N71","v":2},{"$f":"+'D3 Données épi. démo'!O71","v":2},{"$f":"+'D3 Données épi. démo'!P71","v":2},{"$f":"+'D3 Données épi. démo'!Q71","v":2},{"$f":"+'D3 Données épi. démo'!R71","v":2}]
[null,null,"Personnel junior PEC MAS ambulatoire",null,null," ",null,null,null," "," "," "," "," "," "," "," "," "]
[null,null,"Dans un nouveau site PEC MAS ambulatoire, pour concevoir du matériel d'extension communautaire, préparer des directives sur les stratégies, faire une cartographie communautaire et choisir les communautés (par nouveu site PEC MAS ambulatoire)","jours","Feuille de calcul D3",{"$f":"+'D3 Données épi. démo'!F73","v":5},null,null,null,{"$f":"+'D3 Données épi. démo'!J73","v":5},{"$f":"+'D3 Données épi. démo'!K73","v":5},{"$f":"+'D3 Données épi. démo'!L73","v":5},{"$f":"+'D3 Données épi. démo'!M73","v":5},{"$f":"+'D3 Données épi. démo'!N73","v":5},{"$f":"+'D3 Données épi. démo'!O73","v":5},{"$f":"+'D3 Données épi. démo'!P73","v":5},{"$f":"+'D3 Données épi. démo'!Q73","v":5},{"$f":"+'D3 Données épi. démo'!R73","v":5}]
[null,null,"Dans un nouveau site d'extension communautaire, réaliser des réunions de sensibilisation communautaire (et sélection des volontaires le cas échéant)","jours","Feuille de calcul D3",{"$f":"+'D3 Données épi. démo'!F74","v":2},null,null,null,{"$f":"+'D3 Données épi. démo'!J74","v":2},{"$f":"+'D3 Données épi. démo'!K74","v":2},{"$f":"+'D3 Données épi. démo'!L74","v":2},{"$f":"+'D3 Données épi. démo'!M74","v":2},{"$f":"+'D3 Données épi. démo'!N74","v":2},{"$f":"+'D3 Données épi. démo'!O74","v":2},{"$f":"+'D3 Données épi. démo'!P74","v":2},{"$f":"+'D3 Données épi. démo'!Q74","v":2},{"$f":"+'D3 Données épi. démo'!R74","v":2}]
[null,null,"Nombre de  voyages retour au site d'extension communautaire (par nouveau site d'extension communautaire)","voyages","Feuille de calcul D3",{"$f":"+'D3 Données épi. démo'!F75","v":2},null,null,null,{"$f":"+'D3 Données épi. démo'!J75","v":2},{"$f":"+'D3 Données épi. démo'!K75","v":2},{"$f":"+'D3 Données épi. démo'!L75","v":2},{"$f":"+'D3 Données épi. démo'!M75","v":2},{"$f":"+'D3 Données épi. démo'!N75","v":2},{"$f":"+'D3 Données épi. démo'!O75","v":2},{"$f":"+'D3 Données épi. démo'!P75","v":2},{"$f":"+'D3 Données épi. démo'!Q75","v":2},{"$f":"+'D3 Données épi. démo'!R75","v":2}]
[null,null,"Agent d'extension communautaire"]
[null,null,"Les AEC font-ils de l'extension communautaire pour le personnel payé de la PCMA (ASC) ou les volontaires ? ",null,"Feuille de calcul D3",{"$f":"+'D3 Données épi. démo'!F77","v":"Volontaire"},null,null,null,{"$f":"+'D3 Données épi. démo'!J77","v":0},{"$f":"+'D3 Données épi. démo'!K77","v":0},{"$f":"+'D3 Données épi. démo'!L77","v":0},{"$f":"+'D3 Données épi. démo'!M77","v":0},{"$f":"+'D3 Données épi. démo'!N77","v":0},{"$f":"+'D3 Données épi. démo'!O77","v":0},{"$f":"+'D3 Données épi. démo'!P77","v":0},{"$f":"+'D3 Données épi. démo'!Q77","v":0},{"$f":"+'D3 Données épi. démo'!R77","v":0}]
[null,null,"Dans la communauté : (1) Visites à domicile pour les cas à problèmes (2) Identification de nouveaux cas et référence pour traitement (3) mobilisation communautaire (4) Liaison avec les dirigeants communautaires et évaluation communautaire (par an et par site d'activité d'extension communautaire)","jours","Feuille de calcul D3",{"$f":"+'D3 Données épi. démo'!F78","v":38},null,null,null,{"$f":"+'D3 Données épi. démo'!J78","v":38},{"$f":"+'D3 Données épi. démo'!K78","v":38},{"$f":"+'D3 Données épi. démo'!L78","v":38},{"$f":"+'D3 Données épi. démo'!M78","v":38},{"$f":"+'D3 Données épi. démo'!N78","v":38},{"$f":"+'D3 Données épi. démo'!O78","v":38},{"$f":"+'D3 Données épi. démo'!P78","v":38},{"$f":"+'D3 Données épi. démo'!Q78","v":38},{"$f":"+'D3 Données épi. démo'!R78","v":38}]
[null,null,"Dans les soins ambulatoires : données et rapports (par an et par site d'extension communautaire) ","jours","Feuille de calcul D3",{"$f":"+'D3 Données épi. démo'!F79","v":12},null,null,null,{"$f":"+'D3 Données épi. démo'!J79","v":12},{"$f":"+'D3 Données épi. démo'!K79","v":12},{"$f":"+'D3 Données épi. démo'!L79","v":12},{"$f":"+'D3 Données épi. démo'!M79","v":12},{"$f":"+'D3 Données épi. démo'!N79","v":12},{"$f":"+'D3 Données épi. démo'!O79","v":12},{"$f":"+'D3 Données épi. démo'!P79","v":12},{"$f":"+'D3 Données épi. démo'!Q79","v":12},{"$f":"+'D3 Données épi. démo'!R79","v":12}]
[null,null,"Nombre de  sites d'extension communautaire qu'un AEC (personnel) peut gérer à la fois ","sites",null,{"$f":"+IF((F79+F80)=0,0,F92/(F79+F80))","v":5.2},null,null,null,{"$f":"+IF((J79+J80)=0,0,J92/(J79+J80))","v":5.2},5.2,5.2,5.2,5.2,5.2,5.2,5.2,5.2]
[null,null,"Nombre de voyages retour entre la PEC MAS ambulatoire et les sites d'extension communautaire (par site d'extension communautaire)","voyages","Feuille de calcul D3",{"$f":"+'D3 Données épi. démo'!F81","v":12},null,null,null,{"$f":"+'D3 Données épi. démo'!J81","v":0},{"$f":"+'D3 Données épi. démo'!K81","v":0},{"$f":"+'D3 Données épi. démo'!L81","v":0},{"$f":"+'D3 Données épi. démo'!M81","v":0},{"$f":"+'D3 Données épi. démo'!N81","v":0},{"$f":"+'D3 Données épi. démo'!O81","v":0},{"$f":"+'D3 Données épi. démo'!P81","v":0},{"$f":"+'D3 Données épi. démo'!Q81","v":0},{"$f":"+'D3 Données épi. démo'!R81","v":0}]
[null,null,"Autres données"]
[null,null,"Distance moyenne des sites PEC MAS ambulatoire aux communautés","kilomètres","Feuille de calcul D3",{"$f":"+'D3 Données épi. démo'!F131","v":3},null,null,null,{"$f":"+'D3 Données épi. démo'!J131","v":0},{"$f":"+'D3 Données épi. démo'!K131","v":0},{"$f":"+'D3 Données épi. démo'!L131","v":0},{"$f":"+'D3 Données épi. démo'!M131","v":0},{"$f":"+'D3 Données épi. démo'!N131","v":0},{"$f":"+'D3 Données épi. démo'!O131","v":0},{"$f":"+'D3 Données épi. démo'!P131","v":0},{"$f":"+'D3 Données épi. démo'!Q131","v":0},{"$f":"+'D3 Données épi. démo'!R131","v":0}]
[null,null,"Distance moyenne du siège de la zone aux sites PEC MAS ambulatoire","kilomètres","Feuille de calcul D3",{"$f":"+'D3 Données épi. démo'!F123","v":5},null,null,null,{"$f":"+'D3 Données épi. démo'!J123","v":0},{"$f":"+'D3 Données épi. démo'!K123","v":0},{"$f":"+'D3 Données épi. démo'!L123","v":0},{"$f":"+'D3 Données épi. démo'!M123","v":0},{"$f":"+'D3 Données épi. démo'!N123","v":0},{"$f":"+'D3 Données épi. démo'!O123","v":0},{"$f":"+'D3 Données épi. démo'!P123","v":0},{"$f":"+'D3 Données épi. démo'!Q123","v":0},{"$f":"+'D3 Données épi. démo'!R123","v":0}]
[null,null,"Nombre de nouveaux sites PEC MAS ambulatoire","sites","Feuille de calcul D9",{"$f":"+'D9 Variables temps'!F30","v":0},null,null,null,{"$f":"+'D9 Variables temps'!J30","v":0},{"$f":"+'D9 Variables temps'!K30","v":0},{"$f":"+'D9 Variables temps'!L30","v":0},{"$f":"+'D9 Variables temps'!M30","v":0},{"$f":"+'D9 Variables temps'!N30","v":0},{"$f":"+'D9 Variables temps'!O30","v":0},{"$f":"+'D9 Variables temps'!P30","v":0},{"$f":"+'D9 Variables temps'!Q30","v":0},{"$f":"+'D9 Variables temps'!R30","v":0}]
[null,null,"Nombre de sites PEC MAS ambulatoires établis","sites","Feuille de calcul D9",{"$f":"+'D9 Variables temps'!F31","v":2},null,null,null,{"$f":"+'D9 Variables temps'!J31","v":0},{"$f":"+'D9 Variables temps'!K31","v":0},{"$f":"+'D9 Variables temps'!L31","v":0},{"$f":"+'D9 Variables temps'!M31","v":0},{"$f":"+'D9 Variables temps'!N31","v":0},{"$f":"+'D9 Variables temps'!O31","v":0},{"$f":"+'D9 Variables temps'!P31","v":0},{"$f":"+'D9 Variables temps'!Q31","v":0},{"$f":"+'D9 Variables temps'!R31","v":0}]
[null,null,"Nombre de nouveaux sites d'extension communautaire","sites","Feuille de calcul D3",{"$f":"+'D9 Variables temps'!F36","v":100},null,null,null,{"$f":"+'D9 Variables temps'!J36","v":0},{"$f":"+'D9 Variables temps'!K36","v":0},{"$f":"+'D9 Variables temps'!L36","v":0},{"$f":"+'D9 Variables temps'!M36","v":0},{"$f":"+'D9 Variables temps'!N36","v":0},{"$f":"+'D9 Variables temps'!O36","v":0},{"$f":"+'D9 Variables temps'!P36","v":0},{"$f":"+'D9 Variables temps'!Q36","v":0},{"$f":"+'D9 Variables temps'!R36","v":0}]
[null,null,"Nombre de sites d'extension communautaire établis","sites","Feuille de calcul D3",{"$f":"+'D9 Variables temps'!F37","v":0},null,null,null,{"$f":"+'D9 Variables temps'!J37","v":0},{"$f":"+'D9 Variables temps'!K37","v":0},{"$f":"+'D9 Variables temps'!L37","v":0},{"$f":"+'D9 Variables temps'!M37","v":0},{"$f":"+'D9 Variables temps'!N37","v":0},{"$f":"+'D9 Variables temps'!O37","v":0},{"$f":"+'D9 Variables temps'!P37","v":0},{"$f":"+'D9 Variables temps'!Q37","v":0},{"$f":"+'D9 Variables temps'!R37","v":0}]
[null,null,"Nombre de  cas de MAS dans la zone","cas","Feuille de calcul D9",{"$f":"+'D9 Variables temps'!F39","v":150},null,null,null,{"$f":"+'D9 Variables temps'!J39","v":0},{"$f":"+'D9 Variables temps'!K39","v":0},{"$f":"+'D9 Variables temps'!L39","v":0},{"$f":"+'D9 Variables temps'!M39","v":0},{"$f":"+'D9 Variables temps'!N39","v":0},{"$f":"+'D9 Variables temps'!O39","v":0},{"$f":"+'D9 Variables temps'!P39","v":0},{"$f":"+'D9 Variables temps'!Q39","v":0},{"$f":"+'D9 Variables temps'!R39","v":0}]
[null,null,"Heures en une journée de travail","heures","Feuille de calcul D3",{"$f":"+'D3 Données épi. démo'!F35","v":8},null,null,null,{"$f":"+'D3 Données épi. démo'!J35","v":8},{"$f":"+'D3 Données épi. démo'!K35","v":8},{"$f":"+'D3 Données épi. démo'!L35","v":8},{"$f":"+'D3 Données épi. démo'!M35","v":8},{"$f":"+'D3 Données épi. démo'!N35","v":8},{"$f":"+'D3 Données épi. démo'!O35","v":8},{"$f":"+'D3 Données épi. démo'!P35","v":8},{"$f":"+'D3 Données épi. démo'!Q35","v":8},{"$f":"+'D3 Données épi. démo'!R35","v":8}]
[null,null,"Jours dans une année de travail","jours","Feuille de calcul D5",{"$f":"+'D5 Salaires'!I20","v":260},null,null,null,{"$f":"+$F$92","v":260},{"$f":"+$F$92","v":260},260,260,260,260,260,260,260]
[null,null,"Prix"]
[null,null,"Coût par jour de l'agent senior PEC MAS ambulatoire",{"$f":"+'D1 Données générales'!$H$13","v":"Cedi"},"Feuille de calcul D5",{"$f":"+'D5 Salaires'!J32","v":39.230769230769234},null,null,null,{"$f":"+$F$94*'D4 Prix'!J81","v":0},{"$f":"+$F$94*'D4 Prix'!K81","v":0},{"$f":"+$F$94*'D4 Prix'!L81","v":0},{"$f":"+$F$94*'D4 Prix'!M81","v":0},{"$f":"+$F$94*'D4 Prix'!N81","v":0},{"$f":"+$F$94*'D4 Prix'!O81","v":0},{"$f":"+$F$94*'D4 Prix'!P81","v":0},{"$f":"+$F$94*'D4 Prix'!Q81","v":0},{"$f":"+$F$94*'D4 Prix'!R81","v":0}]
[null,null,"Coût par jour de l'agent junior PEC MAS ambulatoire",{"$f":"+'D1 Données générales'!$H$13","v":"Cedi"},"Feuille de calcul D5",{"$f":"+'D5 Salaires'!J33","v":18.46153846153846},null,null,null,{"$f":"+$F$95*'D4 Prix'!J81","v":0},{"$f":"+$F$95*'D4 Prix'!K81","v":0},{"$f":"+$F$95*'D4 Prix'!L81","v":0},{"$f":"+$F$95*'D4 Prix'!M81","v":0},{"$f":"+$F$95*'D4 Prix'!N81","v":0},{"$f":"+$F$95*'D4 Prix'!O81","v":0},{"$f":"+$F$95*'D4 Prix'!P81","v":0},{"$f":"+$F$95*'D4 Prix'!Q81","v":0},{"$f":"+$F$95*'D4 Prix'!R81","v":0}]
[null,null,"Coût par jour de l'AEC (personnel ou volontaire)",{"$f":"+'D1 Données générales'!$H$13","v":"Cedi"},"Feuille de calcul D5",{"$f":"+'D5 Salaires'!J34+'D5 Salaires'!K34","v":0},null,null,null,{"$f":"+$F$96*'D4 Prix'!J81","v":0},{"$f":"+$F$96*'D4 Prix'!K81","v":0},{"$f":"+$F$96*'D4 Prix'!L81","v":0},{"$f":"+$F$96*'D4 Prix'!M81","v":0},{"$f":"+$F$96*'D4 Prix'!N81","v":0},{"$f":"+$F$96*'D4 Prix'!O81","v":0},{"$f":"+$F$96*'D4 Prix'!P81","v":0},{"$f":"+$F$96*'D4 Prix'!Q81","v":0},{"$f":"+$F$96*'D4 Prix'!R81","v":0}]
[null,null,"Coût par km des transports entre le site PEC MAS ambulatoire et le site d'extension communautaire",{"$f":"+'D1 Données générales'!$H$13","v":"Cedi"},"Feuille de calcul D4",{"$f":"+'D4 Prix'!F75","v":2},null,null,null,{"$f":"+'D4 Prix'!J75","v":2},{"$f":"+'D4 Prix'!K75","v":2},{"$f":"+'D4 Prix'!L75","v":2},{"$f":"+'D4 Prix'!M75","v":2},{"$f":"+'D4 Prix'!N75","v":2},{"$f":"+'D4 Prix'!O75","v":2},{"$f":"+'D4 Prix'!P75","v":2},{"$f":"+'D4 Prix'!Q75","v":2},{"$f":"+'D4 Prix'!R75","v":2}]
[null,null,"Coût par km de transport entre le siège de la zone et le site PEC MAS ambulatoire",{"$f":"+'D1 Données générales'!$H$13","v":"Cedi"},"Feuille de calcul D4",{"$f":"+'D4 Prix'!J74","v":2},null,null,null,{"$f":"+'D4 Prix'!N74","v":2},{"$f":"+'D4 Prix'!O74","v":2},{"$f":"+'D4 Prix'!P74","v":2},{"$f":"+'D4 Prix'!Q74","v":2},{"$f":"+'D4 Prix'!R74","v":2},{"$f":"+'D4 Prix'!S74","v":0},{"$f":"+'D4 Prix'!T74","v":0},{"$f":"+'D4 Prix'!U74","v":0},{"$f":"+'D4 Prix'!V74","v":0}]

{"sheet":"to be removed ","index":29,"n_rows":69,"n_cols":11,"rows_kept":69,"cut":false,"hidden":true,"merged":[[7,1,15,1],[5,4,5,7],[23,2,29,2],[13,8,15,8],[21,4,21,8],[13,2,15,2],[7,2,12,2]]}
[]
[]
[null,null,"Table showing the inputs and activities covered by each of the results worksheets. "]
[]
[]
[null,null,null,null," ----------------------- INPUTS ---------------------- "]
[null,null,null,null,"Manpower","Supplies","Transport","Space","Total "]
[null," ------------  ACTIVITIES  ---------------","Area Level and below","Community Outreach",null,null,null,null,"R14"]
[null,null,null,"Supervision",null,null,null,null,"R13"]
[null,null,null,"Training"," ",null,null,null,"R12"]
[null,null,null,"Supply logistics"," ",null,null,null,"R11"]
[null,null,null,"Treatment (case management)","R8","R9 & R10"]
[null,null,null,"Management",null,null,null,null,"R7"]
[null,null,"Group-Area & National levels","Supply logistics",null,null,null,null,"R6"]
[null,null,null,"Training"]
[null,null,null,"Management"]
[null,null,null,"Total ","R1","R2","R3","R4","R5"]
[]
[]
[]
[]
[null,null,null,null,"INPUTS"]
[null,null,null,null,"Manpower","Supplies","Transport","Space","Total "]
[null,null,"ACTIVITIES","Treatment (case management)"]
[null,null,null,"Supply logistics"]
[null,null,null,"Community outreach"]
[null,null,null,"Training "]
[null,null,null,"Supervision"]
[null,null,null,"Management"]
[null,null,null,"Total "]
[]
[]
[]
[]
[]
[]
[null,null,null,"Percentage of the km costs born pe"]
[]
[]
[]
[]
[]
[null,null,null,null,"OCP",null,"Area`",null,"G-A",null,"National"]
[]
[null,null,null,"D1","yes, 1 G-A",null,"1 GA",null,"1 GA",null,"all Gas"]
[null,null,null,"D2","1 area, 1 OC",null,"1 Area"]
[null,null,null,"d3"]
[null,null,null,"d4"]
[null,null,null,"d5"]
[null,null,null,"d6"]
[null,null,null,"d7","yes",null,null,null,null,null,"yes (complete)"]
[null,null,null,"d8","not necessary",null,"not ",null,"yes",null,"yes"]
[null,null,null,"d9","yes",null,"yes",null,"yes",null,"yes"]
[]
[]
[null,null,null,"r1"]
[null,null,null,"r2"]
[null,null,null,"r3"]
[null,null,null,"r4"]
[null,null,null,"r5"]
[null,null,null,"r6"]
[null,null,null,"r7"]
[null,null,null,"r8"]
[null,null,null,"r9"]
[null,null,null,"r10"]
[null,null,null,"r11"]
[null,null,null,"r12"]
[null,null,null,"r13"]
[null,null,null,"r14"]