{"text_format":"1","workbook":"xlsx","n_sheets":30,"sheets":["to be hidden","Contents","Results Explained","Reminder about Data Inputs","D1 Background","D2 Scale","D3 Epid. Demog. & Service Data","D4 Prices","W6with comments","D5 Salaries","D6 Fixed Supplies","D7 Frequency Food Deliveries","D8 Group-Area & Central Level ","D9 Time-dependent","Reminder about Results","R1 Manpower","R2 Transport","R3 Supplies","R4 Space","R5 Financial Summary","R6 Group-Area & Central Level","R7 Area HQ Management","R8 Treatment (manpower&space)","R9 Treatment(medical supplies) ","R10 Treatment (other supplies)","R11 Supply Logistics","R12 Training","R13 Supervision","R14 Community Outreach","to be removed "],"not_rendered":{"charts":0,"images":7,"macros":0,"external_links":0,"defined_names":75,"comments":1,"pivot_tables":0},"unopened":[],"bounds":{"document_bytes":16777216,"sheet_cells":100000,"rows_first":2000,"rows_last":500,"rows_between":2000,"halvings":0,"cell_chars":16384,"cell_head_chars":4096},"cells_cut":0,"cells_raw":0,"read":"whole","date_system":"1900"}

{"sheet":"to be hidden","index":0,"n_rows":27,"n_cols":11,"rows_kept":27,"cut":false,"hidden":true,"merged":[]}
[null,"Master message list"]
[]
[null,"message1","fill in"]
[null,"message2","leave empty"]
[null,"message3","Zeros in this column"]
[null,"message4","Complete this column"]
[null,"message5","OUTsites"]
[null,"message6","Insites"]
{"$rows_left_out":20}
{"sheet":"Contents","index":1,"n_rows":51,"n_cols":8,"rows_kept":51,"cut":false,"hidden":false,"merged":[[19,5,20,8],[22,0,50,0],[22,5,22,10],[34,1,34,3],[35,4,38,4],[35,5,38,10],[39,5,39,10],[41,1,41,3],[42,5,50,10],[11,1,11,2],[12,1,12,2],[16,1,16,3],[1,1,2,10],[6,1,6,2],[7,1,7,2],[8,1,8,2],[9,1,9,2],[10,1,10,2],[7,7,12,10]]}
[]
[null,"CMAM Costing Tool for costing community-based management of acute malnutrition (CMAM) at national, subnational, and district levels."]
[]
[]
[]
[null,"Key to color-coding and symbols",null,null,null,null,"  See User's Guide for help on using this Tool. "]
[null,"gold",null,"u data provided directly by the User",null,null,null,"Version 1.1, February 2012"]
[null,"yellow",null,"copied from data provided by the User",null,null,null,"This guide is made possible by the generous support of the American people through the support of the Office of U.S. Foreign Disaster Assistance, Bureau for Democracy, Conflict, and Humanitarian Assistance, and the Office of Health, Infectious Diseases, and Nutrition, Bureau for Global Health, U.S. Agency for International Development (USAID), under terms of Cooperative Agreement No. AID-OAA-A-11-00014, through the Food and Nutrition Technical Assistance II Project (FANTA), managed by FHI 360.\n\nThe contents of this document are the responsibility of FHI 360 and do not necessarily reflect the views of USAID or the United States Government. "]
{"$rows_left_out":44}
{"sheet":"Results Explained","index":2,"n_rows":37,"n_cols":15,"rows_kept":37,"cut":false,"hidden":false,"merged":[[13,3,13,15],[5,5,5,6],[23,3,23,15]]}
[]
[null,"Results Explained"]
[]
[null,null,null,"What kind of information will the Tool provide about the the resources requirements of CMAM? Here are some examples."]
[]
[null,null,null,null,null,"For the year ",null,{"$f":"+'D9 Time-dependent'!$I$6","v":2011},null,null,null,null,null,"Quantities","Units"]
[null,null,null,null,"How much RUTF will be needed?",null,null,null,null,null,null,null,null,{"$f":"+'R3 Supplies'!F17","v":1993.5712500000002},"kg"]
[null,null,null,null,"How much time health care providers at Outpatient Care sites will need?",null,null,null,null,null,null,null,null,{"$f":"+'R1 Manpower'!F23+'R1 Manpower'!F31","v":3.671153846153846},"full-time equivalent years"]
{"$rows_left_out":30}
{"sheet":"Reminder about Data Inputs","index":3,"n_rows":9,"n_cols":2,"rows_kept":9,"cut":false,"hidden":false,"merged":[]}
[]
[null,"Reminder about Data Input Worksheets [D1 through D9]"]
[]
[null,"The following seven worksheets (D1 to D9) present the basic data from which all the "]
[null,"subsequent calculations of resource requirements and costs are derived."]
[]
[null,"The User is required to complete gold-colored cells (look for u on the rows that have input cells)."]
[]
{"$rows_left_out":2}
{"sheet":"D1 Background","index":4,"n_rows":53,"n_cols":9,"rows_kept":53,"cut":false,"hidden":false,"merged":[[8,1,8,5],[17,2,17,6],[15,3,15,6],[10,2,10,4],[12,3,12,6],[13,3,13,6],[14,3,14,6],[38,3,40,4],[29,2,29,5],[27,2,27,5],[52,5,52,7],[51,5,51,7],[42,6,42,7],[50,5,50,7],[49,2,49,7],[44,2,44,5],[41,6,41,7],[21,5,21,7],[40,6,40,7],[19,5,19,7],[34,2,34,5],[32,2,32,5],[30,2,30,5],[20,5,20,7],[23,5,23,7],[34,6,34,7],[25,2,25,5],[22,5,22,7],[35,6,35,7],[39,6,39,7],[36,6,36,7],[37,6,37,7],[38,6,38,7]]}
[]
["Return to Contents",null," D1: Background"]
[]
[null,"Clear this Worksheet of any data entered from a previous application of this Tool by pressing this button ……….."]
[]
[null,"COMPLETE this worksheet (D1) before going to subsequent worksheets: the numbers you record here will influence the size and layout of some of the other worksheets."]
[]
[]
{"$rows_left_out":46}
{"sheet":"D2 Scale","index":5,"n_rows":84,"n_cols":15,"rows_kept":84,"cut":false,"hidden":false,"merged":[[81,6,83,6],[30,26,33,26],[9,23,9,28],[11,23,11,30],[55,6,59,6],[40,6,44,6],[75,6,79,6],[45,6,49,6],[50,6,54,6],[70,6,74,6],[35,6,39,6],[65,6,69,6],[10,2,10,6],[30,6,34,6],[24,2,24,13],[60,6,64,6],[1,2,1,4],[16,2,16,13],[21,2,21,10],[20,2,20,13],[11,2,11,7],[14,1,14,13],[6,2,6,7],[3,19,3,24],[3,25,3,30],[22,23,22,30],[18,2,18,13],[4,2,4,6],[7,2,7,6],[6,18,6,23],[22,2,22,13],[15,22,15,25],[6,24,6,29]]}
[]
["Return to Contents",null,"D2:  Scale"]
[]
[null,"THESE ROWS ARE COPIED FROM PREVIOUS WORKSHEET because you cannot do conditional formatting using cells from other worksheets"]
[null,1,"RECORD here the number of years you wish to budget for (maximum 5).",null,null,null,null,null,{"$f":"+'D1 Background'!G26","v":1}]
[]
[null,null,"(This was the original reference - keep for convenience to avoid having to rename reference cells.  Hide this row",null,null,null,null,null,{"$f":"+I5+1","v":2}]
[null,2,"RECORD here the number of Areas to be included in the budgetary analysis (maximum 10).  Include Areas that begin functioning at any time during the period you wish to budget for. ",null,null,null,null,null,{"$f":"+'D1 Background'!G31","v":1}]
{"$rows_left_out":77}
{"sheet":"D3 Epid. Demog. & Service Data","index":6,"n_rows":218,"n_cols":19,"rows_kept":218,"cut":false,"hidden":false,"merged":[[19,9,19,17],[21,4,24,4],[122,4,131,4],[104,2,104,4],[96,3,97,3],[93,3,94,3],[1,2,1,4],[162,2,162,4],[8,2,8,4],[10,2,10,5],[12,2,12,5],[134,4,137,4],[132,2,132,4],[149,4,151,4],[142,4,144,4],[154,4,159,4]]}
[]
["Return to Contents",null,"D3: Epidemiological, Demographic, and Service/Program Data "]
[]
[]
[null,null,"Clear this Worksheet of any data entered from a previous application of this Tool by pressing this button ……….."]
[]
[null,"Number of Areas included in study",null,{"$f":"+'D2 Scale'!I8","v":1},"  (taken from Worksheet 2)",null,null,null,null,"2.      Review the default assumptions in the dark green cells and change if necessary. But read Part Four of this Guide first.  Change the light green cells if the User is aware of differences among the Areas in specific variables."]
[]
{"$rows_left_out":211}
{"sheet":"D4 Prices","index":7,"n_rows":81,"n_cols":18,"rows_kept":81,"cut":false,"hidden":false,"merged":[[20,9,20,17],[21,13,21,17],[21,9,21,12],[10,2,10,8],[12,2,12,8],[14,2,14,8],[1,2,1,6],[70,2,70,4],[61,4,63,4],[48,4,50,4],[8,1,8,8]]}
[]
["Return to Contents",null,"D4: Prices (excluding salaries and \"fixed supplies\")"]
[]
[null,"Number of Areas included in study",null,{"$f":"+'D2 Scale'!I8","v":1}," (taken from Worksheet 2)"]
[]
[null,"Clear this Worksheet of any data entered from a previous application of this Tool by pressing this button ……….."]
[]
[]
{"$rows_left_out":74}
{"sheet":"W6with comments","index":8,"n_rows":94,"n_cols":18,"rows_kept":94,"cut":false,"hidden":true,"merged":[[54,7,55,7],[54,8,55,8],[54,9,54,14],[18,7,18,10],[18,11,18,14],[19,7,20,7],[19,8,20,8],[19,9,19,14],[53,7,53,10],[53,11,53,14]]}
[]
["worksheet 3"]
[null,null,"nighttime supervision"]
[null,null,"minimum staffing on a ward?"]
[null,null,"Maximum number of patients per junior staff member",null,"?",4]
[null,null,"Maximum number of patients per senior staff  member",null,"?",10]
[]
[null,null,"Shelf life of RUTF","months",null,24,null,null,null,{"$f":"+$F$8","v":24},24,24,24,24,24,24,24,24]
{"$rows_left_out":87}
{"sheet":"D5 Salaries","index":9,"n_rows":41,"n_cols":12,"rows_kept":41,"cut":false,"hidden":false,"merged":[[7,2,7,9],[30,2,30,3],[17,5,17,7],[9,2,9,9],[13,2,13,9],[11,2,11,9],[17,9,17,10]]}
[]
["Return to Contents",null,"D5: Salaries                      "]
[]
[]
[null,"Clear this Worksheet of any data entered from a previous application of this Tool by pressing this button ……….."]
[]
[]
[null,1,"Identify the kinds of staff responsible for the activities described in the second column of this Table and RECORD their titles in the third column of the Table."]
{"$rows_left_out":34}
{"sheet":"D6 Fixed Supplies","index":10,"n_rows":121,"n_cols":17,"rows_kept":121,"cut":false,"hidden":false,"merged":[[29,8,29,11],[29,12,29,15],[1,2,1,11],[9,2,9,15],[11,2,11,15],[19,2,19,15],[15,2,15,15],[75,8,76,8],[75,9,76,9],[75,10,75,15],[30,10,30,15],[74,8,74,11],[74,12,74,15],[30,9,31,9],[30,8,31,8]]}
[]
["Return to Contents",null,"D6: Fixed Supplies (for Outpatient Care and Inpatient Care sites)"]
[]
[]
[null,null,"Clear this Worksheet of any data entered from a previous application of this Tool by pressing this button ……….."]
[]
[]
[null,"TABLE 1   (Outpatient Care sites)"]
{"$rows_left_out":114}
{"sheet":"D7 Frequency Food Deliveries","index":11,"n_rows":75,"n_cols":10,"rows_kept":75,"cut":false,"hidden":false,"merged":[[1,2,1,9],[22,2,22,3],[8,1,8,6],[33,2,33,3],[20,4,20,6],[12,2,12,7],[10,2,10,7],[20,1,20,3],[6,1,6,6]]}
[]
["Return to Contents",null,"D7: Frequency of Therapeutic Food Deliveries"]
[]
[null,"Clear this Worksheet of any data entered from a previous application of this Tool by pressing this button ……….."]
[]
[]
[null,"The data provided by you in Worksheet D1 (on the number of Areas and Group-Areas and the number of budget years) will generate the appropriately-sized table in this Worksheet (D7). Make sure you have completed Worksheet D1 before trying to fill in the present Worksheet. "]
[]
{"$rows_left_out":68}
{"sheet":"D8 Group-Area & Central Level ","index":12,"n_rows":54,"n_cols":15,"rows_kept":54,"cut":false,"hidden":false,"merged":[[1,2,1,4],[20,5,21,5],[20,2,21,2],[20,3,21,3],[20,4,21,4],[11,2,11,10],[9,2,9,10],[7,2,7,10]]}
[]
["Return to Contents",null,"D8: Group-Area- and Central-Level Statistics"]
[]
[]
[null,null,"Clear this Worksheet of any data entered from a previous application of this Tool by pressing this button ……….."]
[]
[]
[null,1,"COMPLETE the variables in the Table below that require data from the User (gold-colored cells indicated by u).  "]
{"$rows_left_out":47}
{"sheet":"D9 Time-dependent","index":13,"n_rows":73,"n_cols":21,"rows_kept":73,"cut":false,"hidden":false,"merged":[[7,11,7,17],[9,11,9,17],[55,2,56,2],[53,2,54,2],[24,9,24,17],[14,2,14,5],[25,4,27,4],[49,2,51,2],[1,2,1,3],[15,2,15,5],[11,2,11,5],[7,1,7,5],[9,2,9,6],[5,2,5,5],[13,2,13,5]]}
[]
["Return to Contents",null,"D9: Time-Dependent Variables"]
[]
["to be hidden","Number of years you wish to budget for",null,{"$f":"+'D2 Scale'!I7-1","v":1},"  (taken from Worksheet  D2)"]
["to be hidden",null,"Number of Areas included in the study",{"$f":"+'D2 Scale'!I8","v":1},"  (taken from Worksheet 2)"]
["to be hidden",null,"Necessary when made adjustment to W\" Scope and introduced an extra pre-budget year (to void having to re-write all formulas in this and other tables)",null,null,null,{"$f":"+I10+1","v":2},"i.e.",{"$f":"+C22","v":2011}]
[]
[null,"Only one value is entered by the User in this Worksheet. The rest of the Worksheet records the values (for the chosen year) of those key variables that change over time. "]
{"$rows_left_out":66}
{"sheet":"Reminder about Results","index":14,"n_rows":7,"n_cols":2,"rows_kept":7,"cut":false,"hidden":false,"merged":[]}
[]
[null,"Reminder about Results Worksheets [R1 through R14]"]
[null,"The following worksheets (R1 to R14) present the results."]
[]
[null,"The User should NOT change any of the cells in these results worksheets. If the User identifies variables whose value needs to be changed, that change must be made where the variable first appears (Worksheets D1 to D9)."]
[]
[null,"The following four Worksheets summarize the quantity of key inputs, namely, manpower (R1), transport (R2), supplies (R3), and space (R4), required  in the year specified in Worksheet D9 to mount a CMAM program of the scale defined in Worksheet D2. "]

{"sheet":"R1 Manpower","index":15,"n_rows":96,"n_cols":19,"rows_kept":96,"cut":false,"hidden":false,"merged":[[13,10,13,18],[11,5,12,5],[4,2,4,9]]}
[]
["Return to Contents",null,"R1: Annual Manpower Requirements for CMAM"]
[]
[null,null,"Number of Areas included ",{"$f":"+'D2 Scale'!$I$8","v":1},"  (taken from Worksheet 2)"]
[null,null,"This Worksheet shows for the year chosen the amount of manpower required to implement CMAM. One FTE (Full-Time Equivalent) is equal to a year's work (i.e., about 260 days)."]
[]
[null,null,{"$f":"+IF('D1 Background'!$H$11=\"\",\"\",'D1 Background'!$H$11)","v":"Ghana"}]
[null,null,{"$f":"+'D9 Time-dependent'!$I$6","v":2011}]
{"$rows_left_out":89}
{"sheet":"R2 Transport","index":16,"n_rows":33,"n_cols":18,"rows_kept":33,"cut":false,"hidden":false,"merged":[[10,4,11,4],[4,2,4,8]]}
[]
["Return to Contents",null,"R2: Annual Transport Requirements for CMAM"]
[]
[null,null,"Number of Areas included ",{"$f":"+'D2 Scale'!I8","v":1},null,"  (taken from Worksheet 2)"]
[null,null,"This Worksheet shows (for the year chosen) the distances travelled transporting supplies and persons to implement CMAM. "]
[]
[null,null,{"$f":"+IF('D1 Background'!$H$11=\"\",\"\",'D1 Background'!$H$11)","v":"Ghana"}]
[null,null,{"$f":"+'D9 Time-dependent'!$I$6","v":2011}]
{"$rows_left_out":26}
{"sheet":"R3 Supplies","index":17,"n_rows":82,"n_cols":19,"rows_kept":82,"cut":false,"hidden":false,"merged":[[58,4,61,4],[12,5,13,5],[5,2,5,9],[44,1,44,2]]}
[]
["Return to Contents",null,"R3: Annual Supply Requirements for CMAM"]
[]
[]
[null,null,"Number of Areas included ",{"$f":"+'D2 Scale'!$I$8","v":1},"  (taken from Worksheet 2)"]
[null,null,"This Worksheet shows (for the year chosen) the quantities of supplies required to implement CMAM."]
[]
[null,null,null,null,null,null,{"$f":"+IF('D1 Background'!$G$31<1,0,1)","v":1},null,null,null,{"$f":"+IF('D1 Background'!$G$31<2,0,1)","v":0},{"$f":"+IF('D1 Background'!$G$31<3,0,1)","v":0},{"$f":"+IF('D1 Background'!$G$31<4,0,1)","v":0},{"$f":"+IF('D1 Background'!$G$31<5,0,1)","v":0},{"$f":"+IF('D1 Background'!$G$31<6,0,1)","v":0},{"$f":"+IF('D1 Background'!$G$31<7,0,1)","v":0},{"$f":"+IF('D1 Background'!$G$31<8,0,1)","v":0},{"$f":"+IF('D1 Background'!$G$31<9,0,1)","v":0},{"$f":"+IF('D1 Background'!$G$31<10,0,1)","v":0}]
{"$rows_left_out":75}
{"sheet":"R4 Space","index":18,"n_rows":39,"n_cols":18,"rows_kept":39,"cut":false,"hidden":false,"merged":[[11,4,12,4],[4,2,4,8]]}
[]
["Return to Contents",null,"R4: Annual Space Requirements for CMAM"]
[]
[null,null,"Number of Areas included ",{"$f":"+'D2 Scale'!$I$8","v":1},"  (taken from Worksheet 2)"]
[null,null,"This Worksheet shows (for the year chosen) the amount of space required to implement CMAM."]
[]
[null,null,null,null,null,{"$f":"+IF('D1 Background'!$G$31<1,0,1)","v":1},null,null,null,{"$f":"+IF('D1 Background'!$G$31<2,0,1)","v":0},{"$f":"+IF('D1 Background'!$G$31<3,0,1)","v":0},{"$f":"+IF('D1 Background'!$G$31<4,0,1)","v":0},{"$f":"+IF('D1 Background'!$G$31<5,0,1)","v":0},{"$f":"+IF('D1 Background'!$G$31<6,0,1)","v":0},{"$f":"+IF('D1 Background'!$G$31<7,0,1)","v":0},{"$f":"+IF('D1 Background'!$G$31<8,0,1)","v":0},{"$f":"+IF('D1 Background'!$G$31<9,0,1)","v":0},{"$f":"+IF('D1 Background'!$G$31<10,0,1)","v":0}]
[null,null,{"$f":"+IF('D1 Background'!$H$11=\"\",\"\",'D1 Background'!$H$11)","v":"Ghana"}]
{"$rows_left_out":32}
{"sheet":"R5 Financial Summary","index":19,"n_rows":37,"n_cols":18,"rows_kept":37,"cut":false,"hidden":false,"merged":[[1,2,1,4],[3,2,3,8],[8,5,8,15],[9,10,9,11],[9,12,9,14],[9,5,9,9],[10,17,12,17],[10,16,12,16],[10,15,12,15],[47,2,47,4],[11,2,12,2],[11,3,12,3],[13,3,13,4]]}
[]
["Return to Contents",null,"R5: Financial Summary"]
[]
[null,null,"This Worksheet shows (for the year chosen) the financial cost to implement CMAM. It is broken down by Area and by types of activities. A direct link is provided to those worksheets that are the source of the data."]
[]
[]
[null,null,null,"Hidden factors to prevent inclusion of non-Areas",null,{"$f":"+IF('D1 Background'!$G$31<1,0,1)","v":1},{"$f":"+IF('D1 Background'!$G$31<2,0,1)","v":0},{"$f":"+IF('D1 Background'!$G$31<3,0,1)","v":0},{"$f":"+IF('D1 Background'!$G$31<4,0,1)","v":0},{"$f":"+IF('D1 Background'!$G$31<5,0,1)","v":0},{"$f":"+IF('D1 Background'!$G$31<6,0,1)","v":0},{"$f":"+IF('D1 Background'!$G$31<7,0,1)","v":0},{"$f":"+IF('D1 Background'!$G$31<8,0,1)","v":0},{"$f":"+IF('D1 Background'!$G$31<9,0,1)","v":0},{"$f":"+IF('D1 Background'!$G$31<10,0,1)","v":0}]
[null,null,{"$f":"+IF('D1 Background'!$H$11=\"\",\"\",'D1 Background'!$H$11)","v":"Ghana"}]
{"$rows_left_out":30}
{"sheet":"R6 Group-Area & Central Level","index":20,"n_rows":155,"n_cols":24,"rows_kept":155,"cut":false,"hidden":false,"merged":[[75,18,76,18],[76,14,77,14],[76,15,77,15],[75,16,76,16],[75,17,76,17],[11,17,11,18],[12,17,12,18],[12,6,12,16],[13,6,13,13],[13,16,14,16],[13,14,14,14],[13,15,14,15],[13,17,14,17],[13,18,14,18],[147,3,148,3],[49,3,50,3],[1,2,1,5],[3,2,3,7],[5,2,5,7],[79,4,88,4]]}
[]
["Return to Contents",null,"R6: Group-Area and Central Level Management of CMAM"]
[null,null,null,null,null,null,null,null,null,null,null,null,null,null,null,null,null,null,null,null,null,"Important hidden columns DO NOT DELETE"]
[null,null,"This Worksheet shows (for the year chosen) the quantities of inputs required at the Area, Group-Area, and Central level (for management, training, and transport and storage of therapeutic food) to implement CMAM and the costs of this."]
[]
[null,null,"See below for workings showing how figures are calculated."]
[]
[null,null,null," FTE = Full-Time Equivalent "]
{"$rows_left_out":148}
{"sheet":"R7 Area HQ Management","index":21,"n_rows":82,"n_cols":18,"rows_kept":82,"cut":false,"hidden":false,"merged":[[64,2,64,5],[24,0,31,0],[1,2,1,4],[5,2,5,7],[7,2,7,7],[16,0,22,0],[57,2,57,5],[15,4,15,5],[25,4,25,5]]}
[]
["Return to Contents",null,"R7: Area HQ Management of CMAM"]
[]
[]
[null,null,"Number of Areas included ",{"$f":"+'D2 Scale'!$I$8","v":1},"  (taken from Worksheet W2)",null,null,null,"hide"]
[null,null,"This Worksheet shows (for the year chosen) the quantities of inputs (mostly manpower) required to manage the CMAM service/program at Area HQ, and the costs of this. "]
[]
[null,null,"See below for workings showing how figures are calculated."]
{"$rows_left_out":75}
{"sheet":"R8 Treatment (manpower&space)","index":22,"n_rows":135,"n_cols":18,"rows_kept":135,"cut":false,"hidden":false,"merged":[[15,4,15,5],[30,4,30,5],[16,0,27,0],[1,2,1,4],[29,0,36,0],[4,2,4,5]]}
[]
["Return to Contents",null,"R8: Treatment (Manpower and Space)"]
[]
[null,null,"Number of Areas included ",{"$f":"+'D2 Scale'!$I$8","v":1},"  (taken from Worksheet W2)"]
[null,null,"This Worksheet shows (for the year chosen) the quantities of manpower required for treatment in CMAM, and the costs of this. "]
[]
[null,null,"See below for workings showing how figures are calculated."]
[]
{"$rows_left_out":128}
{"sheet":"R9 Treatment(medical supplies) ","index":23,"n_rows":91,"n_cols":30,"rows_kept":91,"cut":false,"hidden":false,"merged":[[55,28,55,29],[55,24,55,25],[55,12,55,13],[55,20,55,21],[55,22,55,23],[55,26,55,27],[55,16,55,17],[55,14,55,15],[55,18,55,19],[73,1,74,1],[73,2,74,2],[87,4,87,6],[85,4,85,6],[80,4,80,6],[79,4,79,6],[84,4,84,6],[83,4,83,6],[114,4,114,5],[113,4,113,5],[81,4,81,6],[82,4,82,6],[89,4,89,6],[90,4,90,6],[86,4,86,6],[88,4,88,6],[1,2,1,6],[4,2,4,8],[3,1,3,2],[23,2,23,4],[14,6,14,7],[9,2,9,3],[10,2,10,3],[11,9,12,9],[69,1,70,1],[26,6,26,7],[55,7,55,8],[67,5,68,5],[64,2,64,3],[67,2,68,2],[67,1,68,1],[69,2,70,2],[71,2,72,2],[13,0,23,0],[63,2,63,3],[62,2,62,3],[58,2,59,2],[25,0,39,0],[58,1,59,1],[71,1,72,1]]}
[]
["Return to Contents",null,"R9: Treatment (Medical Supplies)"]
[]
[null,"Number of Areas included ",null,{"$f":"+'D2 Scale'!I8","v":1},"  (taken from Worksheet 2)"]
[null,null,"This Worksheet shows (for the year chosen) the quantities of medical supplies required for case management (i.e., treatment), and the costs of these inputs. "]
[]
[null,null,"See below for workings showing how figures are calculated."]
[]
{"$rows_left_out":84}
{"sheet":"R10 Treatment (other supplies)","index":24,"n_rows":113,"n_cols":26,"rows_kept":113,"cut":false,"hidden":false,"merged":[[16,0,22,0],[25,0,41,0],[1,2,1,3],[23,2,23,5],[3,2,3,6]]}
[]
["Return to Contents",null,"R10: Treatment (other Supplies)"]
[]
[null,null,"This Worksheet shows (for the year chosen) the quantities of non-medical supplies required for case management (i.e., treatment) in CMAM, and the costs of these inputs. "]
[]
[null,null,"See below for workings showing how figures are calculated."]
[null,null,"Number of Areas included ",{"$f":"+'D2 Scale'!$I$8","v":1},"  (taken from Worksheet 2)",null,null,null,"hide"]
[]
{"$rows_left_out":106}
{"sheet":"R11 Supply Logistics","index":25,"n_rows":147,"n_cols":19,"rows_kept":147,"cut":false,"hidden":false,"merged":[[149,9,149,17],[51,2,51,4],[52,2,52,4],[53,2,53,4],[54,2,54,4],[55,2,55,4],[56,2,56,4],[51,0,56,0],[1,2,1,5],[15,0,21,0],[24,0,47,0],[22,2,22,4],[4,2,4,5]]}
[]
["Return to Contents",null,"R11: Supply Logistics (Transport and Storage)"]
[]
[null,null,"Number of Areas included ",{"$f":"+'D2 Scale'!$I$8","v":1},"  (taken from Worksheet W2)",null,"hide"]
[null,null,"This worksheet shows (for the year chosen) the quantities of the different inputs required to transport and store therapeutic food for CMAM (RUTF, F-75, and F-100), and the costs of these inputs. "]
[]
[null,null,"See below for workings showing how figures are calculated."]
[null,null,"FTE= Full-Time Equivalent"]
{"$rows_left_out":140}
{"sheet":"R12 Training","index":26,"n_rows":214,"n_cols":18,"rows_kept":214,"cut":false,"hidden":false,"merged":[[21,6,21,8],[3,2,3,8],[56,0,81,0],[15,0,52,0],[5,2,5,5]]}
[]
["Return to Contents",null,"R12: Training "]
[]
[null,null,"This Worksheet shows (for the year chosen) the quantities of the different inputs required to do Training for CMAM, and the costs of these inputs. "]
[]
[null,null,"See below for workings showing how figures are calculated."]
[null,null,"Number of Areas included ",{"$f":"+'D2 Scale'!$I$8","v":1},"  (taken from Worksheet W2)"]
[]
{"$rows_left_out":207}
{"sheet":"R13 Supervision","index":27,"n_rows":155,"n_cols":18,"rows_kept":155,"cut":false,"hidden":false,"merged":[[15,9,15,13],[15,14,15,17],[3,2,3,5],[15,0,29,0],[163,3,164,3],[32,0,49,0],[98,4,101,4]]}
[]
["Return to Contents",null,"R13: Supervision "]
[]
[null,null,"This Worksheet shows (for the year chosen) the quantities of the different inputs required to do Supervision for CMAM, and the costs of these inputs. "]
[]
[null,null,"See below for workings showing how figures are calculated."]
["Hide",null,"Number of Areas included ",{"$f":"+'D2 Scale'!$I$8","v":1},"  (taken from Worksheet 2)"]
[]
{"$rows_left_out":148}
{"sheet":"R14 Community Outreach","index":28,"n_rows":98,"n_cols":18,"rows_kept":98,"cut":false,"hidden":false,"merged":[[5,2,5,4],[14,0,23,0],[28,0,38,0],[3,2,3,5]]}
[]
["Return to Contents",null,"R14: Community Outreach",null,null,null,null,null,null,null,null,null,null,null,null," "]
[]
[null,null,"This Worksheet shows (for the year chosen) the quantities of the different inputs required to do Community Outreach for CMAM, and the costs of these inputs. "]
[]
[null,null,"See below for workings showing how figures are calculated."]
[null,null,"Number of Areas included ",{"$f":"+'D2 Scale'!$I$8","v":1},"  (taken from Worksheet W2)"]
[]
{"$rows_left_out":91}
{"sheet":"to be removed ","index":29,"n_rows":69,"n_cols":11,"rows_kept":69,"cut":false,"hidden":true,"merged":[[7,1,15,1],[5,4,5,7],[23,2,29,2],[13,8,15,8],[21,4,21,8],[13,2,15,2],[7,2,12,2]]}
[]
[]
[null,null,"Table showing the inputs and activities covered by each of the results worksheets. "]
[]
[]
[null,null,null,null," ----------------------- INPUTS ---------------------- "]
[null,null,null,null,"Manpower","Supplies","Transport","Space","Total "]
[null," ------------  ACTIVITIES  ---------------","Area Level and below","Community Outreach",null,null,null,null,"R14"]
{"$rows_left_out":61}